maven-notifications mailing list archives

Site index · List index
Message view « Date » · « Thread »
Top « Date » · « Thread »
From Apache Jenkins Server <jenk...@builds.apache.org>
Subject Build failed in Jenkins: maven-plugins #7001
Date Sat, 23 Jul 2016 09:56:34 GMT
See <https://builds.apache.org/job/maven-plugins/7001/>

------------------------------------------
Started by an SCM change
[EnvInject] - Loading node environment variables.
FATAL: java.io.IOException: Unexpected termination of the channel
hudson.remoting.RequestAbortedException: java.io.IOException: Unexpected termination of the
channel
	at hudson.remoting.Request.abort(Request.java:297)
	at hudson.remoting.Channel.terminate(Channel.java:847)
	at hudson.remoting.SynchronousCommandTransport$ReaderThread.run(SynchronousCommandTransport.java:69)
	at ......remote call to ubuntu-us1(Native Method)
	at hudson.remoting.Channel.attachCallSiteStackTrace(Channel.java:1416)
	at hudson.remoting.Request.call(Request.java:172)
	at hudson.remoting.Channel.call(Channel.java:780)
	at hudson.FilePath.act(FilePath.java:1074)
	at org.jenkinsci.plugins.envinject.service.EnvInjectActionSetter.addEnvVarsToEnvInjectBuildAction(EnvInjectActionSetter.java:36)
	at org.jenkinsci.plugins.envinject.EnvInjectListener.loadEnvironmentVariablesNode(EnvInjectListener.java:84)
	at org.jenkinsci.plugins.envinject.EnvInjectListener.setUpEnvironment(EnvInjectListener.java:39)
	at hudson.model.AbstractBuild$AbstractBuildExecution.createLauncher(AbstractBuild.java:572)
	at hudson.model.AbstractBuild$AbstractBuildExecution.run(AbstractBuild.java:492)
	at hudson.model.Run.execute(Run.java:1738)
	at hudson.maven.MavenModuleSetBuild.run(MavenModuleSetBuild.java:531)
	at hudson.model.ResourceController.execute(ResourceController.java:98)
	at hudson.model.Executor.run(Executor.java:410)
Caused by: java.io.IOException: Unexpected termination of the channel
	at hudson.remoting.SynchronousCommandTransport$ReaderThread.run(SynchronousCommandTransport.java:50)
Caused by: java.io.EOFException
	at java.io.ObjectInputStream$PeekInputStream.readFully(ObjectInputStream.java:2325)
	at java.io.ObjectInputStream$BlockDataInputStream.readShort(ObjectInputStream.java:2794)
	at java.io.ObjectInputStream.readStreamHeader(ObjectInputStream.java:801)
	at java.io.ObjectInputStream.<init>(ObjectInputStream.java:299)
	at hudson.remoting.ObjectInputStreamEx.<init>(ObjectInputStreamEx.java:48)
	at hudson.remoting.AbstractSynchronousByteArrayCommandTransport.read(AbstractSynchronousByteArrayCommandTransport.java:34)
	at hudson.remoting.SynchronousCommandTransport$ReaderThread.run(SynchronousCommandTransport.java:48)
ERROR: Step ‘Scan for compiler warnings’ failed: no workspace for maven-plugins #7001
ERROR: ubuntu-us1 is offline; cannot locate latest1.7
ERROR: ubuntu-us1 is offline; cannot locate maven-3.1.1


Mime
View raw message