maven-notifications mailing list archives

Site index · List index
Message view « Date » · « Thread »
Top « Date » · « Thread »
From Apache Jenkins Server <jenk...@builds.apache.org>
Subject Build failed in Jenkins: maven-plugins #6933
Date Mon, 11 Jul 2016 23:14:11 GMT
See <https://builds.apache.org/job/maven-plugins/6933/>

------------------------------------------
[...truncated 28723 lines...]
[INFO] Apache Maven Documentation Checker Plugin ......... SUCCESS [5.187s]
[INFO] Apache Maven EAR Plugin ........................... SUCCESS [9.749s]
[INFO] Apache Maven EJB Plugin ........................... SUCCESS [13.360s]
[INFO] Apache Maven Help Plugin .......................... SUCCESS [7.906s]
[INFO] Apache Maven Install Plugin ....................... SUCCESS [12.140s]
[INFO] Apache Maven Jarsigner Plugin ..................... SUCCESS [7.915s]
[INFO] Apache Maven Javadoc Plugin ....................... SUCCESS [1:58.627s]
[INFO] Apache Maven JDeps Plugin ......................... SUCCESS [5.983s]
[INFO] Apache Maven Linkcheck Plugin ..................... SUCCESS [9.998s]
[INFO] Apache Maven Patch Plugin ......................... SUCCESS [2.532s]
[INFO] Apache Maven PDF Plugin ........................... SUCCESS [16.911s]
[INFO] Apache Maven RAR Plugin ........................... SUCCESS [23.653s]
[INFO] Apache Maven Repository Plugin .................... SUCCESS [9.630s]
[INFO] Apache Maven Resources Plugin ..................... SUCCESS [15.492s]
[INFO] Apache Maven Site Plugin .......................... SUCCESS [17.911s]
[INFO] Apache Maven Source Plugin ........................ SUCCESS [8.006s]
[INFO] Apache Maven Stage Plugin ......................... SUCCESS [7.650s]
[INFO] Apache Maven Toolchains Plugin .................... SUCCESS [3.065s]
[INFO] Apache Maven Verifier Plugin ...................... SUCCESS [5.489s]
[INFO] Apache Maven WAR Plugin ........................... SUCCESS [20.158s]
[INFO] Apache Maven DOAP Plugin .......................... SUCCESS [11.421s]
[INFO] Apache Maven PMD Plugin ........................... SUCCESS [21.733s]
[INFO] Apache Maven Invoker Plugin ....................... SUCCESS [31.347s]
[INFO] Apache Maven JAR Plugin ........................... SUCCESS [7.671s]
[INFO] Apache Maven Checkstyle Plugin .................... SUCCESS [24.886s]
[INFO] Apache Maven Project Info Reports Plugin .......... SUCCESS [33.803s]
[INFO] Apache Maven Remote Resources Plugin .............. SUCCESS [11.774s]
[INFO] Apache Maven Shade Plugin ......................... SUCCESS [11.764s]
[INFO] Apache Maven SCM Publish Plugin ................... SUCCESS [14.596s]
[INFO] Apache Maven Assembly Plugin ...................... FAILURE [5.587s]
[INFO] Apache Maven Dependency Plugin .................... FAILURE [4.719s]
[INFO] Apache Maven GPG Plugin ........................... SUCCESS [3.160s]
[INFO] Apache Maven Plugins Aggregator ................... SUCCESS [1.213s]
[INFO] ------------------------------------------------------------------------
[INFO] BUILD FAILURE
[INFO] ------------------------------------------------------------------------
[INFO] Total time: 13:17.785s
[INFO] Finished at: Mon Jul 11 23:13:37 UTC 2016
[INFO] Final Memory: 142M/860M
[INFO] ------------------------------------------------------------------------
[ERROR] Failed to execute goal org.apache.maven.plugins:maven-compiler-plugin:3.5.1:compile
(default-compile) on project maven-assembly-plugin: Compilation failure
[ERROR] <https://builds.apache.org/job/maven-plugins/ws/maven-assembly-plugin/src/main/java/org/apache/maven/plugins/assembly/artifact/DefaultDependencyResolver.java>:[347,43]
no suitable method found for resolveDependencies(org.apache.maven.project.ProjectBuildingRequest,org.apache.maven.shared.project.DefaultProjectCoordinate,org.apache.maven.shared.artifact.filter.resolve.ScopeFilter)
[ERROR] method org.apache.maven.shared.dependencies.resolve.DependencyResolver.resolveDependencies(org.apache.maven.project.ProjectBuildingRequest,java.util.Collection<org.apache.maven.model.Dependency>,java.util.Collection<org.apache.maven.model.Dependency>,org.apache.maven.shared.artifact.filter.resolve.TransformableFilter)
is not applicable
[ERROR] (actual and formal argument lists differ in length)
[ERROR] method org.apache.maven.shared.dependencies.resolve.DependencyResolver.resolveDependencies(org.apache.maven.project.ProjectBuildingRequest,org.apache.maven.model.Model,org.apache.maven.shared.artifact.filter.resolve.TransformableFilter)
is not applicable
[ERROR] (actual argument org.apache.maven.shared.project.DefaultProjectCoordinate cannot be
converted to org.apache.maven.model.Model by method invocation conversion)
[ERROR] method org.apache.maven.shared.dependencies.resolve.DependencyResolver.resolveDependencies(org.apache.maven.project.ProjectBuildingRequest,org.apache.maven.shared.dependencies.DependableCoordinate,org.apache.maven.shared.artifact.filter.resolve.TransformableFilter)
is not applicable
[ERROR] (actual argument org.apache.maven.shared.project.DefaultProjectCoordinate cannot be
converted to org.apache.maven.shared.dependencies.DependableCoordinate by method invocation
conversion)
[ERROR] -> [Help 1]
org.apache.maven.lifecycle.LifecycleExecutionException: Failed to execute goal org.apache.maven.plugins:maven-compiler-plugin:3.5.1:compile
(default-compile) on project maven-assembly-plugin: Compilation failure
<https://builds.apache.org/job/maven-plugins/ws/maven-assembly-plugin/src/main/java/org/apache/maven/plugins/assembly/artifact/DefaultDependencyResolver.java>:[347,43]
no suitable method found for resolveDependencies(org.apache.maven.project.ProjectBuildingRequest,org.apache.maven.shared.project.DefaultProjectCoordinate,org.apache.maven.shared.artifact.filter.resolve.ScopeFilter)
    method org.apache.maven.shared.dependencies.resolve.DependencyResolver.resolveDependencies(org.apache.maven.project.ProjectBuildingRequest,java.util.Collection<org.apache.maven.model.Dependency>,java.util.Collection<org.apache.maven.model.Dependency>,org.apache.maven.shared.artifact.filter.resolve.TransformableFilter)
is not applicable
      (actual and formal argument lists differ in length)
    method org.apache.maven.shared.dependencies.resolve.DependencyResolver.resolveDependencies(org.apache.maven.project.ProjectBuildingRequest,org.apache.maven.model.Model,org.apache.maven.shared.artifact.filter.resolve.TransformableFilter)
is not applicable
      (actual argument org.apache.maven.shared.project.DefaultProjectCoordinate cannot be
converted to org.apache.maven.model.Model by method invocation conversion)
    method org.apache.maven.shared.dependencies.resolve.DependencyResolver.resolveDependencies(org.apache.maven.project.ProjectBuildingRequest,org.apache.maven.shared.dependencies.DependableCoordinate,org.apache.maven.shared.artifact.filter.resolve.TransformableFilter)
is not applicable
      (actual argument org.apache.maven.shared.project.DefaultProjectCoordinate cannot be
converted to org.apache.maven.shared.dependencies.DependableCoordinate by method invocation
conversion)

	at org.apache.maven.lifecycle.internal.MojoExecutor.execute(MojoExecutor.java:212)
	at org.apache.maven.lifecycle.internal.MojoExecutor.execute(MojoExecutor.java:153)
	at org.apache.maven.lifecycle.internal.MojoExecutor.execute(MojoExecutor.java:145)
	at org.apache.maven.lifecycle.internal.LifecycleModuleBuilder.buildProject(LifecycleModuleBuilder.java:84)
	at org.apache.maven.lifecycle.internal.LifecycleModuleBuilder.buildProject(LifecycleModuleBuilder.java:59)
	at org.apache.maven.lifecycle.internal.LifecycleStarter.singleThreadedBuild(LifecycleStarter.java:183)
	at org.apache.maven.lifecycle.internal.LifecycleStarter.execute(LifecycleStarter.java:161)
	at org.apache.maven.DefaultMaven.doExecute(DefaultMaven.java:317)
	at org.apache.maven.DefaultMaven.execute(DefaultMaven.java:152)
	at org.jvnet.hudson.maven3.launcher.Maven31Launcher.main(Maven31Launcher.java:132)
	at sun.reflect.NativeMethodAccessorImpl.invoke0(Native Method)
	at sun.reflect.NativeMethodAccessorImpl.invoke(NativeMethodAccessorImpl.java:57)
	at sun.reflect.DelegatingMethodAccessorImpl.invoke(DelegatingMethodAccessorImpl.java:43)
	at java.lang.reflect.Method.invoke(Method.java:606)
	at org.codehaus.plexus.classworlds.launcher.Launcher.launchStandard(Launcher.java:330)
	at org.codehaus.plexus.classworlds.launcher.Launcher.launch(Launcher.java:238)
	at jenkins.maven3.agent.Maven31Main.launch(Maven31Main.java:185)
	at sun.reflect.NativeMethodAccessorImpl.invoke0(Native Method)
	at sun.reflect.NativeMethodAccessorImpl.invoke(NativeMethodAccessorImpl.java:57)
	at sun.reflect.DelegatingMethodAccessorImpl.invoke(DelegatingMethodAccessorImpl.java:43)
	at java.lang.reflect.Method.invoke(Method.java:606)
	at hudson.maven.Maven3Builder.call(Maven3Builder.java:136)
	at hudson.maven.Maven3Builder.call(Maven3Builder.java:71)
	at hudson.remoting.UserRequest.perform(UserRequest.java:120)
	at hudson.remoting.UserRequest.perform(UserRequest.java:48)
	at hudson.remoting.Request$2.run(Request.java:326)
	at hudson.remoting.InterceptingExecutorService$1.call(InterceptingExecutorService.java:68)
	at java.util.concurrent.FutureTask.run(FutureTask.java:262)
	at java.util.concurrent.ThreadPoolExecutor.runWorker(ThreadPoolExecutor.java:1145)
	at java.util.concurrent.ThreadPoolExecutor$Worker.run(ThreadPoolExecutor.java:615)
	at java.lang.Thread.run(Thread.java:745)
Caused by: org.apache.maven.plugin.compiler.CompilationFailureException: Compilation failure
<https://builds.apache.org/job/maven-plugins/ws/maven-assembly-plugin/src/main/java/org/apache/maven/plugins/assembly/artifact/DefaultDependencyResolver.java>:[347,43]
no suitable method found for resolveDependencies(org.apache.maven.project.ProjectBuildingRequest,org.apache.maven.shared.project.DefaultProjectCoordinate,org.apache.maven.shared.artifact.filter.resolve.ScopeFilter)
    method org.apache.maven.shared.dependencies.resolve.DependencyResolver.resolveDependencies(org.apache.maven.project.ProjectBuildingRequest,java.util.Collection<org.apache.maven.model.Dependency>,java.util.Collection<org.apache.maven.model.Dependency>,org.apache.maven.shared.artifact.filter.resolve.TransformableFilter)
is not applicable
      (actual and formal argument lists differ in length)
    method org.apache.maven.shared.dependencies.resolve.DependencyResolver.resolveDependencies(org.apache.maven.project.ProjectBuildingRequest,org.apache.maven.model.Model,org.apache.maven.shared.artifact.filter.resolve.TransformableFilter)
is not applicable
      (actual argument org.apache.maven.shared.project.DefaultProjectCoordinate cannot be
converted to org.apache.maven.model.Model by method invocation conversion)
    method org.apache.maven.shared.dependencies.resolve.DependencyResolver.resolveDependencies(org.apache.maven.project.ProjectBuildingRequest,org.apache.maven.shared.dependencies.DependableCoordinate,org.apache.maven.shared.artifact.filter.resolve.TransformableFilter)
is not applicable
      (actual argument org.apache.maven.shared.project.DefaultProjectCoordinate cannot be
converted to org.apache.maven.shared.dependencies.DependableCoordinate by method invocation
conversion)

	at org.apache.maven.plugin.compiler.AbstractCompilerMojo.execute(AbstractCompilerMojo.java:972)
	at org.apache.maven.plugin.compiler.CompilerMojo.execute(CompilerMojo.java:129)
	at org.apache.maven.plugin.DefaultBuildPluginManager.executeMojo(DefaultBuildPluginManager.java:106)
	at org.apache.maven.lifecycle.internal.MojoExecutor.execute(MojoExecutor.java:208)
	... 30 more
[ERROR] Failed to execute goal org.apache.maven.plugins:maven-compiler-plugin:3.2:compile
(default-compile) on project maven-dependency-plugin: Compilation failure: Compilation failure:
[ERROR] <https://builds.apache.org/job/maven-plugins/ws/maven-dependency-plugin/src/main/java/org/apache/maven/plugins/dependency/PurgeLocalRepositoryMojo.java>:[498,35]
no suitable method found for resolveDependencies(org.apache.maven.project.ProjectBuildingRequest,org.apache.maven.shared.project.DefaultProjectCoordinate,org.apache.maven.shared.artifact.filter.resolve.TransformableFilter)
[ERROR] method org.apache.maven.shared.dependencies.resolve.DependencyResolver.resolveDependencies(org.apache.maven.project.ProjectBuildingRequest,java.util.Collection<org.apache.maven.model.Dependency>,java.util.Collection<org.apache.maven.model.Dependency>,org.apache.maven.shared.artifact.filter.resolve.TransformableFilter)
is not applicable
[ERROR] (actual and formal argument lists differ in length)
[ERROR] method org.apache.maven.shared.dependencies.resolve.DependencyResolver.resolveDependencies(org.apache.maven.project.ProjectBuildingRequest,org.apache.maven.model.Model,org.apache.maven.shared.artifact.filter.resolve.TransformableFilter)
is not applicable
[ERROR] (actual argument org.apache.maven.shared.project.DefaultProjectCoordinate cannot be
converted to org.apache.maven.model.Model by method invocation conversion)
[ERROR] method org.apache.maven.shared.dependencies.resolve.DependencyResolver.resolveDependencies(org.apache.maven.project.ProjectBuildingRequest,org.apache.maven.shared.dependencies.DependableCoordinate,org.apache.maven.shared.artifact.filter.resolve.TransformableFilter)
is not applicable
[ERROR] (actual argument org.apache.maven.shared.project.DefaultProjectCoordinate cannot be
converted to org.apache.maven.shared.dependencies.DependableCoordinate by method invocation
conversion)
[ERROR] <https://builds.apache.org/job/maven-plugins/ws/maven-dependency-plugin/src/main/java/org/apache/maven/plugins/dependency/resolvers/ListRepositoriesMojo.java>:[69,36]
no suitable method found for collectDependencies(org.apache.maven.project.ProjectBuildingRequest,org.apache.maven.shared.project.DefaultProjectCoordinate)
[ERROR] method org.apache.maven.shared.dependencies.collect.DependencyCollector.collectDependencies(org.apache.maven.project.ProjectBuildingRequest,org.apache.maven.model.Model)
is not applicable
[ERROR] (actual argument org.apache.maven.shared.project.DefaultProjectCoordinate cannot be
converted to org.apache.maven.model.Model by method invocation conversion)
[ERROR] method org.apache.maven.shared.dependencies.collect.DependencyCollector.collectDependencies(org.apache.maven.project.ProjectBuildingRequest,org.apache.maven.shared.dependencies.DependableCoordinate)
is not applicable
[ERROR] (actual argument org.apache.maven.shared.project.DefaultProjectCoordinate cannot be
converted to org.apache.maven.shared.dependencies.DependableCoordinate by method invocation
conversion)
[ERROR] method org.apache.maven.shared.dependencies.collect.DependencyCollector.collectDependencies(org.apache.maven.project.ProjectBuildingRequest,org.apache.maven.model.Dependency)
is not applicable
[ERROR] (actual argument org.apache.maven.shared.project.DefaultProjectCoordinate cannot be
converted to org.apache.maven.model.Dependency by method invocation conversion)
[ERROR] -> [Help 1]
org.apache.maven.lifecycle.LifecycleExecutionException: Failed to execute goal org.apache.maven.plugins:maven-compiler-plugin:3.2:compile
(default-compile) on project maven-dependency-plugin: Compilation failure
	at org.apache.maven.lifecycle.internal.MojoExecutor.execute(MojoExecutor.java:212)
	at org.apache.maven.lifecycle.internal.MojoExecutor.execute(MojoExecutor.java:153)
	at org.apache.maven.lifecycle.internal.MojoExecutor.execute(MojoExecutor.java:145)
	at org.apache.maven.lifecycle.internal.LifecycleModuleBuilder.buildProject(LifecycleModuleBuilder.java:84)
	at org.apache.maven.lifecycle.internal.LifecycleModuleBuilder.buildProject(LifecycleModuleBuilder.java:59)
	at org.apache.maven.lifecycle.internal.LifecycleStarter.singleThreadedBuild(LifecycleStarter.java:183)
	at org.apache.maven.lifecycle.internal.LifecycleStarter.execute(LifecycleStarter.java:161)
	at org.apache.maven.DefaultMaven.doExecute(DefaultMaven.java:317)
	at org.apache.maven.DefaultMaven.execute(DefaultMaven.java:152)
	at org.jvnet.hudson.maven3.launcher.Maven31Launcher.main(Maven31Launcher.java:132)
	at sun.reflect.NativeMethodAccessorImpl.invoke0(Native Method)
	at sun.reflect.NativeMethodAccessorImpl.invoke(NativeMethodAccessorImpl.java:57)
	at sun.reflect.DelegatingMethodAccessorImpl.invoke(DelegatingMethodAccessorImpl.java:43)
	at java.lang.reflect.Method.invoke(Method.java:606)
	at org.codehaus.plexus.classworlds.launcher.Launcher.launchStandard(Launcher.java:330)
	at org.codehaus.plexus.classworlds.launcher.Launcher.launch(Launcher.java:238)
	at jenkins.maven3.agent.Maven31Main.launch(Maven31Main.java:185)
	at sun.reflect.NativeMethodAccessorImpl.invoke0(Native Method)
	at sun.reflect.NativeMethodAccessorImpl.invoke(NativeMethodAccessorImpl.java:57)
	at sun.reflect.DelegatingMethodAccessorImpl.invoke(DelegatingMethodAccessorImpl.java:43)
	at java.lang.reflect.Method.invoke(Method.java:606)
	at hudson.maven.Maven3Builder.call(Maven3Builder.java:136)
	at hudson.maven.Maven3Builder.call(Maven3Builder.java:71)
	at hudson.remoting.UserRequest.perform(UserRequest.java:120)
	at hudson.remoting.UserRequest.perform(UserRequest.java:48)
	at hudson.remoting.Request$2.run(Request.java:326)
	at hudson.remoting.InterceptingExecutorService$1.call(InterceptingExecutorService.java:68)
	at java.util.concurrent.FutureTask.run(FutureTask.java:262)
	at java.util.concurrent.ThreadPoolExecutor.runWorker(ThreadPoolExecutor.java:1145)
	at java.util.concurrent.ThreadPoolExecutor$Worker.run(ThreadPoolExecutor.java:615)
	at java.lang.Thread.run(Thread.java:745)
Caused by: org.apache.maven.plugin.compiler.CompilationFailureException: Compilation failure
	at org.apache.maven.plugin.compiler.AbstractCompilerMojo.execute(AbstractCompilerMojo.java:909)
	at org.apache.maven.plugin.compiler.CompilerMojo.execute(CompilerMojo.java:129)
	at org.apache.maven.plugin.DefaultBuildPluginManager.executeMojo(DefaultBuildPluginManager.java:106)
	at org.apache.maven.lifecycle.internal.MojoExecutor.execute(MojoExecutor.java:208)
	... 30 more
[ERROR] 
[ERROR] Re-run Maven using the -X switch to enable full debug logging.
[ERROR] 
[ERROR] For more information about the errors and possible solutions, please read the following
articles:
[ERROR] [Help 1] http://cwiki.apache.org/confluence/display/MAVEN/MojoFailureException
[ERROR] 
[ERROR] After correcting the problems, you can resume the build with the command
[ERROR]   mvn <goals> -rf :maven-assembly-plugin
[JENKINS] Archiving <https://builds.apache.org/job/maven-plugins/ws/maven-scm-publish-plugin/pom.xml>
to org.apache.maven.plugins/maven-scm-publish-plugin/1.2-SNAPSHOT/maven-scm-publish-plugin-1.2-SNAPSHOT.pom
[JENKINS] Archiving <https://builds.apache.org/job/maven-plugins/ws/maven-scm-publish-plugin/target/maven-scm-publish-plugin-1.2-SNAPSHOT.jar>
to org.apache.maven.plugins/maven-scm-publish-plugin/1.2-SNAPSHOT/maven-scm-publish-plugin-1.2-SNAPSHOT.jar
[JENKINS] Archiving <https://builds.apache.org/job/maven-plugins/ws/maven-linkcheck-plugin/pom.xml>
to org.apache.maven.plugins/maven-linkcheck-plugin/1.3-SNAPSHOT/maven-linkcheck-plugin-1.3-SNAPSHOT.pom
[JENKINS] Archiving <https://builds.apache.org/job/maven-plugins/ws/maven-linkcheck-plugin/target/maven-linkcheck-plugin-1.3-SNAPSHOT.jar>
to org.apache.maven.plugins/maven-linkcheck-plugin/1.3-SNAPSHOT/maven-linkcheck-plugin-1.3-SNAPSHOT.jar
[JENKINS] Archiving <https://builds.apache.org/job/maven-plugins/ws/maven-changes-plugin/pom.xml>
to org.apache.maven.plugins/maven-changes-plugin/2.13-SNAPSHOT/maven-changes-plugin-2.13-SNAPSHOT.pom
[JENKINS] Archiving <https://builds.apache.org/job/maven-plugins/ws/maven-changes-plugin/target/maven-changes-plugin-2.13-SNAPSHOT.jar>
to org.apache.maven.plugins/maven-changes-plugin/2.13-SNAPSHOT/maven-changes-plugin-2.13-SNAPSHOT.jar
[JENKINS] Archiving <https://builds.apache.org/job/maven-plugins/ws/maven-gpg-plugin/pom.xml>
to org.apache.maven.plugins/maven-gpg-plugin/1.7-SNAPSHOT/maven-gpg-plugin-1.7-SNAPSHOT.pom
[JENKINS] Archiving <https://builds.apache.org/job/maven-plugins/ws/maven-gpg-plugin/target/maven-gpg-plugin-1.7-SNAPSHOT.jar>
to org.apache.maven.plugins/maven-gpg-plugin/1.7-SNAPSHOT/maven-gpg-plugin-1.7-SNAPSHOT.jar
[JENKINS] Archiving <https://builds.apache.org/job/maven-plugins/ws/maven-ear-plugin/pom.xml>
to org.apache.maven.plugins/maven-ear-plugin/2.10.2-SNAPSHOT/maven-ear-plugin-2.10.2-SNAPSHOT.pom
[JENKINS] Archiving <https://builds.apache.org/job/maven-plugins/ws/maven-ear-plugin/target/maven-ear-plugin-2.10.2-SNAPSHOT.jar>
to org.apache.maven.plugins/maven-ear-plugin/2.10.2-SNAPSHOT/maven-ear-plugin-2.10.2-SNAPSHOT.jar
[JENKINS] Archiving <https://builds.apache.org/job/maven-plugins/ws/maven-pdf-plugin/pom.xml>
to org.apache.maven.plugins/maven-pdf-plugin/1.4-SNAPSHOT/maven-pdf-plugin-1.4-SNAPSHOT.pom
[JENKINS] Archiving <https://builds.apache.org/job/maven-plugins/ws/maven-pdf-plugin/target/maven-pdf-plugin-1.4-SNAPSHOT.jar>
to org.apache.maven.plugins/maven-pdf-plugin/1.4-SNAPSHOT/maven-pdf-plugin-1.4-SNAPSHOT.jar
[JENKINS] Archiving <https://builds.apache.org/job/maven-plugins/ws/maven-help-plugin/pom.xml>
to org.apache.maven.plugins/maven-help-plugin/2.2.1-SNAPSHOT/maven-help-plugin-2.2.1-SNAPSHOT.pom
[JENKINS] Archiving <https://builds.apache.org/job/maven-plugins/ws/maven-help-plugin/target/maven-help-plugin-2.2.1-SNAPSHOT.jar>
to org.apache.maven.plugins/maven-help-plugin/2.2.1-SNAPSHOT/maven-help-plugin-2.2.1-SNAPSHOT.jar
[JENKINS] Archiving <https://builds.apache.org/job/maven-plugins/ws/maven-patch-plugin/pom.xml>
to org.apache.maven.plugins/maven-patch-plugin/1.3-SNAPSHOT/maven-patch-plugin-1.3-SNAPSHOT.pom
[JENKINS] Archiving <https://builds.apache.org/job/maven-plugins/ws/maven-patch-plugin/target/maven-patch-plugin-1.3-SNAPSHOT.jar>
to org.apache.maven.plugins/maven-patch-plugin/1.3-SNAPSHOT/maven-patch-plugin-1.3-SNAPSHOT.jar
[JENKINS] Archiving <https://builds.apache.org/job/maven-plugins/ws/maven-site-plugin/dependency-reduced-pom.xml>
to org.apache.maven.plugins/maven-site-plugin/3.6-SNAPSHOT/maven-site-plugin-3.6-SNAPSHOT.pom
[JENKINS] Archiving <https://builds.apache.org/job/maven-plugins/ws/maven-site-plugin/target/maven-site-plugin-3.6-SNAPSHOT.jar>
to org.apache.maven.plugins/maven-site-plugin/3.6-SNAPSHOT/maven-site-plugin-3.6-SNAPSHOT.jar
[JENKINS] Archiving <https://builds.apache.org/job/maven-plugins/ws/maven-docck-plugin/pom.xml>
to org.apache.maven.plugins/maven-docck-plugin/1.2-SNAPSHOT/maven-docck-plugin-1.2-SNAPSHOT.pom
[JENKINS] Archiving <https://builds.apache.org/job/maven-plugins/ws/maven-docck-plugin/target/maven-docck-plugin-1.2-SNAPSHOT.jar>
to org.apache.maven.plugins/maven-docck-plugin/1.2-SNAPSHOT/maven-docck-plugin-1.2-SNAPSHOT.jar
[JENKINS] Archiving <https://builds.apache.org/job/maven-plugins/ws/maven-rar-plugin/pom.xml>
to org.apache.maven.plugins/maven-rar-plugin/3.0.0-SNAPSHOT/maven-rar-plugin-3.0.0-SNAPSHOT.pom
[JENKINS] Archiving <https://builds.apache.org/job/maven-plugins/ws/maven-rar-plugin/target/maven-rar-plugin-3.0.0-SNAPSHOT.jar>
to org.apache.maven.plugins/maven-rar-plugin/3.0.0-SNAPSHOT/maven-rar-plugin-3.0.0-SNAPSHOT.jar
[JENKINS] Archiving <https://builds.apache.org/job/maven-plugins/ws/maven-verifier-plugin/pom.xml>
to org.apache.maven.plugins/maven-verifier-plugin/3.0.0-SNAPSHOT/maven-verifier-plugin-3.0.0-SNAPSHOT.pom
[JENKINS] Archiving <https://builds.apache.org/job/maven-plugins/ws/maven-verifier-plugin/target/maven-verifier-plugin-3.0.0-SNAPSHOT.jar>
to org.apache.maven.plugins/maven-verifier-plugin/3.0.0-SNAPSHOT/maven-verifier-plugin-3.0.0-SNAPSHOT.jar
[JENKINS] Archiving <https://builds.apache.org/job/maven-plugins/ws/maven-jar-plugin/pom.xml>
to org.apache.maven.plugins/maven-jar-plugin/3.0.3-SNAPSHOT/maven-jar-plugin-3.0.3-SNAPSHOT.pom
[JENKINS] Archiving <https://builds.apache.org/job/maven-plugins/ws/maven-jar-plugin/target/maven-jar-plugin-3.0.3-SNAPSHOT.jar>
to org.apache.maven.plugins/maven-jar-plugin/3.0.3-SNAPSHOT/maven-jar-plugin-3.0.3-SNAPSHOT.jar
[JENKINS] Archiving <https://builds.apache.org/job/maven-plugins/ws/maven-changelog-plugin/pom.xml>
to org.apache.maven.plugins/maven-changelog-plugin/2.4-SNAPSHOT/maven-changelog-plugin-2.4-SNAPSHOT.pom
[JENKINS] Archiving <https://builds.apache.org/job/maven-plugins/ws/maven-changelog-plugin/target/maven-changelog-plugin-2.4-SNAPSHOT.jar>
to org.apache.maven.plugins/maven-changelog-plugin/2.4-SNAPSHOT/maven-changelog-plugin-2.4-SNAPSHOT.jar
[JENKINS] Archiving <https://builds.apache.org/job/maven-plugins/ws/maven-invoker-plugin/pom.xml>
to org.apache.maven.plugins/maven-invoker-plugin/3.0.0-SNAPSHOT/maven-invoker-plugin-3.0.0-SNAPSHOT.pom
[JENKINS] Archiving <https://builds.apache.org/job/maven-plugins/ws/maven-invoker-plugin/target/maven-invoker-plugin-3.0.0-SNAPSHOT.jar>
to org.apache.maven.plugins/maven-invoker-plugin/3.0.0-SNAPSHOT/maven-invoker-plugin-3.0.0-SNAPSHOT.jar
[JENKINS] Archiving <https://builds.apache.org/job/maven-plugins/ws/maven-jarsigner-plugin/pom.xml>
to org.apache.maven.plugins/maven-jarsigner-plugin/1.5-SNAPSHOT/maven-jarsigner-plugin-1.5-SNAPSHOT.pom
[JENKINS] Archiving <https://builds.apache.org/job/maven-plugins/ws/maven-jarsigner-plugin/target/maven-jarsigner-plugin-1.5-SNAPSHOT.jar>
to org.apache.maven.plugins/maven-jarsigner-plugin/1.5-SNAPSHOT/maven-jarsigner-plugin-1.5-SNAPSHOT.jar
[JENKINS] Archiving <https://builds.apache.org/job/maven-plugins/ws/maven-repository-plugin/pom.xml>
to org.apache.maven.plugins/maven-repository-plugin/2.5-SNAPSHOT/maven-repository-plugin-2.5-SNAPSHOT.pom
[JENKINS] Archiving <https://builds.apache.org/job/maven-plugins/ws/maven-repository-plugin/target/maven-repository-plugin-2.5-SNAPSHOT.jar>
to org.apache.maven.plugins/maven-repository-plugin/2.5-SNAPSHOT/maven-repository-plugin-2.5-SNAPSHOT.jar
[JENKINS] Archiving <https://builds.apache.org/job/maven-plugins/ws/maven-remote-resources-plugin/pom.xml>
to org.apache.maven.plugins/maven-remote-resources-plugin/1.6-SNAPSHOT/maven-remote-resources-plugin-1.6-SNAPSHOT.pom
[JENKINS] Archiving <https://builds.apache.org/job/maven-plugins/ws/maven-remote-resources-plugin/target/maven-remote-resources-plugin-1.6-SNAPSHOT.jar>
to org.apache.maven.plugins/maven-remote-resources-plugin/1.6-SNAPSHOT/maven-remote-resources-plugin-1.6-SNAPSHOT.jar
[JENKINS] Archiving <https://builds.apache.org/job/maven-plugins/ws/maven-deploy-plugin/pom.xml>
to org.apache.maven.plugins/maven-deploy-plugin/3.0.0-SNAPSHOT/maven-deploy-plugin-3.0.0-SNAPSHOT.pom
[JENKINS] Archiving <https://builds.apache.org/job/maven-plugins/ws/maven-deploy-plugin/target/maven-deploy-plugin-3.0.0-SNAPSHOT.jar>
to org.apache.maven.plugins/maven-deploy-plugin/3.0.0-SNAPSHOT/maven-deploy-plugin-3.0.0-SNAPSHOT.jar
[JENKINS] Archiving <https://builds.apache.org/job/maven-plugins/ws/maven-compiler-plugin/pom.xml>
to org.apache.maven.plugins/maven-compiler-plugin/3.6-SNAPSHOT/maven-compiler-plugin-3.6-SNAPSHOT.pom
[JENKINS] Archiving <https://builds.apache.org/job/maven-plugins/ws/maven-compiler-plugin/target/maven-compiler-plugin-3.6-SNAPSHOT.jar>
to org.apache.maven.plugins/maven-compiler-plugin/3.6-SNAPSHOT/maven-compiler-plugin-3.6-SNAPSHOT.jar
[JENKINS] Archiving <https://builds.apache.org/job/maven-plugins/ws/maven-antrun-plugin/pom.xml>
to org.apache.maven.plugins/maven-antrun-plugin/1.9-SNAPSHOT/maven-antrun-plugin-1.9-SNAPSHOT.pom
[JENKINS] Archiving <https://builds.apache.org/job/maven-plugins/ws/maven-antrun-plugin/target/maven-antrun-plugin-1.9-SNAPSHOT.jar>
to org.apache.maven.plugins/maven-antrun-plugin/1.9-SNAPSHOT/maven-antrun-plugin-1.9-SNAPSHOT.jar
[JENKINS] Archiving <https://builds.apache.org/job/maven-plugins/ws/maven-ant-plugin/pom.xml>
to org.apache.maven.plugins/maven-ant-plugin/2.5-SNAPSHOT/maven-ant-plugin-2.5-SNAPSHOT.pom
[JENKINS] Archiving <https://builds.apache.org/job/maven-plugins/ws/maven-ant-plugin/target/maven-ant-plugin-2.5-SNAPSHOT.jar>
to org.apache.maven.plugins/maven-ant-plugin/2.5-SNAPSHOT/maven-ant-plugin-2.5-SNAPSHOT.jar
[JENKINS] Archiving <https://builds.apache.org/job/maven-plugins/ws/maven-resources-plugin/pom.xml>
to org.apache.maven.plugins/maven-resources-plugin/3.0.2-SNAPSHOT/maven-resources-plugin-3.0.2-SNAPSHOT.pom
[JENKINS] Archiving <https://builds.apache.org/job/maven-plugins/ws/maven-resources-plugin/target/maven-resources-plugin-3.0.2-SNAPSHOT.jar>
to org.apache.maven.plugins/maven-resources-plugin/3.0.2-SNAPSHOT/maven-resources-plugin-3.0.2-SNAPSHOT.jar
[JENKINS] Archiving <https://builds.apache.org/job/maven-plugins/ws/maven-pmd-plugin/pom.xml>
to org.apache.maven.plugins/maven-pmd-plugin/3.7-SNAPSHOT/maven-pmd-plugin-3.7-SNAPSHOT.pom
[JENKINS] Archiving <https://builds.apache.org/job/maven-plugins/ws/maven-pmd-plugin/target/maven-pmd-plugin-3.7-SNAPSHOT.jar>
to org.apache.maven.plugins/maven-pmd-plugin/3.7-SNAPSHOT/maven-pmd-plugin-3.7-SNAPSHOT.jar
[JENKINS] Archiving <https://builds.apache.org/job/maven-plugins/ws/maven-acr-plugin/pom.xml>
to org.apache.maven.plugins/maven-acr-plugin/3.0.1-SNAPSHOT/maven-acr-plugin-3.0.1-SNAPSHOT.pom
[JENKINS] Archiving <https://builds.apache.org/job/maven-plugins/ws/maven-acr-plugin/target/maven-acr-plugin-3.0.1-SNAPSHOT.jar>
to org.apache.maven.plugins/maven-acr-plugin/3.0.1-SNAPSHOT/maven-acr-plugin-3.0.1-SNAPSHOT.jar
[JENKINS] Archiving <https://builds.apache.org/job/maven-plugins/ws/maven-project-info-reports-plugin/pom.xml>
to org.apache.maven.plugins/maven-project-info-reports-plugin/2.10-SNAPSHOT/maven-project-info-reports-plugin-2.10-SNAPSHOT.pom
[JENKINS] Archiving <https://builds.apache.org/job/maven-plugins/ws/maven-project-info-reports-plugin/target/maven-project-info-reports-plugin-2.10-SNAPSHOT.jar>
to org.apache.maven.plugins/maven-project-info-reports-plugin/2.10-SNAPSHOT/maven-project-info-reports-plugin-2.10-SNAPSHOT.jar
[JENKINS] Archiving <https://builds.apache.org/job/maven-plugins/ws/maven-toolchains-plugin/pom.xml>
to org.apache.maven.plugins/maven-toolchains-plugin/3.0.0-SNAPSHOT/maven-toolchains-plugin-3.0.0-SNAPSHOT.pom
[JENKINS] Archiving <https://builds.apache.org/job/maven-plugins/ws/maven-toolchains-plugin/target/maven-toolchains-plugin-3.0.0-SNAPSHOT.jar>
to org.apache.maven.plugins/maven-toolchains-plugin/3.0.0-SNAPSHOT/maven-toolchains-plugin-3.0.0-SNAPSHOT.jar
[JENKINS] Archiving <https://builds.apache.org/job/maven-plugins/ws/pom.xml> to org.apache.maven.plugins/maven-plugins-aggregator/1-SNAPSHOT/maven-plugins-aggregator-1-SNAPSHOT.pom
[JENKINS] Archiving <https://builds.apache.org/job/maven-plugins/ws/maven-dependency-plugin/pom.xml>
to org.apache.maven.plugins/maven-dependency-plugin/3.0.0-SNAPSHOT/maven-dependency-plugin-3.0.0-SNAPSHOT.pom
[JENKINS] Archiving <https://builds.apache.org/job/maven-plugins/ws/maven-clean-plugin/pom.xml>
to org.apache.maven.plugins/maven-clean-plugin/3.0.1-SNAPSHOT/maven-clean-plugin-3.0.1-SNAPSHOT.pom
[JENKINS] Archiving <https://builds.apache.org/job/maven-plugins/ws/maven-clean-plugin/target/maven-clean-plugin-3.0.1-SNAPSHOT.jar>
to org.apache.maven.plugins/maven-clean-plugin/3.0.1-SNAPSHOT/maven-clean-plugin-3.0.1-SNAPSHOT.jar
[JENKINS] Archiving <https://builds.apache.org/job/maven-plugins/ws/maven-jdeps-plugin/pom.xml>
to org.apache.maven.plugins/maven-jdeps-plugin/3.0.1-SNAPSHOT/maven-jdeps-plugin-3.0.1-SNAPSHOT.pom
[JENKINS] Archiving <https://builds.apache.org/job/maven-plugins/ws/maven-jdeps-plugin/target/maven-jdeps-plugin-3.0.1-SNAPSHOT.jar>
to org.apache.maven.plugins/maven-jdeps-plugin/3.0.1-SNAPSHOT/maven-jdeps-plugin-3.0.1-SNAPSHOT.jar
[JENKINS] Archiving <https://builds.apache.org/job/maven-plugins/ws/maven-doap-plugin/pom.xml>
to org.apache.maven.plugins/maven-doap-plugin/1.3-SNAPSHOT/maven-doap-plugin-1.3-SNAPSHOT.pom
[JENKINS] Archiving <https://builds.apache.org/job/maven-plugins/ws/maven-doap-plugin/target/maven-doap-plugin-1.3-SNAPSHOT.jar>
to org.apache.maven.plugins/maven-doap-plugin/1.3-SNAPSHOT/maven-doap-plugin-1.3-SNAPSHOT.jar
[JENKINS] Archiving <https://builds.apache.org/job/maven-plugins/ws/maven-war-plugin/pom.xml>
to org.apache.maven.plugins/maven-war-plugin/3.0.0-SNAPSHOT/maven-war-plugin-3.0.0-SNAPSHOT.pom
[JENKINS] Archiving <https://builds.apache.org/job/maven-plugins/ws/maven-war-plugin/target/maven-war-plugin-3.0.0-SNAPSHOT.jar>
to org.apache.maven.plugins/maven-war-plugin/3.0.0-SNAPSHOT/maven-war-plugin-3.0.0-SNAPSHOT.jar
[JENKINS] Archiving <https://builds.apache.org/job/maven-plugins/ws/maven-checkstyle-plugin/pom.xml>
to org.apache.maven.plugins/maven-checkstyle-plugin/2.18-SNAPSHOT/maven-checkstyle-plugin-2.18-SNAPSHOT.pom
[JENKINS] Archiving <https://builds.apache.org/job/maven-plugins/ws/maven-checkstyle-plugin/target/maven-checkstyle-plugin-2.18-SNAPSHOT.jar>
to org.apache.maven.plugins/maven-checkstyle-plugin/2.18-SNAPSHOT/maven-checkstyle-plugin-2.18-SNAPSHOT.jar
[JENKINS] Archiving <https://builds.apache.org/job/maven-plugins/ws/maven-ejb-plugin/pom.xml>
to org.apache.maven.plugins/maven-ejb-plugin/2.5.2-SNAPSHOT/maven-ejb-plugin-2.5.2-SNAPSHOT.pom
[JENKINS] Archiving <https://builds.apache.org/job/maven-plugins/ws/maven-ejb-plugin/target/maven-ejb-plugin-2.5.2-SNAPSHOT.jar>
to org.apache.maven.plugins/maven-ejb-plugin/2.5.2-SNAPSHOT/maven-ejb-plugin-2.5.2-SNAPSHOT.jar
[JENKINS] Archiving <https://builds.apache.org/job/maven-plugins/ws/maven-shade-plugin/pom.xml>
to org.apache.maven.plugins/maven-shade-plugin/3.0.0-SNAPSHOT/maven-shade-plugin-3.0.0-SNAPSHOT.pom
[JENKINS] Archiving <https://builds.apache.org/job/maven-plugins/ws/maven-shade-plugin/target/maven-shade-plugin-3.0.0-SNAPSHOT.jar>
to org.apache.maven.plugins/maven-shade-plugin/3.0.0-SNAPSHOT/maven-shade-plugin-3.0.0-SNAPSHOT.jar
[JENKINS] Archiving <https://builds.apache.org/job/maven-plugins/ws/maven-stage-plugin/pom.xml>
to org.apache.maven.plugins/maven-stage-plugin/1.1-SNAPSHOT/maven-stage-plugin-1.1-SNAPSHOT.pom
[JENKINS] Archiving <https://builds.apache.org/job/maven-plugins/ws/maven-stage-plugin/target/maven-stage-plugin-1.1-SNAPSHOT.jar>
to org.apache.maven.plugins/maven-stage-plugin/1.1-SNAPSHOT/maven-stage-plugin-1.1-SNAPSHOT.jar
[JENKINS] Archiving <https://builds.apache.org/job/maven-plugins/ws/maven-javadoc-plugin/pom.xml>
to org.apache.maven.plugins/maven-javadoc-plugin/3.0.0-SNAPSHOT/maven-javadoc-plugin-3.0.0-SNAPSHOT.pom
[JENKINS] Archiving <https://builds.apache.org/job/maven-plugins/ws/maven-javadoc-plugin/target/maven-javadoc-plugin-3.0.0-SNAPSHOT.jar>
to org.apache.maven.plugins/maven-javadoc-plugin/3.0.0-SNAPSHOT/maven-javadoc-plugin-3.0.0-SNAPSHOT.jar
Compressed 409.22 KB of artifacts by 39.1% relative to #6932
[JENKINS] Archiving <https://builds.apache.org/job/maven-plugins/ws/maven-assembly-plugin/pom.xml>
to org.apache.maven.plugins/maven-assembly-plugin/3.0.0-SNAPSHOT/maven-assembly-plugin-3.0.0-SNAPSHOT.pom
[JENKINS] Archiving <https://builds.apache.org/job/maven-plugins/ws/maven-source-plugin/pom.xml>
to org.apache.maven.plugins/maven-source-plugin/3.0.2-SNAPSHOT/maven-source-plugin-3.0.2-SNAPSHOT.pom
[JENKINS] Archiving <https://builds.apache.org/job/maven-plugins/ws/maven-source-plugin/target/maven-source-plugin-3.0.2-SNAPSHOT.jar>
to org.apache.maven.plugins/maven-source-plugin/3.0.2-SNAPSHOT/maven-source-plugin-3.0.2-SNAPSHOT.jar
[JENKINS] Archiving <https://builds.apache.org/job/maven-plugins/ws/maven-install-plugin/pom.xml>
to org.apache.maven.plugins/maven-install-plugin/3.0.0-SNAPSHOT/maven-install-plugin-3.0.0-SNAPSHOT.pom
[JENKINS] Archiving <https://builds.apache.org/job/maven-plugins/ws/maven-install-plugin/target/maven-install-plugin-3.0.0-SNAPSHOT.jar>
to org.apache.maven.plugins/maven-install-plugin/3.0.0-SNAPSHOT/maven-install-plugin-3.0.0-SNAPSHOT.jar
Sending e-mails to: notifications@maven.apache.org
Sending e-mails to: notifications@maven.apache.org
channel stopped
[WARNINGS] Skipping publisher since build result is FAILURE

Mime
View raw message