maven-notifications mailing list archives

Site index · List index
Message view « Date » · « Thread »
Top « Date » · « Thread »
From Apache Jenkins Server <jenk...@builds.apache.org>
Subject Build failed in Jenkins: maven-plugins-ITs-m3 #2433
Date Tue, 07 Jun 2016 17:49:43 GMT
See <https://builds.apache.org/job/maven-plugins-ITs-m3/2433/changes>

Changes:

[Robert Scholte] [MJAVADOC-355] Encoding problem if platform encoding used to run Maven is
different from default platform encoding.
revert r1720609 and r1720589

[Robert Scholte] [MJAVADOC-384] Allow whitespace in javadoc exclude list
missed a class

------------------------------------------
[...truncated 31530 lines...]
[INFO] --- maven-enforcer-plugin:1.3.1:enforce (enforce-bytecode-version) @ maven-gpg-plugin
---
[INFO] 
[INFO] --- maven-enforcer-plugin:1.3.1:enforce (ban-known-bad-maven-versions) @ maven-gpg-plugin
---
[INFO] 
[INFO] --- maven-enforcer-plugin:1.3.1:enforce (ensure-no-container-api) @ maven-gpg-plugin
---
[INFO] 
[INFO] --- apache-rat-plugin:0.11:check (rat-check) @ maven-gpg-plugin ---
[INFO] 51 implicit excludes (use -debug for more details).
[INFO] Exclude: src/test/resources/gnupg/*
[INFO] Exclude: DEPENDENCIES
[INFO] 66 resources included (use -debug for more details)
[INFO] Rat check: Summary of files. Unapproved: 0 unknown: 0 generated: 0 approved: 54 licence.
[INFO] 
[INFO] --- maven-plugin-plugin:3.4:helpmojo (generate-helpmojo) @ maven-gpg-plugin ---
[INFO] Using 'UTF-8' encoding to read mojo metadata.
[INFO] Mojo extractor with id: java-annotations found 0 mojo descriptors.
[INFO] Mojo extractor with id: java-javadoc found 0 mojo descriptors.
[INFO] 
[INFO] --- maven-remote-resources-plugin:1.5:process (default) @ maven-gpg-plugin ---
[INFO] 
[INFO] --- maven-resources-plugin:2.7:resources (default-resources) @ maven-gpg-plugin ---
[INFO] Using 'UTF-8' encoding to copy filtered resources.
[INFO] Copying 1 resource
[INFO] Copying 3 resources
[INFO] 
[INFO] --- maven-compiler-plugin:3.2:compile (default-compile) @ maven-gpg-plugin ---
[INFO] Changes detected - recompiling the module!
[INFO] Compiling 9 source files to <https://builds.apache.org/job/maven-plugins-ITs-m3/ws/maven-gpg-plugin/target/classes>
[INFO] <https://builds.apache.org/job/maven-plugins-ITs-m3/ws/maven-gpg-plugin/src/main/java/org/apache/maven/plugin/gpg/AttachedSignedArtifact.java>:
Some input files use unchecked or unsafe operations.
[INFO] <https://builds.apache.org/job/maven-plugins-ITs-m3/ws/maven-gpg-plugin/src/main/java/org/apache/maven/plugin/gpg/AttachedSignedArtifact.java>:
Recompile with -Xlint:unchecked for details.
[INFO] 
[INFO] --- maven-plugin-plugin:3.4:descriptor (default-descriptor) @ maven-gpg-plugin ---
[INFO] Using 'UTF-8' encoding to read mojo metadata.
[INFO] Mojo extractor with id: java-annotations found 3 mojo descriptors.
[INFO] Mojo extractor with id: java-javadoc found 0 mojo descriptors.
[INFO] 
[INFO] --- maven-resources-plugin:2.7:testResources (default-testResources) @ maven-gpg-plugin
---
[INFO] Using 'UTF-8' encoding to copy filtered resources.
[INFO] Copying 8 resources
[INFO] Copying 3 resources
[INFO] 
[INFO] --- maven-compiler-plugin:3.2:testCompile (default-testCompile) @ maven-gpg-plugin
---
[INFO] No sources to compile
[INFO] 
[INFO] --- maven-surefire-plugin:2.18.1:test (default-test) @ maven-gpg-plugin ---
[INFO] 
[INFO] --- maven-jar-plugin:2.5:jar (default-jar) @ maven-gpg-plugin ---
[INFO] Building jar: <https://builds.apache.org/job/maven-plugins-ITs-m3/ws/maven-gpg-plugin/target/maven-gpg-plugin-1.7-SNAPSHOT.jar>
[INFO] 
[INFO] --- maven-plugin-plugin:3.4:addPluginArtifactMetadata (default-addPluginArtifactMetadata)
@ maven-gpg-plugin ---
[INFO] 
[INFO] --- maven-invoker-plugin:2.0.0:install (integration-test) @ maven-gpg-plugin ---
[INFO] Installing <https://builds.apache.org/job/maven-plugins-ITs-m3/ws/maven-acr-plugin/pom.xml>
to <https://builds.apache.org/job/maven-plugins-ITs-m3/ws/maven-gpg-plugin/target/local-repo/org/apache/maven/plugins/maven-acr-plugin/3.0.1-SNAPSHOT/maven-acr-plugin-3.0.1-SNAPSHOT.pom>
[INFO] Installing <https://builds.apache.org/job/maven-plugins-ITs-m3/ws/maven-acr-plugin/target/maven-acr-plugin-3.0.1-SNAPSHOT.jar>
to <https://builds.apache.org/job/maven-plugins-ITs-m3/ws/maven-gpg-plugin/target/local-repo/org/apache/maven/plugins/maven-acr-plugin/3.0.1-SNAPSHOT/maven-acr-plugin-3.0.1-SNAPSHOT.jar>
[INFO] Installing <https://builds.apache.org/job/maven-plugins-ITs-m3/ws/maven-acr-plugin/pom.xml>
to <https://builds.apache.org/job/maven-plugins-ITs-m3/ws/maven-gpg-plugin/target/local-repo/org/apache/maven/plugins/maven-acr-plugin/3.0.1-SNAPSHOT/maven-acr-plugin-3.0.1-SNAPSHOT.pom>
[INFO] Installing <https://builds.apache.org/job/maven-plugins-ITs-m3/ws/maven-ant-plugin/pom.xml>
to <https://builds.apache.org/job/maven-plugins-ITs-m3/ws/maven-gpg-plugin/target/local-repo/org/apache/maven/plugins/maven-ant-plugin/2.5-SNAPSHOT/maven-ant-plugin-2.5-SNAPSHOT.pom>
[INFO]                                                                         
[INFO] ------------------------------------------------------------------------
[INFO] Building Apache Maven Plugins Aggregator 1-SNAPSHOT
[INFO] ------------------------------------------------------------------------
[INFO] Downloading: http://repo.maven.apache.org/maven2/org/apache/maven/plugins/maven-site-plugin/3.3/maven-site-plugin-3.3.pom
[INFO] Downloaded: http://repo.maven.apache.org/maven2/org/apache/maven/plugins/maven-site-plugin/3.3/maven-site-plugin-3.3.pom
(21 KB at 1016.3 KB/sec)
[INFO] Downloading: http://repo.maven.apache.org/maven2/org/apache/maven/plugins/maven-site-plugin/3.3/maven-site-plugin-3.3.jar
[INFO] Downloaded: http://repo.maven.apache.org/maven2/org/apache/maven/plugins/maven-site-plugin/3.3/maven-site-plugin-3.3.jar
(122 KB at 5783.0 KB/sec)
[INFO] Downloading: http://repo.maven.apache.org/maven2/org/apache/maven/plugins/maven-install-plugin/2.5.1/maven-install-plugin-2.5.1.pom
[INFO] Downloaded: http://repo.maven.apache.org/maven2/org/apache/maven/plugins/maven-install-plugin/2.5.1/maven-install-plugin-2.5.1.pom
(8 KB at 192.3 KB/sec)
[INFO] Downloading: http://repo.maven.apache.org/maven2/org/apache/maven/plugins/maven-install-plugin/2.5.1/maven-install-plugin-2.5.1.jar
[INFO] Downloaded: http://repo.maven.apache.org/maven2/org/apache/maven/plugins/maven-install-plugin/2.5.1/maven-install-plugin-2.5.1.jar
(33 KB at 1784.1 KB/sec)
[INFO] 
[INFO] --- maven-clean-plugin:2.5:clean (default-clean) @ maven-plugins-aggregator ---
[INFO] 
[INFO] --- maven-enforcer-plugin:1.3.1:enforce (enforce-bytecode-version) @ maven-plugins-aggregator
---
[INFO] Downloading: http://repo.maven.apache.org/maven2/org/codehaus/mojo/extra-enforcer-rules/1.0-beta-2/extra-enforcer-rules-1.0-beta-2.pom
[INFO] Downloaded: http://repo.maven.apache.org/maven2/org/codehaus/mojo/extra-enforcer-rules/1.0-beta-2/extra-enforcer-rules-1.0-beta-2.pom
(7 KB at 361.7 KB/sec)
[INFO] Downloading: http://repo.maven.apache.org/maven2/org/codehaus/mojo/extra-enforcer-rules/1.0-beta-2/extra-enforcer-rules-1.0-beta-2.jar
[INFO] Downloaded: http://repo.maven.apache.org/maven2/org/codehaus/mojo/extra-enforcer-rules/1.0-beta-2/extra-enforcer-rules-1.0-beta-2.jar
(30 KB at 1497.5 KB/sec)
[INFO] 
[INFO] --- maven-enforcer-plugin:1.3.1:enforce (ban-known-bad-maven-versions) @ maven-plugins-aggregator
---
[INFO] 
[INFO] --- maven-remote-resources-plugin:1.5:process (default) @ maven-plugins-aggregator
---
[INFO] 
[INFO] --- maven-site-plugin:3.3:attach-descriptor (attach-descriptor) @ maven-plugins-aggregator
---
[INFO] Downloading: http://repo.maven.apache.org/maven2/org/apache/maven/reporting/maven-reporting-exec/1.1/maven-reporting-exec-1.1.pom
[INFO] Downloaded: http://repo.maven.apache.org/maven2/org/apache/maven/reporting/maven-reporting-exec/1.1/maven-reporting-exec-1.1.pom
(11 KB at 563.2 KB/sec)
[INFO] Downloading: http://repo.maven.apache.org/maven2/org/apache/maven/maven-archiver/2.4.2/maven-archiver-2.4.2.pom
[INFO] Downloaded: http://repo.maven.apache.org/maven2/org/apache/maven/maven-archiver/2.4.2/maven-archiver-2.4.2.pom
(4 KB at 218.2 KB/sec)
[INFO] Downloading: http://repo.maven.apache.org/maven2/org/codehaus/plexus/plexus-archiver/2.0.1/plexus-archiver-2.0.1.pom
[INFO] Downloaded: http://repo.maven.apache.org/maven2/org/codehaus/plexus/plexus-archiver/2.0.1/plexus-archiver-2.0.1.pom
(3 KB at 152.5 KB/sec)
[INFO] Downloading: http://repo.maven.apache.org/maven2/org/codehaus/plexus/plexus-io/2.0.1/plexus-io-2.0.1.pom
[INFO] Downloaded: http://repo.maven.apache.org/maven2/org/codehaus/plexus/plexus-io/2.0.1/plexus-io-2.0.1.pom
(2 KB at 92.4 KB/sec)
[INFO] Downloading: http://repo.maven.apache.org/maven2/org/apache/maven/doxia/doxia-module-apt/1.4/doxia-module-apt-1.4.pom
[INFO] Downloaded: http://repo.maven.apache.org/maven2/org/apache/maven/doxia/doxia-module-apt/1.4/doxia-module-apt-1.4.pom
(2 KB at 88.4 KB/sec)
[INFO] Downloading: http://repo.maven.apache.org/maven2/org/apache/maven/doxia/doxia-module-xdoc/1.4/doxia-module-xdoc-1.4.pom
[INFO] Downloaded: http://repo.maven.apache.org/maven2/org/apache/maven/doxia/doxia-module-xdoc/1.4/doxia-module-xdoc-1.4.pom
(5 KB at 225.1 KB/sec)
[INFO] Downloading: http://repo.maven.apache.org/maven2/org/apache/maven/doxia/doxia-module-markdown/1.4/doxia-module-markdown-1.4.pom
[INFO] Downloaded: http://repo.maven.apache.org/maven2/org/apache/maven/doxia/doxia-module-markdown/1.4/doxia-module-markdown-1.4.pom
(3 KB at 107.3 KB/sec)
[INFO] Downloading: http://repo.maven.apache.org/maven2/org/apache/maven/doxia/doxia-integration-tools/1.5/doxia-integration-tools-1.5.pom
[INFO] Downloaded: http://repo.maven.apache.org/maven2/org/apache/maven/doxia/doxia-integration-tools/1.5/doxia-integration-tools-1.5.pom
(7 KB at 374.9 KB/sec)
[INFO] Downloading: http://repo.maven.apache.org/maven2/org/apache/maven/doxia/doxia-tools/2/doxia-tools-2.pom
[INFO] Downloaded: http://repo.maven.apache.org/maven2/org/apache/maven/doxia/doxia-tools/2/doxia-tools-2.pom
(12 KB at 636.7 KB/sec)
[INFO] Downloading: http://repo.maven.apache.org/maven2/org/apache/maven/doxia/doxia-logging-api/1.3/doxia-logging-api-1.3.pom
[INFO] Downloaded: http://repo.maven.apache.org/maven2/org/apache/maven/doxia/doxia-logging-api/1.3/doxia-logging-api-1.3.pom
(2 KB at 89.4 KB/sec)
[INFO] Downloading: http://repo.maven.apache.org/maven2/org/apache/maven/doxia/doxia/1.3/doxia-1.3.pom
[INFO] Downloaded: http://repo.maven.apache.org/maven2/org/apache/maven/doxia/doxia/1.3/doxia-1.3.pom
(18 KB at 969.7 KB/sec)
[INFO] Downloading: http://repo.maven.apache.org/maven2/org/apache/maven/doxia/doxia-decoration-model/1.3/doxia-decoration-model-1.3.pom
[INFO] Downloaded: http://repo.maven.apache.org/maven2/org/apache/maven/doxia/doxia-decoration-model/1.3/doxia-decoration-model-1.3.pom
(3 KB at 165.7 KB/sec)
[INFO] Downloading: http://repo.maven.apache.org/maven2/org/apache/maven/doxia/doxia-sitetools/1.3/doxia-sitetools-1.3.pom
[INFO] Downloaded: http://repo.maven.apache.org/maven2/org/apache/maven/doxia/doxia-sitetools/1.3/doxia-sitetools-1.3.pom
(16 KB at 815.4 KB/sec)
[INFO] Downloading: http://repo.maven.apache.org/maven2/org/codehaus/plexus/plexus-archiver/1.0/plexus-archiver-1.0.pom
[INFO] Downloaded: http://repo.maven.apache.org/maven2/org/codehaus/plexus/plexus-archiver/1.0/plexus-archiver-1.0.pom
(2 KB at 82.8 KB/sec)
[INFO] Downloading: http://repo.maven.apache.org/maven2/org/codehaus/plexus/plexus-io/1.0/plexus-io-1.0.pom
[INFO] Downloaded: http://repo.maven.apache.org/maven2/org/codehaus/plexus/plexus-io/1.0/plexus-io-1.0.pom
(2 KB at 66.6 KB/sec)
[INFO] Downloading: http://repo.maven.apache.org/maven2/org/codehaus/plexus/plexus-utils/1.5.10/plexus-utils-1.5.10.pom
[INFO] Downloaded: http://repo.maven.apache.org/maven2/org/codehaus/plexus/plexus-utils/1.5.10/plexus-utils-1.5.10.pom
(6 KB at 305.7 KB/sec)
[INFO] Downloading: http://repo.maven.apache.org/maven2/commons-lang/commons-lang/2.5/commons-lang-2.5.pom
[INFO] Downloaded: http://repo.maven.apache.org/maven2/commons-lang/commons-lang/2.5/commons-lang-2.5.pom
(17 KB at 929.3 KB/sec)
[INFO] Downloading: http://repo.maven.apache.org/maven2/org/apache/maven/reporting/maven-reporting-exec/1.1/maven-reporting-exec-1.1.jar
[INFO] Downloading: http://repo.maven.apache.org/maven2/org/apache/maven/doxia/doxia-module-apt/1.4/doxia-module-apt-1.4.jar
[INFO] Downloading: http://repo.maven.apache.org/maven2/org/apache/maven/maven-archiver/2.4.2/maven-archiver-2.4.2.jar
[INFO] Downloading: http://repo.maven.apache.org/maven2/org/apache/maven/doxia/doxia-module-xdoc/1.4/doxia-module-xdoc-1.4.jar
[INFO] Downloading: http://repo.maven.apache.org/maven2/org/apache/maven/doxia/doxia-module-markdown/1.4/doxia-module-markdown-1.4.jar
[INFO] Downloaded: http://repo.maven.apache.org/maven2/org/apache/maven/maven-archiver/2.4.2/maven-archiver-2.4.2.jar
(20 KB at 1097.1 KB/sec)
[INFO] Downloading: http://repo.maven.apache.org/maven2/org/apache/maven/doxia/doxia-integration-tools/1.5/doxia-integration-tools-1.5.jar
[INFO] Downloaded: http://repo.maven.apache.org/maven2/org/apache/maven/reporting/maven-reporting-exec/1.1/maven-reporting-exec-1.1.jar
(26 KB at 1265.5 KB/sec)
[INFO] Downloading: http://repo.maven.apache.org/maven2/org/codehaus/plexus/plexus-archiver/1.0/plexus-archiver-1.0.jar
[INFO] Downloaded: http://repo.maven.apache.org/maven2/org/apache/maven/doxia/doxia-module-xdoc/1.4/doxia-module-xdoc-1.4.jar
(36 KB at 1790.2 KB/sec)
[INFO] Downloading: http://repo.maven.apache.org/maven2/org/codehaus/plexus/plexus-io/1.0/plexus-io-1.0.jar
[INFO] Downloaded: http://repo.maven.apache.org/maven2/org/apache/maven/doxia/doxia-module-markdown/1.4/doxia-module-markdown-1.4.jar
(12 KB at 569.2 KB/sec)
[INFO] Downloaded: http://repo.maven.apache.org/maven2/org/apache/maven/doxia/doxia-module-apt/1.4/doxia-module-apt-1.4.jar
(51 KB at 2423.3 KB/sec)
[INFO] Downloading: http://repo.maven.apache.org/maven2/org/codehaus/plexus/plexus-utils/1.5.10/plexus-utils-1.5.10.jar
[INFO] Downloading: http://repo.maven.apache.org/maven2/commons-lang/commons-lang/2.5/commons-lang-2.5.jar
[INFO] Downloaded: http://repo.maven.apache.org/maven2/org/codehaus/plexus/plexus-io/1.0/plexus-io-1.0.jar
(50 KB at 2611.2 KB/sec)
[INFO] Downloaded: http://repo.maven.apache.org/maven2/org/codehaus/plexus/plexus-archiver/1.0/plexus-archiver-1.0.jar
(174 KB at 7864.1 KB/sec)
[INFO] Downloaded: http://repo.maven.apache.org/maven2/org/apache/maven/doxia/doxia-integration-tools/1.5/doxia-integration-tools-1.5.jar
(45 KB at 1915.1 KB/sec)
[INFO] Downloaded: http://repo.maven.apache.org/maven2/commons-lang/commons-lang/2.5/commons-lang-2.5.jar
(273 KB at 12393.2 KB/sec)
[INFO] Downloaded: http://repo.maven.apache.org/maven2/org/codehaus/plexus/plexus-utils/1.5.10/plexus-utils-1.5.10.jar
(274 KB at 11910.5 KB/sec)
[INFO] 
[INFO] --- maven-install-plugin:2.5.1:install (default-install) @ maven-plugins-aggregator
---
[INFO] Installing <https://builds.apache.org/job/maven-plugins-ITs-m3/ws/pom.xml> to
/home/jenkins/.m2/repository/org/apache/maven/plugins/maven-plugins-aggregator/1-SNAPSHOT/maven-plugins-aggregator-1-SNAPSHOT.pom
[INFO] ------------------------------------------------------------------------
[INFO] Reactor Summary:
[INFO] 
[INFO] Apache Maven ACR Plugin ........................... SUCCESS [ 43.811 s]
[INFO] Apache Maven Ant Plugin ........................... FAILURE [  9.929 s]
[INFO] Apache Maven AntRun Plugin ........................ FAILURE [  1.680 s]
[INFO] Apache Maven Changelog Plugin ..................... FAILURE [  9.043 s]
[INFO] Apache Maven Changes Plugin ....................... FAILURE [ 15.195 s]
[INFO] Apache Maven Clean Plugin ......................... FAILURE [  3.843 s]
[INFO] Apache Maven Compiler Plugin ...................... FAILURE [ 12.525 s]
[INFO] Apache Maven Deploy Plugin ........................ FAILURE [  8.192 s]
[INFO] Apache Maven Documentation Checker Plugin ......... FAILURE [  1.082 s]
[INFO] Apache Maven EAR Plugin ........................... FAILURE [  3.811 s]
[INFO] Apache Maven EJB Plugin ........................... FAILURE [  5.965 s]
[INFO] Apache Maven Help Plugin .......................... FAILURE [  3.866 s]
[INFO] Apache Maven Install Plugin ....................... FAILURE [  5.674 s]
[INFO] Apache Maven Jarsigner Plugin ..................... FAILURE [  1.062 s]
[INFO] Apache Maven Javadoc Plugin ....................... FAILURE [01:27 min]
[INFO] Apache Maven Linkcheck Plugin ..................... FAILURE [  2.295 s]
[INFO] Apache Maven Patch Plugin ......................... FAILURE [  0.276 s]
[INFO] Apache Maven PDF Plugin ........................... FAILURE [  7.020 s]
[INFO] Apache Maven RAR Plugin ........................... FAILURE [  3.980 s]
[INFO] Apache Maven Repository Plugin .................... FAILURE [  2.858 s]
[INFO] Apache Maven Resources Plugin ..................... FAILURE [  6.419 s]
[INFO] Apache Maven Site Plugin .......................... FAILURE [  9.265 s]
[INFO] Apache Maven Source Plugin ........................ FAILURE [  5.263 s]
[INFO] Apache Maven Stage Plugin ......................... FAILURE [  2.399 s]
[INFO] Apache Maven Toolchains Plugin .................... FAILURE [  0.719 s]
[INFO] Apache Maven Verifier Plugin ...................... FAILURE [  1.412 s]
[INFO] Apache Maven WAR Plugin ........................... FAILURE [ 11.616 s]
[INFO] Apache Maven DOAP Plugin .......................... FAILURE [  4.497 s]
[INFO] Apache Maven PMD Plugin ........................... FAILURE [ 15.983 s]
[INFO] Apache Maven Invoker Plugin ....................... FAILURE [  5.852 s]
[INFO] Apache Maven JAR Plugin ........................... FAILURE [  3.034 s]
[INFO] Apache Maven Checkstyle Plugin .................... FAILURE [ 17.150 s]
[INFO] Apache Maven Project Info Reports Plugin .......... FAILURE [ 19.748 s]
[INFO] Apache Maven Remote Resources Plugin .............. FAILURE [  3.864 s]
[INFO] Apache Maven Shade Plugin ......................... FAILURE [  6.351 s]
[INFO] Apache Maven SCM Publish Plugin ................... FAILURE [  3.806 s]
[INFO] Apache Maven Assembly Plugin ...................... FAILURE [ 15.880 s]
[INFO] Apache Maven Dependency Plugin .................... FAILURE [ 45.844 s]
[INFO] Apache Maven GPG Plugin ........................... FAILURE [  0.619 s]
[INFO] Apache Maven Plugins Aggregator ................... SUCCESS [  0.984 s]
[INFO] ------------------------------------------------------------------------
[INFO] BUILD FAILURE
[INFO] ------------------------------------------------------------------------
[INFO] Total time: 06:52 min
[INFO] Finished at: 2016-06-07T17:49:37+00:00
[INFO] Final Memory: 138M/494M
[INFO] ------------------------------------------------------------------------
[WARNING] The requested profile "apache.snapshots" could not be activated because it does
not exist.
[ERROR] Failed to execute goal org.apache.maven.plugins:maven-surefire-plugin:2.18.1:test
(default-test) on project maven-ant-plugin: There are test failures.
[ERROR] 
[ERROR] Please refer to <https://builds.apache.org/job/maven-plugins-ITs-m3/ws/maven-ant-plugin/target/surefire-reports>
for the individual test results.
[ERROR] -> [Help 1]
[ERROR] Failed to execute goal org.apache.maven.plugins:maven-invoker-plugin:2.0.0:install
(integration-test) on project maven-antrun-plugin: Failed to install project dependencies:
MavenProject: org.apache.maven.plugins:maven-antrun-plugin:1.9-SNAPSHOT @ <https://builds.apache.org/job/maven-plugins-ITs-m3/ws/maven-antrun-plugin/pom.xml>:
Failed to install project artifacts: MavenProject: org.apache.maven.plugins:maven-ant-plugin:2.5-SNAPSHOT
@ <https://builds.apache.org/job/maven-plugins-ITs-m3/ws/maven-ant-plugin/pom.xml>:
Failed to install artifact: org.apache.maven.plugins:maven-ant-plugin:maven-plugin:2.5-SNAPSHOT:
Artifact is not fully assembled: <https://builds.apache.org/job/maven-plugins-ITs-m3/ws/maven-ant-plugin/target/classes>
-> [Help 2]
[ERROR] Failed to execute goal org.apache.maven.plugins:maven-invoker-plugin:2.0.0:install
(integration-test) on project maven-changelog-plugin: Failed to install project dependencies:
MavenProject: org.apache.maven.plugins:maven-changelog-plugin:2.4-SNAPSHOT @ <https://builds.apache.org/job/maven-plugins-ITs-m3/ws/maven-changelog-plugin/pom.xml>:
Failed to install project artifacts: MavenProject: org.apache.maven.plugins:maven-ant-plugin:2.5-SNAPSHOT
@ <https://builds.apache.org/job/maven-plugins-ITs-m3/ws/maven-ant-plugin/pom.xml>:
Failed to install artifact: org.apache.maven.plugins:maven-ant-plugin:maven-plugin:2.5-SNAPSHOT:
Artifact is not fully assembled: <https://builds.apache.org/job/maven-plugins-ITs-m3/ws/maven-ant-plugin/target/classes>
-> [Help 2]
[ERROR] Failed to execute goal org.apache.maven.plugins:maven-invoker-plugin:2.0.0:install
(integration-test) on project maven-changes-plugin: Failed to install project dependencies:
MavenProject: org.apache.maven.plugins:maven-changes-plugin:2.13-SNAPSHOT @ <https://builds.apache.org/job/maven-plugins-ITs-m3/ws/maven-changes-plugin/pom.xml>:
Failed to install project artifacts: MavenProject: org.apache.maven.plugins:maven-ant-plugin:2.5-SNAPSHOT
@ <https://builds.apache.org/job/maven-plugins-ITs-m3/ws/maven-ant-plugin/pom.xml>:
Failed to install artifact: org.apache.maven.plugins:maven-ant-plugin:maven-plugin:2.5-SNAPSHOT:
Artifact is not fully assembled: <https://builds.apache.org/job/maven-plugins-ITs-m3/ws/maven-ant-plugin/target/classes>
-> [Help 2]
[ERROR] Failed to execute goal org.apache.maven.plugins:maven-invoker-plugin:2.0.0:install
(integration-test) on project maven-clean-plugin: Failed to install project dependencies:
MavenProject: org.apache.maven.plugins:maven-clean-plugin:3.0.1-SNAPSHOT @ <https://builds.apache.org/job/maven-plugins-ITs-m3/ws/maven-clean-plugin/pom.xml>:
Failed to install project artifacts: MavenProject: org.apache.maven.plugins:maven-ant-plugin:2.5-SNAPSHOT
@ <https://builds.apache.org/job/maven-plugins-ITs-m3/ws/maven-ant-plugin/pom.xml>:
Failed to install artifact: org.apache.maven.plugins:maven-ant-plugin:maven-plugin:2.5-SNAPSHOT:
Artifact is not fully assembled: <https://builds.apache.org/job/maven-plugins-ITs-m3/ws/maven-ant-plugin/target/classes>
-> [Help 2]
[ERROR] Failed to execute goal org.apache.maven.plugins:maven-invoker-plugin:2.0.0:install
(integration-test) on project maven-compiler-plugin: Failed to install project dependencies:
MavenProject: org.apache.maven.plugins:maven-compiler-plugin:3.6-SNAPSHOT @ <https://builds.apache.org/job/maven-plugins-ITs-m3/ws/maven-compiler-plugin/pom.xml>:
Failed to install project artifacts: MavenProject: org.apache.maven.plugins:maven-ant-plugin:2.5-SNAPSHOT
@ <https://builds.apache.org/job/maven-plugins-ITs-m3/ws/maven-ant-plugin/pom.xml>:
Failed to install artifact: org.apache.maven.plugins:maven-ant-plugin:maven-plugin:2.5-SNAPSHOT:
Artifact is not fully assembled: <https://builds.apache.org/job/maven-plugins-ITs-m3/ws/maven-ant-plugin/target/classes>
-> [Help 2]
[ERROR] Failed to execute goal org.apache.maven.plugins:maven-invoker-plugin:2.0.0:install
(integration-test) on project maven-deploy-plugin: Failed to install project dependencies:
MavenProject: org.apache.maven.plugins:maven-deploy-plugin:3.0.0-SNAPSHOT @ <https://builds.apache.org/job/maven-plugins-ITs-m3/ws/maven-deploy-plugin/pom.xml>:
Failed to install project artifacts: MavenProject: org.apache.maven.plugins:maven-ant-plugin:2.5-SNAPSHOT
@ <https://builds.apache.org/job/maven-plugins-ITs-m3/ws/maven-ant-plugin/pom.xml>:
Failed to install artifact: org.apache.maven.plugins:maven-ant-plugin:maven-plugin:2.5-SNAPSHOT:
Artifact is not fully assembled: <https://builds.apache.org/job/maven-plugins-ITs-m3/ws/maven-ant-plugin/target/classes>
-> [Help 2]
[ERROR] Failed to execute goal org.apache.maven.plugins:maven-invoker-plugin:2.0.0:install
(integration-test) on project maven-docck-plugin: Failed to install project dependencies:
MavenProject: org.apache.maven.plugins:maven-docck-plugin:1.2-SNAPSHOT @ <https://builds.apache.org/job/maven-plugins-ITs-m3/ws/maven-docck-plugin/pom.xml>:
Failed to install project artifacts: MavenProject: org.apache.maven.plugins:maven-ant-plugin:2.5-SNAPSHOT
@ <https://builds.apache.org/job/maven-plugins-ITs-m3/ws/maven-ant-plugin/pom.xml>:
Failed to install artifact: org.apache.maven.plugins:maven-ant-plugin:maven-plugin:2.5-SNAPSHOT:
Artifact is not fully assembled: <https://builds.apache.org/job/maven-plugins-ITs-m3/ws/maven-ant-plugin/target/classes>
-> [Help 2]
[ERROR] Failed to execute goal org.apache.maven.plugins:maven-invoker-plugin:2.0.0:install
(integration-test) on project maven-ear-plugin: Failed to install project dependencies: MavenProject:
org.apache.maven.plugins:maven-ear-plugin:2.10.2-SNAPSHOT @ <https://builds.apache.org/job/maven-plugins-ITs-m3/ws/maven-ear-plugin/pom.xml>:
Failed to install project artifacts: MavenProject: org.apache.maven.plugins:maven-ant-plugin:2.5-SNAPSHOT
@ <https://builds.apache.org/job/maven-plugins-ITs-m3/ws/maven-ant-plugin/pom.xml>:
Failed to install artifact: org.apache.maven.plugins:maven-ant-plugin:maven-plugin:2.5-SNAPSHOT:
Artifact is not fully assembled: <https://builds.apache.org/job/maven-plugins-ITs-m3/ws/maven-ant-plugin/target/classes>
-> [Help 2]
[ERROR] Failed to execute goal org.apache.maven.plugins:maven-invoker-plugin:2.0.0:install
(integration-test) on project maven-ejb-plugin: Failed to install project dependencies: MavenProject:
org.apache.maven.plugins:maven-ejb-plugin:2.5.2-SNAPSHOT @ <https://builds.apache.org/job/maven-plugins-ITs-m3/ws/maven-ejb-plugin/pom.xml>:
Failed to install project artifacts: MavenProject: org.apache.maven.plugins:maven-ant-plugin:2.5-SNAPSHOT
@ <https://builds.apache.org/job/maven-plugins-ITs-m3/ws/maven-ant-plugin/pom.xml>:
Failed to install artifact: org.apache.maven.plugins:maven-ant-plugin:maven-plugin:2.5-SNAPSHOT:
Artifact is not fully assembled: <https://builds.apache.org/job/maven-plugins-ITs-m3/ws/maven-ant-plugin/target/classes>
-> [Help 2]
[ERROR] Failed to execute goal org.apache.maven.plugins:maven-invoker-plugin:2.0.0:install
(integration-test) on project maven-help-plugin: Failed to install project dependencies: MavenProject:
org.apache.maven.plugins:maven-help-plugin:2.2.1-SNAPSHOT @ <https://builds.apache.org/job/maven-plugins-ITs-m3/ws/maven-help-plugin/pom.xml>:
Failed to install project artifacts: MavenProject: org.apache.maven.plugins:maven-ant-plugin:2.5-SNAPSHOT
@ <https://builds.apache.org/job/maven-plugins-ITs-m3/ws/maven-ant-plugin/pom.xml>:
Failed to install artifact: org.apache.maven.plugins:maven-ant-plugin:maven-plugin:2.5-SNAPSHOT:
Artifact is not fully assembled: <https://builds.apache.org/job/maven-plugins-ITs-m3/ws/maven-ant-plugin/target/classes>
-> [Help 2]
[ERROR] Failed to execute goal org.apache.maven.plugins:maven-invoker-plugin:2.0.0:install
(integration-test) on project maven-install-plugin: Failed to install project dependencies:
MavenProject: org.apache.maven.plugins:maven-install-plugin:3.0.0-SNAPSHOT @ <https://builds.apache.org/job/maven-plugins-ITs-m3/ws/maven-install-plugin/pom.xml>:
Failed to install project artifacts: MavenProject: org.apache.maven.plugins:maven-ant-plugin:2.5-SNAPSHOT
@ <https://builds.apache.org/job/maven-plugins-ITs-m3/ws/maven-ant-plugin/pom.xml>:
Failed to install artifact: org.apache.maven.plugins:maven-ant-plugin:maven-plugin:2.5-SNAPSHOT:
Artifact is not fully assembled: <https://builds.apache.org/job/maven-plugins-ITs-m3/ws/maven-ant-plugin/target/classes>
-> [Help 2]
[ERROR] Failed to execute goal org.apache.maven.plugins:maven-invoker-plugin:2.0.0:install
(integration-test) on project maven-jarsigner-plugin: Failed to install project dependencies:
MavenProject: org.apache.maven.plugins:maven-jarsigner-plugin:1.5-SNAPSHOT @ <https://builds.apache.org/job/maven-plugins-ITs-m3/ws/maven-jarsigner-plugin/pom.xml>:
Failed to install project artifacts: MavenProject: org.apache.maven.plugins:maven-ant-plugin:2.5-SNAPSHOT
@ <https://builds.apache.org/job/maven-plugins-ITs-m3/ws/maven-ant-plugin/pom.xml>:
Failed to install artifact: org.apache.maven.plugins:maven-ant-plugin:maven-plugin:2.5-SNAPSHOT:
Artifact is not fully assembled: <https://builds.apache.org/job/maven-plugins-ITs-m3/ws/maven-ant-plugin/target/classes>
-> [Help 2]
[ERROR] Failed to execute goal org.apache.maven.plugins:maven-surefire-plugin:2.18.1:test
(default-test) on project maven-javadoc-plugin: There are test failures.
[ERROR] 
[ERROR] Please refer to <https://builds.apache.org/job/maven-plugins-ITs-m3/ws/maven-javadoc-plugin/target/surefire-reports>
for the individual test results.
[ERROR] -> [Help 1]
[ERROR] Failed to execute goal org.apache.maven.plugins:maven-invoker-plugin:2.0.0:install
(integration-test) on project maven-linkcheck-plugin: Failed to install project dependencies:
MavenProject: org.apache.maven.plugins:maven-linkcheck-plugin:1.3-SNAPSHOT @ <https://builds.apache.org/job/maven-plugins-ITs-m3/ws/maven-linkcheck-plugin/pom.xml>:
Failed to install project artifacts: MavenProject: org.apache.maven.plugins:maven-ant-plugin:2.5-SNAPSHOT
@ <https://builds.apache.org/job/maven-plugins-ITs-m3/ws/maven-ant-plugin/pom.xml>:
Failed to install artifact: org.apache.maven.plugins:maven-ant-plugin:maven-plugin:2.5-SNAPSHOT:
Artifact is not fully assembled: <https://builds.apache.org/job/maven-plugins-ITs-m3/ws/maven-ant-plugin/target/classes>
-> [Help 2]
[ERROR] Failed to execute goal org.apache.maven.plugins:maven-invoker-plugin:2.0.0:install
(integration-test) on project maven-patch-plugin: Failed to install project dependencies:
MavenProject: org.apache.maven.plugins:maven-patch-plugin:1.3-SNAPSHOT @ <https://builds.apache.org/job/maven-plugins-ITs-m3/ws/maven-patch-plugin/pom.xml>:
Failed to install project artifacts: MavenProject: org.apache.maven.plugins:maven-ant-plugin:2.5-SNAPSHOT
@ <https://builds.apache.org/job/maven-plugins-ITs-m3/ws/maven-ant-plugin/pom.xml>:
Failed to install artifact: org.apache.maven.plugins:maven-ant-plugin:maven-plugin:2.5-SNAPSHOT:
Artifact is not fully assembled: <https://builds.apache.org/job/maven-plugins-ITs-m3/ws/maven-ant-plugin/target/classes>
-> [Help 2]
[ERROR] Failed to execute goal org.apache.maven.plugins:maven-invoker-plugin:2.0.0:install
(integration-test) on project maven-pdf-plugin: Failed to install project dependencies: MavenProject:
org.apache.maven.plugins:maven-pdf-plugin:1.4-SNAPSHOT @ <https://builds.apache.org/job/maven-plugins-ITs-m3/ws/maven-pdf-plugin/pom.xml>:
Failed to install project artifacts: MavenProject: org.apache.maven.plugins:maven-ant-plugin:2.5-SNAPSHOT
@ <https://builds.apache.org/job/maven-plugins-ITs-m3/ws/maven-ant-plugin/pom.xml>:
Failed to install artifact: org.apache.maven.plugins:maven-ant-plugin:maven-plugin:2.5-SNAPSHOT:
Artifact is not fully assembled: <https://builds.apache.org/job/maven-plugins-ITs-m3/ws/maven-ant-plugin/target/classes>
-> [Help 2]
[ERROR] Failed to execute goal org.apache.maven.plugins:maven-invoker-plugin:2.0.0:install
(integration-test) on project maven-rar-plugin: Failed to install project dependencies: MavenProject:
org.apache.maven.plugins:maven-rar-plugin:3.0.0-SNAPSHOT @ <https://builds.apache.org/job/maven-plugins-ITs-m3/ws/maven-rar-plugin/pom.xml>:
Failed to install project artifacts: MavenProject: org.apache.maven.plugins:maven-ant-plugin:2.5-SNAPSHOT
@ <https://builds.apache.org/job/maven-plugins-ITs-m3/ws/maven-ant-plugin/pom.xml>:
Failed to install artifact: org.apache.maven.plugins:maven-ant-plugin:maven-plugin:2.5-SNAPSHOT:
Artifact is not fully assembled: <https://builds.apache.org/job/maven-plugins-ITs-m3/ws/maven-ant-plugin/target/classes>
-> [Help 2]
[ERROR] Failed to execute goal org.apache.maven.plugins:maven-invoker-plugin:2.0.0:install
(integration-test) on project maven-repository-plugin: Failed to install project dependencies:
MavenProject: org.apache.maven.plugins:maven-repository-plugin:2.5-SNAPSHOT @ <https://builds.apache.org/job/maven-plugins-ITs-m3/ws/maven-repository-plugin/pom.xml>:
Failed to install project artifacts: MavenProject: org.apache.maven.plugins:maven-ant-plugin:2.5-SNAPSHOT
@ <https://builds.apache.org/job/maven-plugins-ITs-m3/ws/maven-ant-plugin/pom.xml>:
Failed to install artifact: org.apache.maven.plugins:maven-ant-plugin:maven-plugin:2.5-SNAPSHOT:
Artifact is not fully assembled: <https://builds.apache.org/job/maven-plugins-ITs-m3/ws/maven-ant-plugin/target/classes>
-> [Help 2]
[ERROR] Failed to execute goal org.apache.maven.plugins:maven-invoker-plugin:2.0.0:install
(integration-test) on project maven-resources-plugin: Failed to install project dependencies:
MavenProject: org.apache.maven.plugins:maven-resources-plugin:3.0.2-SNAPSHOT @ <https://builds.apache.org/job/maven-plugins-ITs-m3/ws/maven-resources-plugin/pom.xml>:
Failed to install project artifacts: MavenProject: org.apache.maven.plugins:maven-ant-plugin:2.5-SNAPSHOT
@ <https://builds.apache.org/job/maven-plugins-ITs-m3/ws/maven-ant-plugin/pom.xml>:
Failed to install artifact: org.apache.maven.plugins:maven-ant-plugin:maven-plugin:2.5-SNAPSHOT:
Artifact is not fully assembled: <https://builds.apache.org/job/maven-plugins-ITs-m3/ws/maven-ant-plugin/target/classes>
-> [Help 2]
[ERROR] Failed to execute goal org.apache.maven.plugins:maven-invoker-plugin:2.0.0:install
(integration-test) on project maven-site-plugin: Failed to install project dependencies: MavenProject:
org.apache.maven.plugins:maven-site-plugin:3.6-SNAPSHOT @ <https://builds.apache.org/job/maven-plugins-ITs-m3/ws/maven-site-plugin/dependency-reduced-pom.xml>:
Failed to install project artifacts: MavenProject: org.apache.maven.plugins:maven-ant-plugin:2.5-SNAPSHOT
@ <https://builds.apache.org/job/maven-plugins-ITs-m3/ws/maven-ant-plugin/pom.xml>:
Failed to install artifact: org.apache.maven.plugins:maven-ant-plugin:maven-plugin:2.5-SNAPSHOT:
Artifact is not fully assembled: <https://builds.apache.org/job/maven-plugins-ITs-m3/ws/maven-ant-plugin/target/classes>
-> [Help 2]
[ERROR] Failed to execute goal org.apache.maven.plugins:maven-invoker-plugin:2.0.0:install
(integration-test) on project maven-source-plugin: Failed to install project dependencies:
MavenProject: org.apache.maven.plugins:maven-source-plugin:3.0.1-SNAPSHOT @ <https://builds.apache.org/job/maven-plugins-ITs-m3/ws/maven-source-plugin/pom.xml>:
Failed to install project artifacts: MavenProject: org.apache.maven.plugins:maven-ant-plugin:2.5-SNAPSHOT
@ <https://builds.apache.org/job/maven-plugins-ITs-m3/ws/maven-ant-plugin/pom.xml>:
Failed to install artifact: org.apache.maven.plugins:maven-ant-plugin:maven-plugin:2.5-SNAPSHOT:
Artifact is not fully assembled: <https://builds.apache.org/job/maven-plugins-ITs-m3/ws/maven-ant-plugin/target/classes>
-> [Help 2]
[ERROR] Failed to execute goal org.apache.maven.plugins:maven-invoker-plugin:2.0.0:install
(integration-test) on project maven-stage-plugin: Failed to install project dependencies:
MavenProject: org.apache.maven.plugins:maven-stage-plugin:1.1-SNAPSHOT @ <https://builds.apache.org/job/maven-plugins-ITs-m3/ws/maven-stage-plugin/pom.xml>:
Failed to install project artifacts: MavenProject: org.apache.maven.plugins:maven-ant-plugin:2.5-SNAPSHOT
@ <https://builds.apache.org/job/maven-plugins-ITs-m3/ws/maven-ant-plugin/pom.xml>:
Failed to install artifact: org.apache.maven.plugins:maven-ant-plugin:maven-plugin:2.5-SNAPSHOT:
Artifact is not fully assembled: <https://builds.apache.org/job/maven-plugins-ITs-m3/ws/maven-ant-plugin/target/classes>
-> [Help 2]
[ERROR] Failed to execute goal org.apache.maven.plugins:maven-invoker-plugin:2.0.0:install
(integration-test) on project maven-toolchains-plugin: Failed to install project dependencies:
MavenProject: org.apache.maven.plugins:maven-toolchains-plugin:3.0.0-SNAPSHOT @ <https://builds.apache.org/job/maven-plugins-ITs-m3/ws/maven-toolchains-plugin/pom.xml>:
Failed to install project artifacts: MavenProject: org.apache.maven.plugins:maven-ant-plugin:2.5-SNAPSHOT
@ <https://builds.apache.org/job/maven-plugins-ITs-m3/ws/maven-ant-plugin/pom.xml>:
Failed to install artifact: org.apache.maven.plugins:maven-ant-plugin:maven-plugin:2.5-SNAPSHOT:
Artifact is not fully assembled: <https://builds.apache.org/job/maven-plugins-ITs-m3/ws/maven-ant-plugin/target/classes>
-> [Help 2]
[ERROR] Failed to execute goal org.apache.maven.plugins:maven-invoker-plugin:2.0.0:install
(integration-test) on project maven-verifier-plugin: Failed to install project dependencies:
MavenProject: org.apache.maven.plugins:maven-verifier-plugin:3.0.0-SNAPSHOT @ <https://builds.apache.org/job/maven-plugins-ITs-m3/ws/maven-verifier-plugin/pom.xml>:
Failed to install project artifacts: MavenProject: org.apache.maven.plugins:maven-ant-plugin:2.5-SNAPSHOT
@ <https://builds.apache.org/job/maven-plugins-ITs-m3/ws/maven-ant-plugin/pom.xml>:
Failed to install artifact: org.apache.maven.plugins:maven-ant-plugin:maven-plugin:2.5-SNAPSHOT:
Artifact is not fully assembled: <https://builds.apache.org/job/maven-plugins-ITs-m3/ws/maven-ant-plugin/target/classes>
-> [Help 2]
[ERROR] Failed to execute goal org.apache.maven.plugins:maven-invoker-plugin:2.0.0:install
(integration-test) on project maven-war-plugin: Failed to install project dependencies: MavenProject:
org.apache.maven.plugins:maven-war-plugin:3.0.0-SNAPSHOT @ <https://builds.apache.org/job/maven-plugins-ITs-m3/ws/maven-war-plugin/pom.xml>:
Failed to install project artifacts: MavenProject: org.apache.maven.plugins:maven-ant-plugin:2.5-SNAPSHOT
@ <https://builds.apache.org/job/maven-plugins-ITs-m3/ws/maven-ant-plugin/pom.xml>:
Failed to install artifact: org.apache.maven.plugins:maven-ant-plugin:maven-plugin:2.5-SNAPSHOT:
Artifact is not fully assembled: <https://builds.apache.org/job/maven-plugins-ITs-m3/ws/maven-ant-plugin/target/classes>
-> [Help 2]
[ERROR] Failed to execute goal org.apache.maven.plugins:maven-invoker-plugin:2.0.0:install
(integration-test) on project maven-doap-plugin: Failed to install project dependencies: MavenProject:
org.apache.maven.plugins:maven-doap-plugin:1.3-SNAPSHOT @ <https://builds.apache.org/job/maven-plugins-ITs-m3/ws/maven-doap-plugin/pom.xml>:
Failed to install project artifacts: MavenProject: org.apache.maven.plugins:maven-ant-plugin:2.5-SNAPSHOT
@ <https://builds.apache.org/job/maven-plugins-ITs-m3/ws/maven-ant-plugin/pom.xml>:
Failed to install artifact: org.apache.maven.plugins:maven-ant-plugin:maven-plugin:2.5-SNAPSHOT:
Artifact is not fully assembled: <https://builds.apache.org/job/maven-plugins-ITs-m3/ws/maven-ant-plugin/target/classes>
-> [Help 2]
[ERROR] Failed to execute goal org.apache.maven.plugins:maven-invoker-plugin:2.0.0:install
(integration-test) on project maven-pmd-plugin: Failed to install project dependencies: MavenProject:
org.apache.maven.plugins:maven-pmd-plugin:3.7-SNAPSHOT @ <https://builds.apache.org/job/maven-plugins-ITs-m3/ws/maven-pmd-plugin/pom.xml>:
Failed to install project artifacts: MavenProject: org.apache.maven.plugins:maven-ant-plugin:2.5-SNAPSHOT
@ <https://builds.apache.org/job/maven-plugins-ITs-m3/ws/maven-ant-plugin/pom.xml>:
Failed to install artifact: org.apache.maven.plugins:maven-ant-plugin:maven-plugin:2.5-SNAPSHOT:
Artifact is not fully assembled: <https://builds.apache.org/job/maven-plugins-ITs-m3/ws/maven-ant-plugin/target/classes>
-> [Help 2]
[ERROR] Failed to execute goal org.apache.maven.plugins:maven-invoker-plugin:2.0.0:install
(integration-test) on project maven-invoker-plugin: Failed to install project dependencies:
MavenProject: org.apache.maven.plugins:maven-invoker-plugin:2.0.1-SNAPSHOT @ <https://builds.apache.org/job/maven-plugins-ITs-m3/ws/maven-invoker-plugin/pom.xml>:
Failed to install project artifacts: MavenProject: org.apache.maven.plugins:maven-ant-plugin:2.5-SNAPSHOT
@ <https://builds.apache.org/job/maven-plugins-ITs-m3/ws/maven-ant-plugin/pom.xml>:
Failed to install artifact: org.apache.maven.plugins:maven-ant-plugin:maven-plugin:2.5-SNAPSHOT:
Artifact is not fully assembled: <https://builds.apache.org/job/maven-plugins-ITs-m3/ws/maven-ant-plugin/target/classes>
-> [Help 2]
[ERROR] Failed to execute goal org.apache.maven.plugins:maven-invoker-plugin:2.0.0:install
(integration-test) on project maven-jar-plugin: Failed to install project dependencies: MavenProject:
org.apache.maven.plugins:maven-jar-plugin:3.0.2-SNAPSHOT @ <https://builds.apache.org/job/maven-plugins-ITs-m3/ws/maven-jar-plugin/pom.xml>:
Failed to install project artifacts: MavenProject: org.apache.maven.plugins:maven-ant-plugin:2.5-SNAPSHOT
@ <https://builds.apache.org/job/maven-plugins-ITs-m3/ws/maven-ant-plugin/pom.xml>:
Failed to install artifact: org.apache.maven.plugins:maven-ant-plugin:maven-plugin:2.5-SNAPSHOT:
Artifact is not fully assembled: <https://builds.apache.org/job/maven-plugins-ITs-m3/ws/maven-ant-plugin/target/classes>
-> [Help 2]
[ERROR] Failed to execute goal org.apache.maven.plugins:maven-invoker-plugin:2.0.0:install
(integration-test) on project maven-checkstyle-plugin: Failed to install project dependencies:
MavenProject: org.apache.maven.plugins:maven-checkstyle-plugin:2.18-SNAPSHOT @ <https://builds.apache.org/job/maven-plugins-ITs-m3/ws/maven-checkstyle-plugin/pom.xml>:
Failed to install project artifacts: MavenProject: org.apache.maven.plugins:maven-ant-plugin:2.5-SNAPSHOT
@ <https://builds.apache.org/job/maven-plugins-ITs-m3/ws/maven-ant-plugin/pom.xml>:
Failed to install artifact: org.apache.maven.plugins:maven-ant-plugin:maven-plugin:2.5-SNAPSHOT:
Artifact is not fully assembled: <https://builds.apache.org/job/maven-plugins-ITs-m3/ws/maven-ant-plugin/target/classes>
-> [Help 2]
[ERROR] Failed to execute goal org.apache.maven.plugins:maven-invoker-plugin:2.0.0:install
(integration-test) on project maven-project-info-reports-plugin: Failed to install project
dependencies: MavenProject: org.apache.maven.plugins:maven-project-info-reports-plugin:2.10-SNAPSHOT
@ <https://builds.apache.org/job/maven-plugins-ITs-m3/ws/maven-project-info-reports-plugin/pom.xml>:
Failed to install project artifacts: MavenProject: org.apache.maven.plugins:maven-ant-plugin:2.5-SNAPSHOT
@ <https://builds.apache.org/job/maven-plugins-ITs-m3/ws/maven-ant-plugin/pom.xml>:
Failed to install artifact: org.apache.maven.plugins:maven-ant-plugin:maven-plugin:2.5-SNAPSHOT:
Artifact is not fully assembled: <https://builds.apache.org/job/maven-plugins-ITs-m3/ws/maven-ant-plugin/target/classes>
-> [Help 2]
[ERROR] Failed to execute goal org.apache.maven.plugins:maven-invoker-plugin:2.0.0:install
(integration-test) on project maven-remote-resources-plugin: Failed to install project dependencies:
MavenProject: org.apache.maven.plugins:maven-remote-resources-plugin:1.6-SNAPSHOT @ <https://builds.apache.org/job/maven-plugins-ITs-m3/ws/maven-remote-resources-plugin/pom.xml>:
Failed to install project artifacts: MavenProject: org.apache.maven.plugins:maven-ant-plugin:2.5-SNAPSHOT
@ <https://builds.apache.org/job/maven-plugins-ITs-m3/ws/maven-ant-plugin/pom.xml>:
Failed to install artifact: org.apache.maven.plugins:maven-ant-plugin:maven-plugin:2.5-SNAPSHOT:
Artifact is not fully assembled: <https://builds.apache.org/job/maven-plugins-ITs-m3/ws/maven-ant-plugin/target/classes>
-> [Help 2]
[ERROR] Failed to execute goal org.apache.maven.plugins:maven-invoker-plugin:2.0.0:install
(integration-test) on project maven-shade-plugin: Failed to install project dependencies:
MavenProject: org.apache.maven.plugins:maven-shade-plugin:3.0.0-SNAPSHOT @ <https://builds.apache.org/job/maven-plugins-ITs-m3/ws/maven-shade-plugin/pom.xml>:
Failed to install project artifacts: MavenProject: org.apache.maven.plugins:maven-ant-plugin:2.5-SNAPSHOT
@ <https://builds.apache.org/job/maven-plugins-ITs-m3/ws/maven-ant-plugin/pom.xml>:
Failed to install artifact: org.apache.maven.plugins:maven-ant-plugin:maven-plugin:2.5-SNAPSHOT:
Artifact is not fully assembled: <https://builds.apache.org/job/maven-plugins-ITs-m3/ws/maven-ant-plugin/target/classes>
-> [Help 2]
[ERROR] Failed to execute goal org.apache.maven.plugins:maven-invoker-plugin:2.0.0:install
(integration-test) on project maven-scm-publish-plugin: Failed to install project dependencies:
MavenProject: org.apache.maven.plugins:maven-scm-publish-plugin:1.2-SNAPSHOT @ <https://builds.apache.org/job/maven-plugins-ITs-m3/ws/maven-scm-publish-plugin/pom.xml>:
Failed to install project artifacts: MavenProject: org.apache.maven.plugins:maven-ant-plugin:2.5-SNAPSHOT
@ <https://builds.apache.org/job/maven-plugins-ITs-m3/ws/maven-ant-plugin/pom.xml>:
Failed to install artifact: org.apache.maven.plugins:maven-ant-plugin:maven-plugin:2.5-SNAPSHOT:
Artifact is not fully assembled: <https://builds.apache.org/job/maven-plugins-ITs-m3/ws/maven-ant-plugin/target/classes>
-> [Help 2]
[ERROR] Failed to execute goal org.apache.maven.plugins:maven-invoker-plugin:2.0.0:install
(integration-test) on project maven-assembly-plugin: Failed to install project dependencies:
MavenProject: org.apache.maven.plugins:maven-assembly-plugin:3.0.0-SNAPSHOT @ <https://builds.apache.org/job/maven-plugins-ITs-m3/ws/maven-assembly-plugin/pom.xml>:
Failed to install project artifacts: MavenProject: org.apache.maven.plugins:maven-ant-plugin:2.5-SNAPSHOT
@ <https://builds.apache.org/job/maven-plugins-ITs-m3/ws/maven-ant-plugin/pom.xml>:
Failed to install artifact: org.apache.maven.plugins:maven-ant-plugin:maven-plugin:2.5-SNAPSHOT:
Artifact is not fully assembled: <https://builds.apache.org/job/maven-plugins-ITs-m3/ws/maven-ant-plugin/target/classes>
-> [Help 2]
[ERROR] Failed to execute goal org.apache.maven.plugins:maven-invoker-plugin:2.0.0:install
(integration-test) on project maven-dependency-plugin: Failed to install project dependencies:
MavenProject: org.apache.maven.plugins:maven-dependency-plugin:3.0.0-SNAPSHOT @ <https://builds.apache.org/job/maven-plugins-ITs-m3/ws/maven-dependency-plugin/pom.xml>:
Failed to install project artifacts: MavenProject: org.apache.maven.plugins:maven-ant-plugin:2.5-SNAPSHOT
@ <https://builds.apache.org/job/maven-plugins-ITs-m3/ws/maven-ant-plugin/pom.xml>:
Failed to install artifact: org.apache.maven.plugins:maven-ant-plugin:maven-plugin:2.5-SNAPSHOT:
Artifact is not fully assembled: <https://builds.apache.org/job/maven-plugins-ITs-m3/ws/maven-ant-plugin/target/classes>
-> [Help 2]
[ERROR] Failed to execute goal org.apache.maven.plugins:maven-invoker-plugin:2.0.0:install
(integration-test) on project maven-gpg-plugin: Failed to install project dependencies: MavenProject:
org.apache.maven.plugins:maven-gpg-plugin:1.7-SNAPSHOT @ <https://builds.apache.org/job/maven-plugins-ITs-m3/ws/maven-gpg-plugin/pom.xml>:
Failed to install project artifacts: MavenProject: org.apache.maven.plugins:maven-ant-plugin:2.5-SNAPSHOT
@ <https://builds.apache.org/job/maven-plugins-ITs-m3/ws/maven-ant-plugin/pom.xml>:
Failed to install artifact: org.apache.maven.plugins:maven-ant-plugin:maven-plugin:2.5-SNAPSHOT:
Artifact is not fully assembled: <https://builds.apache.org/job/maven-plugins-ITs-m3/ws/maven-ant-plugin/target/classes>
-> [Help 2]
[ERROR] 
[ERROR] To see the full stack trace of the errors, re-run Maven with the -e switch.
[ERROR] Re-run Maven using the -X switch to enable full debug logging.
[ERROR] 
[ERROR] For more information about the errors and possible solutions, please read the following
articles:
[ERROR] [Help 1] http://cwiki.apache.org/confluence/display/MAVEN/MojoFailureException
[ERROR] [Help 2] http://cwiki.apache.org/confluence/display/MAVEN/MojoExecutionException
[ERROR] 
[ERROR] After correcting the problems, you can resume the build with the command
[ERROR]   mvn <goals> -rf :maven-ant-plugin
Build step 'Invoke top-level Maven targets' marked build as failure
Deleting 1 temporary files
Recording test results
ERROR: Step ‘Publish JUnit test result report’ failed: No test report files were found.
Configuration error?


Mime
View raw message