maven-notifications mailing list archives

Site index · List index
Message view « Date » · « Thread »
Top « Date » · « Thread »
From Apache Jenkins Server <jenk...@builds.apache.org>
Subject Build failed in Jenkins: maven-plugins-windows #1654
Date Sun, 12 Jun 2016 13:46:07 GMT
See <https://builds.apache.org/job/maven-plugins-windows/1654/changes>

Changes:

[Robert Scholte] Fix for new maven-artifact-transfer

[Robert Scholte] Fix for new maven-artifact-transfer

[Robert Scholte] Fix for new maven-artifact-transfer

[Robert Scholte] [MJAVADOC-456] Upgrade to Maven3 plugin
resolve artifact with coordinate instead of artifactFactory based artifact

------------------------------------------
[...truncated 5577 lines...]
[INFO] Apache Maven Ant Plugin ........................... SUCCESS [23.110s]
[INFO] Apache Maven AntRun Plugin ........................ SUCCESS [4.109s]
[INFO] Apache Maven Changelog Plugin ..................... SUCCESS [17.886s]
[INFO] Apache Maven Changes Plugin ....................... SUCCESS [25.455s]
[INFO] Apache Maven Clean Plugin ......................... SUCCESS [9.582s]
[INFO] Apache Maven Compiler Plugin ...................... SUCCESS [14.631s]
[INFO] Apache Maven Deploy Plugin ........................ SUCCESS [15.916s]
[INFO] Apache Maven Documentation Checker Plugin ......... SUCCESS [2.505s]
[INFO] Apache Maven EAR Plugin ........................... SUCCESS [9.692s]
[INFO] Apache Maven EJB Plugin ........................... SUCCESS [13.293s]
[INFO] Apache Maven Help Plugin .......................... SUCCESS [7.228s]
[INFO] Apache Maven Install Plugin ....................... SUCCESS [10.434s]
[INFO] Apache Maven Jarsigner Plugin ..................... SUCCESS [2.634s]
[INFO] Apache Maven Javadoc Plugin ....................... SUCCESS [3:01.935s]
[INFO] Apache Maven JDeps Plugin ......................... SUCCESS [3.193s]
[INFO] Apache Maven Linkcheck Plugin ..................... SUCCESS [6.228s]
[INFO] Apache Maven Patch Plugin ......................... SUCCESS [1.723s]
[INFO] Apache Maven PDF Plugin ........................... SUCCESS [14.703s]
[INFO] Apache Maven RAR Plugin ........................... SUCCESS [9.288s]
[INFO] Apache Maven Repository Plugin .................... SUCCESS [7.320s]
[INFO] Apache Maven Resources Plugin ..................... SUCCESS [13.109s]
[INFO] Apache Maven Site Plugin .......................... SUCCESS [30.607s]
[INFO] Apache Maven Source Plugin ........................ SUCCESS [14.269s]
[INFO] Apache Maven Stage Plugin ......................... SUCCESS [5.573s]
[INFO] Apache Maven Toolchains Plugin .................... SUCCESS [2.619s]
[INFO] Apache Maven Verifier Plugin ...................... SUCCESS [5.356s]
[INFO] Apache Maven WAR Plugin ........................... SUCCESS [26.394s]
[INFO] Apache Maven DOAP Plugin .......................... SUCCESS [10.674s]
[INFO] Apache Maven PMD Plugin ........................... SUCCESS [37.967s]
[INFO] Apache Maven Invoker Plugin ....................... SUCCESS [24.503s]
[INFO] Apache Maven JAR Plugin ........................... SUCCESS [8.489s]
[INFO] Apache Maven Checkstyle Plugin .................... SUCCESS [34.142s]
[INFO] Apache Maven Project Info Reports Plugin .......... SUCCESS [35.451s]
[INFO] Apache Maven Remote Resources Plugin .............. SUCCESS [8.096s]
[INFO] Apache Maven Shade Plugin ......................... SUCCESS [17.045s]
[INFO] Apache Maven SCM Publish Plugin ................... SUCCESS [8.077s]
[INFO] Apache Maven Assembly Plugin ...................... SUCCESS [32.458s]
[INFO] Apache Maven Dependency Plugin .................... FAILURE [7.969s]
[INFO] Apache Maven Plugins Aggregator ................... SUCCESS [1.393s]
[INFO] ------------------------------------------------------------------------
[INFO] BUILD FAILURE
[INFO] ------------------------------------------------------------------------
[INFO] Total time: 12:14.349s
[INFO] Finished at: Sun Jun 12 14:45:56 BST 2016
[INFO] Final Memory: 150M/713M
[INFO] ------------------------------------------------------------------------
[ERROR] Failed to execute goal org.apache.maven.plugins:maven-compiler-plugin:3.2:compile
(default-compile) on project maven-dependency-plugin: Compilation failure: Compilation failure:
[ERROR] /F:/hudson/hudson-slave/workspace/maven-plugins-windows/maven-dependency-plugin/src/main/java/org/apache/maven/plugins/dependency/fromConfiguration/ArtifactItem.java:[27,42]
package org.apache.maven.shared.dependency does not exist
[ERROR] /F:/hudson/hudson-slave/workspace/maven-plugins-windows/maven-dependency-plugin/src/main/java/org/apache/maven/plugins/dependency/fromConfiguration/ArtifactItem.java:[38,38]
cannot find symbol
[ERROR] symbol: class DependencyCoordinate
[ERROR] /F:/hudson/hudson-slave/workspace/maven-plugins-windows/maven-dependency-plugin/src/main/java/org/apache/maven/plugins/dependency/fromDependencies/AbstractDependencyFilterMojo.java:[56,50]
package org.apache.maven.shared.dependency.resolve does not exist
[ERROR] /F:/hudson/hudson-slave/workspace/maven-plugins-windows/maven-dependency-plugin/src/main/java/org/apache/maven/plugins/dependency/fromDependencies/AbstractDependencyFilterMojo.java:[74,13]
cannot find symbol
[ERROR] symbol:   class DependencyResolver
[ERROR] location: class org.apache.maven.plugins.dependency.fromDependencies.AbstractDependencyFilterMojo
[ERROR] /F:/hudson/hudson-slave/workspace/maven-plugins-windows/maven-dependency-plugin/src/main/java/org/apache/maven/plugins/dependency/fromDependencies/AbstractDependencyFilterMojo.java:[535,21]
cannot find symbol
[ERROR] symbol:   class DependencyResolver
[ERROR] location: class org.apache.maven.plugins.dependency.fromDependencies.AbstractDependencyFilterMojo
[ERROR] /F:/hudson/hudson-slave/workspace/maven-plugins-windows/maven-dependency-plugin/src/main/java/org/apache/maven/plugins/dependency/resolvers/AbstractResolveMojo.java:[39,42]
package org.apache.maven.shared.dependency does not exist
[ERROR] /F:/hudson/hudson-slave/workspace/maven-plugins-windows/maven-dependency-plugin/src/main/java/org/apache/maven/plugins/dependency/resolvers/AbstractResolveMojo.java:[40,50]
package org.apache.maven.shared.dependency.resolve does not exist
[ERROR] /F:/hudson/hudson-slave/workspace/maven-plugins-windows/maven-dependency-plugin/src/main/java/org/apache/maven/plugins/dependency/resolvers/AbstractResolveMojo.java:[155,64]
cannot find symbol
[ERROR] symbol:   class DependencyCoordinate
[ERROR] location: class org.apache.maven.plugins.dependency.resolvers.AbstractResolveMojo
[ERROR] /F:/hudson/hudson-slave/workspace/maven-plugins-windows/maven-dependency-plugin/src/main/java/org/apache/maven/plugins/dependency/resolvers/AbstractResolveMojo.java:[156,16]
cannot find symbol
[ERROR] symbol:   class DependencyResolverException
[ERROR] location: class org.apache.maven.plugins.dependency.resolvers.AbstractResolveMojo
[ERROR] /F:/hudson/hudson-slave/workspace/maven-plugins-windows/maven-dependency-plugin/src/main/java/org/apache/maven/plugins/dependency/resolvers/ResolvePluginsMojo.java:[42,42]
package org.apache.maven.shared.dependency does not exist
[ERROR] /F:/hudson/hudson-slave/workspace/maven-plugins-windows/maven-dependency-plugin/src/main/java/org/apache/maven/plugins/dependency/resolvers/ResolvePluginsMojo.java:[43,50]
package org.apache.maven.shared.dependency.resolve does not exist
[ERROR] /F:/hudson/hudson-slave/workspace/maven-plugins-windows/maven-dependency-plugin/src/main/java/org/apache/maven/plugins/dependency/PurgeLocalRepositoryMojo.java:[45,42]
package org.apache.maven.shared.dependency does not exist
[ERROR] /F:/hudson/hudson-slave/workspace/maven-plugins-windows/maven-dependency-plugin/src/main/java/org/apache/maven/plugins/dependency/PurgeLocalRepositoryMojo.java:[46,50]
package org.apache.maven.shared.dependency.resolve does not exist
[ERROR] /F:/hudson/hudson-slave/workspace/maven-plugins-windows/maven-dependency-plugin/src/main/java/org/apache/maven/plugins/dependency/PurgeLocalRepositoryMojo.java:[47,50]
package org.apache.maven.shared.dependency.resolve does not exist
[ERROR] /F:/hudson/hudson-slave/workspace/maven-plugins-windows/maven-dependency-plugin/src/main/java/org/apache/maven/plugins/dependency/PurgeLocalRepositoryMojo.java:[161,13]
cannot find symbol
[ERROR] symbol:   class DependencyResolver
[ERROR] location: class org.apache.maven.plugins.dependency.PurgeLocalRepositoryMojo
[ERROR] /F:/hudson/hudson-slave/workspace/maven-plugins-windows/maven-dependency-plugin/src/main/java/org/apache/maven/plugins/dependency/GetMojo.java:[43,42]
package org.apache.maven.shared.dependency does not exist
[ERROR] /F:/hudson/hudson-slave/workspace/maven-plugins-windows/maven-dependency-plugin/src/main/java/org/apache/maven/plugins/dependency/GetMojo.java:[44,50]
package org.apache.maven.shared.dependency.resolve does not exist
[ERROR] /F:/hudson/hudson-slave/workspace/maven-plugins-windows/maven-dependency-plugin/src/main/java/org/apache/maven/plugins/dependency/GetMojo.java:[45,50]
package org.apache.maven.shared.dependency.resolve does not exist
[ERROR] /F:/hudson/hudson-slave/workspace/maven-plugins-windows/maven-dependency-plugin/src/main/java/org/apache/maven/plugins/dependency/GetMojo.java:[72,12]
cannot find symbol
[ERROR] symbol:   class DependencyResolver
[ERROR] location: class org.apache.maven.plugins.dependency.GetMojo
[ERROR] /F:/hudson/hudson-slave/workspace/maven-plugins-windows/maven-dependency-plugin/src/main/java/org/apache/maven/plugins/dependency/GetMojo.java:[80,13]
cannot find symbol
[ERROR] symbol:   class DefaultDependencyCoordinate
[ERROR] location: class org.apache.maven.plugins.dependency.GetMojo
[ERROR] /F:/hudson/hudson-slave/workspace/maven-plugins-windows/maven-dependency-plugin/src/main/java/org/apache/maven/plugins/dependency/resolvers/ListRepositoriesMojo.java:[28,50]
package org.apache.maven.shared.dependency.collect does not exist
[ERROR] /F:/hudson/hudson-slave/workspace/maven-plugins-windows/maven-dependency-plugin/src/main/java/org/apache/maven/plugins/dependency/resolvers/ListRepositoriesMojo.java:[29,50]
package org.apache.maven.shared.dependency.collect does not exist
[ERROR] /F:/hudson/hudson-slave/workspace/maven-plugins-windows/maven-dependency-plugin/src/main/java/org/apache/maven/plugins/dependency/resolvers/ListRepositoriesMojo.java:[30,50]
package org.apache.maven.shared.dependency.collect does not exist
[ERROR] /F:/hudson/hudson-slave/workspace/maven-plugins-windows/maven-dependency-plugin/src/main/java/org/apache/maven/plugins/dependency/resolvers/ListRepositoriesMojo.java:[48,13]
cannot find symbol
[ERROR] symbol:   class DependencyCollector
[ERROR] location: class org.apache.maven.plugins.dependency.resolvers.ListRepositoriesMojo
[ERROR] /F:/hudson/hudson-slave/workspace/maven-plugins-windows/maven-dependency-plugin/src/main/java/org/apache/maven/plugins/dependency/resolvers/ListRepositoriesMojo.java:[47,24]
cannot find symbol
[ERROR] symbol:   class DependencyCollector
[ERROR] location: class org.apache.maven.plugins.dependency.resolvers.ListRepositoriesMojo
[ERROR] /F:/hudson/hudson-slave/workspace/maven-plugins-windows/maven-dependency-plugin/src/main/java/org/apache/maven/plugins/dependency/resolvers/ResolvePluginsMojo.java:[111,21]
cannot find symbol
[ERROR] symbol:   class DefaultDependencyCoordinate
[ERROR] location: class org.apache.maven.plugins.dependency.resolvers.ResolvePluginsMojo
[ERROR] /F:/hudson/hudson-slave/workspace/maven-plugins-windows/maven-dependency-plugin/src/main/java/org/apache/maven/plugins/dependency/resolvers/ResolvePluginsMojo.java:[111,72]
cannot find symbol
[ERROR] symbol:   class DefaultDependencyCoordinate
[ERROR] location: class org.apache.maven.plugins.dependency.resolvers.ResolvePluginsMojo
[ERROR] /F:/hudson/hudson-slave/workspace/maven-plugins-windows/maven-dependency-plugin/src/main/java/org/apache/maven/plugins/dependency/resolvers/ResolvePluginsMojo.java:[153,17]
cannot find symbol
[ERROR] symbol:   class DependencyResolverException
[ERROR] location: class org.apache.maven.plugins.dependency.resolvers.ResolvePluginsMojo
[ERROR] /F:/hudson/hudson-slave/workspace/maven-plugins-windows/maven-dependency-plugin/src/main/java/org/apache/maven/plugins/dependency/PurgeLocalRepositoryMojo.java:[494,47]
cannot find symbol
[ERROR] symbol:   variable TransferUtils
[ERROR] location: class org.apache.maven.plugins.dependency.PurgeLocalRepositoryMojo
[ERROR] /F:/hudson/hudson-slave/workspace/maven-plugins-windows/maven-dependency-plugin/src/main/java/org/apache/maven/plugins/dependency/PurgeLocalRepositoryMojo.java:[505,17]
cannot find symbol
[ERROR] symbol:   class DependencyResolverException
[ERROR] location: class org.apache.maven.plugins.dependency.PurgeLocalRepositoryMojo
[ERROR] /F:/hudson/hudson-slave/workspace/maven-plugins-windows/maven-dependency-plugin/src/main/java/org/apache/maven/plugins/dependency/GetMojo.java:[80,58]
cannot find symbol
[ERROR] symbol:   class DefaultDependencyCoordinate
[ERROR] location: class org.apache.maven.plugins.dependency.GetMojo
[ERROR] /F:/hudson/hudson-slave/workspace/maven-plugins-windows/maven-dependency-plugin/src/main/java/org/apache/maven/plugins/dependency/GetMojo.java:[229,17]
cannot find symbol
[ERROR] symbol:   class DependencyResolverException
[ERROR] location: class org.apache.maven.plugins.dependency.GetMojo
[ERROR] /F:/hudson/hudson-slave/workspace/maven-plugins-windows/maven-dependency-plugin/src/main/java/org/apache/maven/plugins/dependency/resolvers/ListRepositoriesMojo.java:[61,13]
cannot find symbol
[ERROR] symbol:   class CollectorResult
[ERROR] location: class org.apache.maven.plugins.dependency.resolvers.ListRepositoriesMojo
[ERROR] /F:/hudson/hudson-slave/workspace/maven-plugins-windows/maven-dependency-plugin/src/main/java/org/apache/maven/plugins/dependency/resolvers/ListRepositoriesMojo.java:[72,17]
cannot find symbol
[ERROR] symbol:   class DependencyCollectorException
[ERROR] location: class org.apache.maven.plugins.dependency.resolvers.ListRepositoriesMojo
[ERROR] -> [Help 1]
org.apache.maven.lifecycle.LifecycleExecutionException: Failed to execute goal org.apache.maven.plugins:maven-compiler-plugin:3.2:compile
(default-compile) on project maven-dependency-plugin: Compilation failure
	at org.apache.maven.lifecycle.internal.MojoExecutor.execute(MojoExecutor.java:213)
	at org.apache.maven.lifecycle.internal.MojoExecutor.execute(MojoExecutor.java:153)
	at org.apache.maven.lifecycle.internal.MojoExecutor.execute(MojoExecutor.java:145)
	at org.apache.maven.lifecycle.internal.LifecycleModuleBuilder.buildProject(LifecycleModuleBuilder.java:84)
	at org.apache.maven.lifecycle.internal.LifecycleModuleBuilder.buildProject(LifecycleModuleBuilder.java:59)
	at org.apache.maven.lifecycle.internal.LifecycleStarter.singleThreadedBuild(LifecycleStarter.java:183)
	at org.apache.maven.lifecycle.internal.LifecycleStarter.execute(LifecycleStarter.java:161)
	at org.apache.maven.DefaultMaven.doExecute(DefaultMaven.java:320)
	at org.apache.maven.DefaultMaven.execute(DefaultMaven.java:156)
	at org.jvnet.hudson.maven3.launcher.Maven3Launcher.main(Maven3Launcher.java:117)
	at sun.reflect.NativeMethodAccessorImpl.invoke0(Native Method)
	at sun.reflect.NativeMethodAccessorImpl.invoke(NativeMethodAccessorImpl.java:57)
	at sun.reflect.DelegatingMethodAccessorImpl.invoke(DelegatingMethodAccessorImpl.java:43)
	at java.lang.reflect.Method.invoke(Method.java:601)
	at org.codehaus.plexus.classworlds.launcher.Launcher.launchStandard(Launcher.java:329)
	at org.codehaus.plexus.classworlds.launcher.Launcher.launch(Launcher.java:239)
	at org.jvnet.hudson.maven3.agent.Maven3Main.launch(Maven3Main.java:181)
	at sun.reflect.NativeMethodAccessorImpl.invoke0(Native Method)
	at sun.reflect.NativeMethodAccessorImpl.invoke(NativeMethodAccessorImpl.java:57)
	at sun.reflect.DelegatingMethodAccessorImpl.invoke(DelegatingMethodAccessorImpl.java:43)
	at java.lang.reflect.Method.invoke(Method.java:601)
	at hudson.maven.Maven3Builder.call(Maven3Builder.java:136)
	at hudson.maven.Maven3Builder.call(Maven3Builder.java:71)
	at hudson.remoting.UserRequest.perform(UserRequest.java:118)
	at hudson.remoting.UserRequest.perform(UserRequest.java:48)
	at hudson.remoting.Request$2.run(Request.java:328)
	at hudson.remoting.InterceptingExecutorService$1.call(InterceptingExecutorService.java:72)
	at java.util.concurrent.FutureTask$Sync.innerRun(FutureTask.java:334)
	at java.util.concurrent.FutureTask.run(FutureTask.java:166)
	at java.util.concurrent.ThreadPoolExecutor.runWorker(ThreadPoolExecutor.java:1110)
	at java.util.concurrent.ThreadPoolExecutor$Worker.run(ThreadPoolExecutor.java:603)
	at java.lang.Thread.run(Thread.java:722)
Caused by: org.apache.maven.plugin.compiler.CompilationFailureException: Compilation failure
	at org.apache.maven.plugin.compiler.AbstractCompilerMojo.execute(AbstractCompilerMojo.java:909)
	at org.apache.maven.plugin.compiler.CompilerMojo.execute(CompilerMojo.java:129)
	at org.apache.maven.plugin.DefaultBuildPluginManager.executeMojo(DefaultBuildPluginManager.java:101)
	at org.apache.maven.lifecycle.internal.MojoExecutor.execute(MojoExecutor.java:209)
	... 31 more
[ERROR] 
[ERROR] Re-run Maven using the -X switch to enable full debug logging.
[ERROR] 
[ERROR] For more information about the errors and possible solutions, please read the following
articles:
[ERROR] [Help 1] http://cwiki.apache.org/confluence/display/MAVEN/MojoFailureException
[ERROR] 
[ERROR] After correcting the problems, you can resume the build with the command
[ERROR]   mvn <goals> -rf :maven-dependency-plugin
[JENKINS] Archiving F:\hudson\hudson-slave\workspace\maven-plugins-windows\maven-scm-publish-plugin\pom.xml
to org.apache.maven.plugins/maven-scm-publish-plugin/1.2-SNAPSHOT/maven-scm-publish-plugin-1.2-SNAPSHOT.pom
[JENKINS] Archiving F:\hudson\hudson-slave\workspace\maven-plugins-windows\maven-scm-publish-plugin\target\maven-scm-publish-plugin-1.2-SNAPSHOT.jar
to org.apache.maven.plugins/maven-scm-publish-plugin/1.2-SNAPSHOT/maven-scm-publish-plugin-1.2-SNAPSHOT.jar
[JENKINS] Archiving F:\hudson\hudson-slave\workspace\maven-plugins-windows\maven-linkcheck-plugin\pom.xml
to org.apache.maven.plugins/maven-linkcheck-plugin/1.3-SNAPSHOT/maven-linkcheck-plugin-1.3-SNAPSHOT.pom
[JENKINS] Archiving F:\hudson\hudson-slave\workspace\maven-plugins-windows\maven-linkcheck-plugin\target\maven-linkcheck-plugin-1.3-SNAPSHOT.jar
to org.apache.maven.plugins/maven-linkcheck-plugin/1.3-SNAPSHOT/maven-linkcheck-plugin-1.3-SNAPSHOT.jar
[JENKINS] Archiving F:\hudson\hudson-slave\workspace\maven-plugins-windows\maven-changes-plugin\pom.xml
to org.apache.maven.plugins/maven-changes-plugin/2.13-SNAPSHOT/maven-changes-plugin-2.13-SNAPSHOT.pom
[JENKINS] Archiving F:\hudson\hudson-slave\workspace\maven-plugins-windows\maven-changes-plugin\target\maven-changes-plugin-2.13-SNAPSHOT.jar
to org.apache.maven.plugins/maven-changes-plugin/2.13-SNAPSHOT/maven-changes-plugin-2.13-SNAPSHOT.jar
[JENKINS] Archiving F:\hudson\hudson-slave\workspace\maven-plugins-windows\maven-ear-plugin\pom.xml
to org.apache.maven.plugins/maven-ear-plugin/2.10.2-SNAPSHOT/maven-ear-plugin-2.10.2-SNAPSHOT.pom
[JENKINS] Archiving F:\hudson\hudson-slave\workspace\maven-plugins-windows\maven-ear-plugin\target\maven-ear-plugin-2.10.2-SNAPSHOT.jar
to org.apache.maven.plugins/maven-ear-plugin/2.10.2-SNAPSHOT/maven-ear-plugin-2.10.2-SNAPSHOT.jar
[JENKINS] Archiving F:\hudson\hudson-slave\workspace\maven-plugins-windows\maven-pdf-plugin\pom.xml
to org.apache.maven.plugins/maven-pdf-plugin/1.4-SNAPSHOT/maven-pdf-plugin-1.4-SNAPSHOT.pom
[JENKINS] Archiving F:\hudson\hudson-slave\workspace\maven-plugins-windows\maven-pdf-plugin\target\maven-pdf-plugin-1.4-SNAPSHOT.jar
to org.apache.maven.plugins/maven-pdf-plugin/1.4-SNAPSHOT/maven-pdf-plugin-1.4-SNAPSHOT.jar
[JENKINS] Archiving F:\hudson\hudson-slave\workspace\maven-plugins-windows\maven-help-plugin\pom.xml
to org.apache.maven.plugins/maven-help-plugin/2.2.1-SNAPSHOT/maven-help-plugin-2.2.1-SNAPSHOT.pom
[JENKINS] Archiving F:\hudson\hudson-slave\workspace\maven-plugins-windows\maven-help-plugin\target\maven-help-plugin-2.2.1-SNAPSHOT.jar
to org.apache.maven.plugins/maven-help-plugin/2.2.1-SNAPSHOT/maven-help-plugin-2.2.1-SNAPSHOT.jar
[JENKINS] Archiving F:\hudson\hudson-slave\workspace\maven-plugins-windows\maven-patch-plugin\pom.xml
to org.apache.maven.plugins/maven-patch-plugin/1.3-SNAPSHOT/maven-patch-plugin-1.3-SNAPSHOT.pom
[JENKINS] Archiving F:\hudson\hudson-slave\workspace\maven-plugins-windows\maven-patch-plugin\target\maven-patch-plugin-1.3-SNAPSHOT.jar
to org.apache.maven.plugins/maven-patch-plugin/1.3-SNAPSHOT/maven-patch-plugin-1.3-SNAPSHOT.jar
[JENKINS] Archiving F:\hudson\hudson-slave\workspace\maven-plugins-windows\maven-site-plugin\dependency-reduced-pom.xml
to org.apache.maven.plugins/maven-site-plugin/3.6-SNAPSHOT/maven-site-plugin-3.6-SNAPSHOT.pom
[JENKINS] Archiving F:\hudson\hudson-slave\workspace\maven-plugins-windows\maven-site-plugin\target\maven-site-plugin-3.6-SNAPSHOT.jar
to org.apache.maven.plugins/maven-site-plugin/3.6-SNAPSHOT/maven-site-plugin-3.6-SNAPSHOT.jar
[JENKINS] Archiving F:\hudson\hudson-slave\workspace\maven-plugins-windows\maven-docck-plugin\pom.xml
to org.apache.maven.plugins/maven-docck-plugin/1.2-SNAPSHOT/maven-docck-plugin-1.2-SNAPSHOT.pom
[JENKINS] Archiving F:\hudson\hudson-slave\workspace\maven-plugins-windows\maven-docck-plugin\target\maven-docck-plugin-1.2-SNAPSHOT.jar
to org.apache.maven.plugins/maven-docck-plugin/1.2-SNAPSHOT/maven-docck-plugin-1.2-SNAPSHOT.jar
[JENKINS] Archiving F:\hudson\hudson-slave\workspace\maven-plugins-windows\maven-rar-plugin\pom.xml
to org.apache.maven.plugins/maven-rar-plugin/3.0.0-SNAPSHOT/maven-rar-plugin-3.0.0-SNAPSHOT.pom
[JENKINS] Archiving F:\hudson\hudson-slave\workspace\maven-plugins-windows\maven-rar-plugin\target\maven-rar-plugin-3.0.0-SNAPSHOT.jar
to org.apache.maven.plugins/maven-rar-plugin/3.0.0-SNAPSHOT/maven-rar-plugin-3.0.0-SNAPSHOT.jar
[JENKINS] Archiving F:\hudson\hudson-slave\workspace\maven-plugins-windows\maven-verifier-plugin\pom.xml
to org.apache.maven.plugins/maven-verifier-plugin/3.0.0-SNAPSHOT/maven-verifier-plugin-3.0.0-SNAPSHOT.pom
[JENKINS] Archiving F:\hudson\hudson-slave\workspace\maven-plugins-windows\maven-verifier-plugin\target\maven-verifier-plugin-3.0.0-SNAPSHOT.jar
to org.apache.maven.plugins/maven-verifier-plugin/3.0.0-SNAPSHOT/maven-verifier-plugin-3.0.0-SNAPSHOT.jar
[JENKINS] Archiving F:\hudson\hudson-slave\workspace\maven-plugins-windows\maven-jar-plugin\pom.xml
to org.apache.maven.plugins/maven-jar-plugin/3.0.2-SNAPSHOT/maven-jar-plugin-3.0.2-SNAPSHOT.pom
[JENKINS] Archiving F:\hudson\hudson-slave\workspace\maven-plugins-windows\maven-jar-plugin\target\maven-jar-plugin-3.0.2-SNAPSHOT.jar
to org.apache.maven.plugins/maven-jar-plugin/3.0.2-SNAPSHOT/maven-jar-plugin-3.0.2-SNAPSHOT.jar
[JENKINS] Archiving F:\hudson\hudson-slave\workspace\maven-plugins-windows\maven-changelog-plugin\pom.xml
to org.apache.maven.plugins/maven-changelog-plugin/2.4-SNAPSHOT/maven-changelog-plugin-2.4-SNAPSHOT.pom
[JENKINS] Archiving F:\hudson\hudson-slave\workspace\maven-plugins-windows\maven-changelog-plugin\target\maven-changelog-plugin-2.4-SNAPSHOT.jar
to org.apache.maven.plugins/maven-changelog-plugin/2.4-SNAPSHOT/maven-changelog-plugin-2.4-SNAPSHOT.jar
[JENKINS] Archiving F:\hudson\hudson-slave\workspace\maven-plugins-windows\maven-invoker-plugin\pom.xml
to org.apache.maven.plugins/maven-invoker-plugin/3.0.0-SNAPSHOT/maven-invoker-plugin-3.0.0-SNAPSHOT.pom
[JENKINS] Archiving F:\hudson\hudson-slave\workspace\maven-plugins-windows\maven-invoker-plugin\target\maven-invoker-plugin-3.0.0-SNAPSHOT.jar
to org.apache.maven.plugins/maven-invoker-plugin/3.0.0-SNAPSHOT/maven-invoker-plugin-3.0.0-SNAPSHOT.jar
[JENKINS] Archiving F:\hudson\hudson-slave\workspace\maven-plugins-windows\maven-jarsigner-plugin\pom.xml
to org.apache.maven.plugins/maven-jarsigner-plugin/1.5-SNAPSHOT/maven-jarsigner-plugin-1.5-SNAPSHOT.pom
[JENKINS] Archiving F:\hudson\hudson-slave\workspace\maven-plugins-windows\maven-jarsigner-plugin\target\maven-jarsigner-plugin-1.5-SNAPSHOT.jar
to org.apache.maven.plugins/maven-jarsigner-plugin/1.5-SNAPSHOT/maven-jarsigner-plugin-1.5-SNAPSHOT.jar
[JENKINS] Archiving F:\hudson\hudson-slave\workspace\maven-plugins-windows\maven-repository-plugin\pom.xml
to org.apache.maven.plugins/maven-repository-plugin/2.5-SNAPSHOT/maven-repository-plugin-2.5-SNAPSHOT.pom
[JENKINS] Archiving F:\hudson\hudson-slave\workspace\maven-plugins-windows\maven-repository-plugin\target\maven-repository-plugin-2.5-SNAPSHOT.jar
to org.apache.maven.plugins/maven-repository-plugin/2.5-SNAPSHOT/maven-repository-plugin-2.5-SNAPSHOT.jar
[JENKINS] Archiving F:\hudson\hudson-slave\workspace\maven-plugins-windows\maven-remote-resources-plugin\pom.xml
to org.apache.maven.plugins/maven-remote-resources-plugin/1.6-SNAPSHOT/maven-remote-resources-plugin-1.6-SNAPSHOT.pom
[JENKINS] Archiving F:\hudson\hudson-slave\workspace\maven-plugins-windows\maven-remote-resources-plugin\target\maven-remote-resources-plugin-1.6-SNAPSHOT.jar
to org.apache.maven.plugins/maven-remote-resources-plugin/1.6-SNAPSHOT/maven-remote-resources-plugin-1.6-SNAPSHOT.jar
[JENKINS] Archiving F:\hudson\hudson-slave\workspace\maven-plugins-windows\maven-deploy-plugin\pom.xml
to org.apache.maven.plugins/maven-deploy-plugin/3.0.0-SNAPSHOT/maven-deploy-plugin-3.0.0-SNAPSHOT.pom
[JENKINS] Archiving F:\hudson\hudson-slave\workspace\maven-plugins-windows\maven-deploy-plugin\target\maven-deploy-plugin-3.0.0-SNAPSHOT.jar
to org.apache.maven.plugins/maven-deploy-plugin/3.0.0-SNAPSHOT/maven-deploy-plugin-3.0.0-SNAPSHOT.jar
[JENKINS] Archiving F:\hudson\hudson-slave\workspace\maven-plugins-windows\maven-compiler-plugin\pom.xml
to org.apache.maven.plugins/maven-compiler-plugin/3.6-SNAPSHOT/maven-compiler-plugin-3.6-SNAPSHOT.pom
[JENKINS] Archiving F:\hudson\hudson-slave\workspace\maven-plugins-windows\maven-compiler-plugin\target\maven-compiler-plugin-3.6-SNAPSHOT.jar
to org.apache.maven.plugins/maven-compiler-plugin/3.6-SNAPSHOT/maven-compiler-plugin-3.6-SNAPSHOT.jar
[JENKINS] Archiving F:\hudson\hudson-slave\workspace\maven-plugins-windows\maven-antrun-plugin\pom.xml
to org.apache.maven.plugins/maven-antrun-plugin/1.9-SNAPSHOT/maven-antrun-plugin-1.9-SNAPSHOT.pom
[JENKINS] Archiving F:\hudson\hudson-slave\workspace\maven-plugins-windows\maven-antrun-plugin\target\maven-antrun-plugin-1.9-SNAPSHOT.jar
to org.apache.maven.plugins/maven-antrun-plugin/1.9-SNAPSHOT/maven-antrun-plugin-1.9-SNAPSHOT.jar
[JENKINS] Archiving F:\hudson\hudson-slave\workspace\maven-plugins-windows\maven-ant-plugin\pom.xml
to org.apache.maven.plugins/maven-ant-plugin/2.5-SNAPSHOT/maven-ant-plugin-2.5-SNAPSHOT.pom
[JENKINS] Archiving F:\hudson\hudson-slave\workspace\maven-plugins-windows\maven-ant-plugin\target\maven-ant-plugin-2.5-SNAPSHOT.jar
to org.apache.maven.plugins/maven-ant-plugin/2.5-SNAPSHOT/maven-ant-plugin-2.5-SNAPSHOT.jar
[JENKINS] Archiving F:\hudson\hudson-slave\workspace\maven-plugins-windows\maven-resources-plugin\pom.xml
to org.apache.maven.plugins/maven-resources-plugin/3.0.2-SNAPSHOT/maven-resources-plugin-3.0.2-SNAPSHOT.pom
[JENKINS] Archiving F:\hudson\hudson-slave\workspace\maven-plugins-windows\maven-resources-plugin\target\maven-resources-plugin-3.0.2-SNAPSHOT.jar
to org.apache.maven.plugins/maven-resources-plugin/3.0.2-SNAPSHOT/maven-resources-plugin-3.0.2-SNAPSHOT.jar
[JENKINS] Archiving F:\hudson\hudson-slave\workspace\maven-plugins-windows\maven-pmd-plugin\pom.xml
to org.apache.maven.plugins/maven-pmd-plugin/3.7-SNAPSHOT/maven-pmd-plugin-3.7-SNAPSHOT.pom
[JENKINS] Archiving F:\hudson\hudson-slave\workspace\maven-plugins-windows\maven-pmd-plugin\target\maven-pmd-plugin-3.7-SNAPSHOT.jar
to org.apache.maven.plugins/maven-pmd-plugin/3.7-SNAPSHOT/maven-pmd-plugin-3.7-SNAPSHOT.jar
[JENKINS] Archiving F:\hudson\hudson-slave\workspace\maven-plugins-windows\maven-acr-plugin\pom.xml
to org.apache.maven.plugins/maven-acr-plugin/3.0.1-SNAPSHOT/maven-acr-plugin-3.0.1-SNAPSHOT.pom
[JENKINS] Archiving F:\hudson\hudson-slave\workspace\maven-plugins-windows\maven-acr-plugin\target\maven-acr-plugin-3.0.1-SNAPSHOT.jar
to org.apache.maven.plugins/maven-acr-plugin/3.0.1-SNAPSHOT/maven-acr-plugin-3.0.1-SNAPSHOT.jar
[JENKINS] Archiving F:\hudson\hudson-slave\workspace\maven-plugins-windows\maven-project-info-reports-plugin\pom.xml
to org.apache.maven.plugins/maven-project-info-reports-plugin/2.10-SNAPSHOT/maven-project-info-reports-plugin-2.10-SNAPSHOT.pom
[JENKINS] Archiving F:\hudson\hudson-slave\workspace\maven-plugins-windows\maven-project-info-reports-plugin\target\maven-project-info-reports-plugin-2.10-SNAPSHOT.jar
to org.apache.maven.plugins/maven-project-info-reports-plugin/2.10-SNAPSHOT/maven-project-info-reports-plugin-2.10-SNAPSHOT.jar
[JENKINS] Archiving F:\hudson\hudson-slave\workspace\maven-plugins-windows\maven-toolchains-plugin\pom.xml
to org.apache.maven.plugins/maven-toolchains-plugin/3.0.0-SNAPSHOT/maven-toolchains-plugin-3.0.0-SNAPSHOT.pom
[JENKINS] Archiving F:\hudson\hudson-slave\workspace\maven-plugins-windows\maven-toolchains-plugin\target\maven-toolchains-plugin-3.0.0-SNAPSHOT.jar
to org.apache.maven.plugins/maven-toolchains-plugin/3.0.0-SNAPSHOT/maven-toolchains-plugin-3.0.0-SNAPSHOT.jar
[JENKINS] Archiving <https://builds.apache.org/job/maven-plugins-windows/ws/pom.xml>
to org.apache.maven.plugins/maven-plugins-aggregator/1-SNAPSHOT/maven-plugins-aggregator-1-SNAPSHOT.pom
[JENKINS] Archiving F:\hudson\hudson-slave\workspace\maven-plugins-windows\maven-dependency-plugin\pom.xml
to org.apache.maven.plugins/maven-dependency-plugin/3.0.0-SNAPSHOT/maven-dependency-plugin-3.0.0-SNAPSHOT.pom
[JENKINS] Archiving F:\hudson\hudson-slave\workspace\maven-plugins-windows\maven-clean-plugin\pom.xml
to org.apache.maven.plugins/maven-clean-plugin/3.0.1-SNAPSHOT/maven-clean-plugin-3.0.1-SNAPSHOT.pom
[JENKINS] Archiving F:\hudson\hudson-slave\workspace\maven-plugins-windows\maven-clean-plugin\target\maven-clean-plugin-3.0.1-SNAPSHOT.jar
to org.apache.maven.plugins/maven-clean-plugin/3.0.1-SNAPSHOT/maven-clean-plugin-3.0.1-SNAPSHOT.jar
[JENKINS] Archiving F:\hudson\hudson-slave\workspace\maven-plugins-windows\maven-jdeps-plugin\pom.xml
to org.apache.maven.plugins/maven-jdeps-plugin/3.0.1-SNAPSHOT/maven-jdeps-plugin-3.0.1-SNAPSHOT.pom
[JENKINS] Archiving F:\hudson\hudson-slave\workspace\maven-plugins-windows\maven-jdeps-plugin\target\maven-jdeps-plugin-3.0.1-SNAPSHOT.jar
to org.apache.maven.plugins/maven-jdeps-plugin/3.0.1-SNAPSHOT/maven-jdeps-plugin-3.0.1-SNAPSHOT.jar
[JENKINS] Archiving F:\hudson\hudson-slave\workspace\maven-plugins-windows\maven-doap-plugin\pom.xml
to org.apache.maven.plugins/maven-doap-plugin/1.3-SNAPSHOT/maven-doap-plugin-1.3-SNAPSHOT.pom
[JENKINS] Archiving F:\hudson\hudson-slave\workspace\maven-plugins-windows\maven-doap-plugin\target\maven-doap-plugin-1.3-SNAPSHOT.jar
to org.apache.maven.plugins/maven-doap-plugin/1.3-SNAPSHOT/maven-doap-plugin-1.3-SNAPSHOT.jar
[JENKINS] Archiving F:\hudson\hudson-slave\workspace\maven-plugins-windows\maven-war-plugin\pom.xml
to org.apache.maven.plugins/maven-war-plugin/3.0.0-SNAPSHOT/maven-war-plugin-3.0.0-SNAPSHOT.pom
[JENKINS] Archiving F:\hudson\hudson-slave\workspace\maven-plugins-windows\maven-war-plugin\target\maven-war-plugin-3.0.0-SNAPSHOT.jar
to org.apache.maven.plugins/maven-war-plugin/3.0.0-SNAPSHOT/maven-war-plugin-3.0.0-SNAPSHOT.jar
[JENKINS] Archiving F:\hudson\hudson-slave\workspace\maven-plugins-windows\maven-checkstyle-plugin\pom.xml
to org.apache.maven.plugins/maven-checkstyle-plugin/2.18-SNAPSHOT/maven-checkstyle-plugin-2.18-SNAPSHOT.pom
[JENKINS] Archiving F:\hudson\hudson-slave\workspace\maven-plugins-windows\maven-checkstyle-plugin\target\maven-checkstyle-plugin-2.18-SNAPSHOT.jar
to org.apache.maven.plugins/maven-checkstyle-plugin/2.18-SNAPSHOT/maven-checkstyle-plugin-2.18-SNAPSHOT.jar
[JENKINS] Archiving F:\hudson\hudson-slave\workspace\maven-plugins-windows\maven-ejb-plugin\pom.xml
to org.apache.maven.plugins/maven-ejb-plugin/2.5.2-SNAPSHOT/maven-ejb-plugin-2.5.2-SNAPSHOT.pom
[JENKINS] Archiving F:\hudson\hudson-slave\workspace\maven-plugins-windows\maven-ejb-plugin\target\maven-ejb-plugin-2.5.2-SNAPSHOT.jar
to org.apache.maven.plugins/maven-ejb-plugin/2.5.2-SNAPSHOT/maven-ejb-plugin-2.5.2-SNAPSHOT.jar
[JENKINS] Archiving F:\hudson\hudson-slave\workspace\maven-plugins-windows\maven-shade-plugin\pom.xml
to org.apache.maven.plugins/maven-shade-plugin/3.0.0-SNAPSHOT/maven-shade-plugin-3.0.0-SNAPSHOT.pom
[JENKINS] Archiving F:\hudson\hudson-slave\workspace\maven-plugins-windows\maven-shade-plugin\target\maven-shade-plugin-3.0.0-SNAPSHOT.jar
to org.apache.maven.plugins/maven-shade-plugin/3.0.0-SNAPSHOT/maven-shade-plugin-3.0.0-SNAPSHOT.jar
[JENKINS] Archiving F:\hudson\hudson-slave\workspace\maven-plugins-windows\maven-stage-plugin\pom.xml
to org.apache.maven.plugins/maven-stage-plugin/1.1-SNAPSHOT/maven-stage-plugin-1.1-SNAPSHOT.pom
[JENKINS] Archiving F:\hudson\hudson-slave\workspace\maven-plugins-windows\maven-stage-plugin\target\maven-stage-plugin-1.1-SNAPSHOT.jar
to org.apache.maven.plugins/maven-stage-plugin/1.1-SNAPSHOT/maven-stage-plugin-1.1-SNAPSHOT.jar
[JENKINS] Archiving F:\hudson\hudson-slave\workspace\maven-plugins-windows\maven-javadoc-plugin\pom.xml
to org.apache.maven.plugins/maven-javadoc-plugin/3.0.0-SNAPSHOT/maven-javadoc-plugin-3.0.0-SNAPSHOT.pom
[JENKINS] Archiving F:\hudson\hudson-slave\workspace\maven-plugins-windows\maven-javadoc-plugin\target\maven-javadoc-plugin-3.0.0-SNAPSHOT.jar
to org.apache.maven.plugins/maven-javadoc-plugin/3.0.0-SNAPSHOT/maven-javadoc-plugin-3.0.0-SNAPSHOT.jar
Compressed 414.83 KB of artifacts by 15.4% relative to #1653
[JENKINS] Archiving F:\hudson\hudson-slave\workspace\maven-plugins-windows\maven-assembly-plugin\pom.xml
to org.apache.maven.plugins/maven-assembly-plugin/3.0.0-SNAPSHOT/maven-assembly-plugin-3.0.0-SNAPSHOT.pom
[JENKINS] Archiving F:\hudson\hudson-slave\workspace\maven-plugins-windows\maven-assembly-plugin\target\maven-assembly-plugin-3.0.0-SNAPSHOT.jar
to org.apache.maven.plugins/maven-assembly-plugin/3.0.0-SNAPSHOT/maven-assembly-plugin-3.0.0-SNAPSHOT.jar
[JENKINS] Archiving F:\hudson\hudson-slave\workspace\maven-plugins-windows\maven-source-plugin\pom.xml
to org.apache.maven.plugins/maven-source-plugin/3.0.1-SNAPSHOT/maven-source-plugin-3.0.1-SNAPSHOT.pom
[JENKINS] Archiving F:\hudson\hudson-slave\workspace\maven-plugins-windows\maven-source-plugin\target\maven-source-plugin-3.0.1-SNAPSHOT.jar
to org.apache.maven.plugins/maven-source-plugin/3.0.1-SNAPSHOT/maven-source-plugin-3.0.1-SNAPSHOT.jar
[JENKINS] Archiving F:\hudson\hudson-slave\workspace\maven-plugins-windows\maven-install-plugin\pom.xml
to org.apache.maven.plugins/maven-install-plugin/3.0.0-SNAPSHOT/maven-install-plugin-3.0.0-SNAPSHOT.pom
[JENKINS] Archiving F:\hudson\hudson-slave\workspace\maven-plugins-windows\maven-install-plugin\target\maven-install-plugin-3.0.0-SNAPSHOT.jar
to org.apache.maven.plugins/maven-install-plugin/3.0.0-SNAPSHOT/maven-install-plugin-3.0.0-SNAPSHOT.jar
Sending e-mails to: notifications@maven.apache.org
Sending e-mails to: notifications@maven.apache.org
channel stopped
[WARNINGS] Skipping publisher since build result is FAILURE

Mime
View raw message