maven-notifications mailing list archives

Site index · List index
Message view « Date » · « Thread »
Top « Date » · « Thread »
From Apache Jenkins Server <jenk...@builds.apache.org>
Subject Build failed in Jenkins: maven-plugins-ITs-m3-windows #1545
Date Sat, 14 May 2016 14:54:25 GMT
See <https://builds.apache.org/job/maven-plugins-ITs-m3-windows/1545/changes>

Changes:

[hboutemy] [MCHECKSTYLE-314] updated check for error founds in an additional target/*.txt
file now that check runs checkstyle before analyzing itself

------------------------------------------
[...truncated 11553 lines...]
[INFO] Wrote classpath file 'F:\jenkins\jenkins-slave\workspace\maven-plugins-ITs-m3-windows\maven-dependency-plugin\target\unit-tests\build-classpath\buildClasspath.txt'.
Tests run: 2, Failures: 0, Errors: 0, Skipped: 0, Time elapsed: 0.123 sec - in org.apache.maven.plugins.dependency.fromDependencies.TestBuildClasspathMojo
Running org.apache.maven.plugins.dependency.fromDependencies.TestCopyDependenciesMojo
Tests run: 33, Failures: 0, Errors: 0, Skipped: 0, Time elapsed: 8.61 sec - in org.apache.maven.plugins.dependency.fromDependencies.TestCopyDependenciesMojo
Running org.apache.maven.plugins.dependency.fromDependencies.TestCopyDependenciesMojo2
Tests run: 11, Failures: 0, Errors: 0, Skipped: 0, Time elapsed: 1.376 sec - in org.apache.maven.plugins.dependency.fromDependencies.TestCopyDependenciesMojo2
Running org.apache.maven.plugins.dependency.fromDependencies.TestIncludeExcludeUnpackDependenciesMojo
Tests run: 7, Failures: 0, Errors: 0, Skipped: 0, Time elapsed: 1.805 sec - in org.apache.maven.plugins.dependency.fromDependencies.TestIncludeExcludeUnpackDependenciesMojo
Running org.apache.maven.plugins.dependency.fromDependencies.TestUnpackDependenciesMojo
Tests run: 28, Failures: 0, Errors: 0, Skipped: 0, Time elapsed: 40.499 sec - in org.apache.maven.plugins.dependency.fromDependencies.TestUnpackDependenciesMojo
Running org.apache.maven.plugins.dependency.fromDependencies.TestUnpackDependenciesMojo2
Tests run: 5, Failures: 0, Errors: 0, Skipped: 0, Time elapsed: 11.092 sec - in org.apache.maven.plugins.dependency.fromDependencies.TestUnpackDependenciesMojo2
Running org.apache.maven.plugins.dependency.resolvers.TestResolveMojo
Tests run: 2, Failures: 0, Errors: 0, Skipped: 0, Time elapsed: 0.32 sec - in org.apache.maven.plugins.dependency.resolvers.TestResolveMojo
Running org.apache.maven.plugins.dependency.TestGetMojo
[INFO] Resolving org.apache.maven:maven-model:jar:2.0.9 with transitive dependencies
[INFO] Resolving org.apache.maven:maven-model:jar:2.0.9
[INFO] Resolving org.apache.maven:maven-model:jar:2.0.9
Tests run: 3, Failures: 0, Errors: 0, Skipped: 0, Time elapsed: 1.528 sec - in org.apache.maven.plugins.dependency.TestGetMojo
Running org.apache.maven.plugins.dependency.TestPropertiesMojo
Tests run: 1, Failures: 0, Errors: 0, Skipped: 0, Time elapsed: 0.236 sec - in org.apache.maven.plugins.dependency.TestPropertiesMojo
Running org.apache.maven.plugins.dependency.TestSkip
Tests run: 19, Failures: 0, Errors: 0, Skipped: 0, Time elapsed: 4.313 sec - in org.apache.maven.plugins.dependency.TestSkip
Running org.apache.maven.plugins.dependency.tree.TestTreeMojo
Tests run: 1, Failures: 0, Errors: 0, Skipped: 0, Time elapsed: 0.279 sec - in org.apache.maven.plugins.dependency.tree.TestTreeMojo
Running org.apache.maven.plugins.dependency.utils.filters.TestDestFileFilter
Tests run: 8, Failures: 0, Errors: 0, Skipped: 0, Time elapsed: 0.018 sec - in org.apache.maven.plugins.dependency.utils.filters.TestDestFileFilter
Running org.apache.maven.plugins.dependency.utils.filters.TestMarkerFileFilter
Tests run: 5, Failures: 0, Errors: 0, Skipped: 0, Time elapsed: 0.008 sec - in org.apache.maven.plugins.dependency.utils.filters.TestMarkerFileFilter
Running org.apache.maven.plugins.dependency.utils.filters.TestResolveMarkerFileFilter
Tests run: 1, Failures: 0, Errors: 0, Skipped: 0, Time elapsed: 0.003 sec - in org.apache.maven.plugins.dependency.utils.filters.TestResolveMarkerFileFilter
Running org.apache.maven.plugins.dependency.utils.markers.TestDefaultMarkerFileHandler
Tests run: 6, Failures: 0, Errors: 0, Skipped: 0, Time elapsed: 0.012 sec - in org.apache.maven.plugins.dependency.utils.markers.TestDefaultMarkerFileHandler
Running org.apache.maven.plugins.dependency.utils.markers.TestSourcesMarkerFileHandler
Tests run: 10, Failures: 0, Errors: 0, Skipped: 0, Time elapsed: 0.012 sec - in org.apache.maven.plugins.dependency.utils.markers.TestSourcesMarkerFileHandler
Running org.apache.maven.plugins.dependency.utils.markers.TestUnpackMarkerFileHandler
Tests run: 9, Failures: 0, Errors: 0, Skipped: 0, Time elapsed: 1.192 sec - in org.apache.maven.plugins.dependency.utils.markers.TestUnpackMarkerFileHandler
Running org.apache.maven.plugins.dependency.utils.TestDependencyStatusSets
Tests run: 5, Failures: 0, Errors: 0, Skipped: 0, Time elapsed: 0.588 sec - in org.apache.maven.plugins.dependency.utils.TestDependencyStatusSets
Running org.apache.maven.plugins.dependency.utils.TestDependencyUtil
Tests run: 9, Failures: 0, Errors: 0, Skipped: 0, Time elapsed: 0.06 sec - in org.apache.maven.plugins.dependency.utils.TestDependencyUtil
Running org.apache.maven.plugins.dependency.utils.TestSilentLog
Tests run: 2, Failures: 0, Errors: 0, Skipped: 0, Time elapsed: 0.002 sec - in org.apache.maven.plugins.dependency.utils.TestSilentLog
Running org.apache.maven.plugins.dependency.utils.translators.TestClassifierTypeTranslator
Tests run: 6, Failures: 0, Errors: 0, Skipped: 0, Time elapsed: 0.526 sec - in org.apache.maven.plugins.dependency.utils.translators.TestClassifierTypeTranslator

Results :

Tests run: 237, Failures: 0, Errors: 0, Skipped: 0

[INFO] 
[INFO] --- maven-jar-plugin:2.5:jar (default-jar) @ maven-dependency-plugin ---
[INFO] Building jar: F:\jenkins\jenkins-slave\workspace\maven-plugins-ITs-m3-windows\maven-dependency-plugin\target\maven-dependency-plugin-3.0-SNAPSHOT.jar
[INFO] 
[INFO] --- maven-plugin-plugin:3.4:addPluginArtifactMetadata (default-addPluginArtifactMetadata)
@ maven-dependency-plugin ---
[INFO] 
[INFO] --- maven-invoker-plugin:2.0.0:install (integration-test) @ maven-dependency-plugin
---
[INFO] Installing F:\jenkins\jenkins-slave\workspace\maven-plugins-ITs-m3-windows\maven-acr-plugin\pom.xml
to F:\jenkins\jenkins-slave\workspace\maven-plugins-ITs-m3-windows\maven-dependency-plugin\target\local-repo\org\apache\maven\plugins\maven-acr-plugin\3.0.1-SNAPSHOT\maven-acr-plugin-3.0.1-SNAPSHOT.pom
[INFO] Installing F:\jenkins\jenkins-slave\workspace\maven-plugins-ITs-m3-windows\maven-acr-plugin\target\maven-acr-plugin-3.0.1-SNAPSHOT.jar
to F:\jenkins\jenkins-slave\workspace\maven-plugins-ITs-m3-windows\maven-dependency-plugin\target\local-repo\org\apache\maven\plugins\maven-acr-plugin\3.0.1-SNAPSHOT\maven-acr-plugin-3.0.1-SNAPSHOT.jar
[INFO] Installing F:\jenkins\jenkins-slave\workspace\maven-plugins-ITs-m3-windows\maven-acr-plugin\pom.xml
to F:\jenkins\jenkins-slave\workspace\maven-plugins-ITs-m3-windows\maven-dependency-plugin\target\local-repo\org\apache\maven\plugins\maven-acr-plugin\3.0.1-SNAPSHOT\maven-acr-plugin-3.0.1-SNAPSHOT.pom
[INFO] Installing F:\jenkins\jenkins-slave\workspace\maven-plugins-ITs-m3-windows\maven-ant-plugin\pom.xml
to F:\jenkins\jenkins-slave\workspace\maven-plugins-ITs-m3-windows\maven-dependency-plugin\target\local-repo\org\apache\maven\plugins\maven-ant-plugin\2.5-SNAPSHOT\maven-ant-plugin-2.5-SNAPSHOT.pom
[INFO] Installing F:\jenkins\jenkins-slave\workspace\maven-plugins-ITs-m3-windows\maven-ant-plugin\target\maven-ant-plugin-2.5-SNAPSHOT.jar
to F:\jenkins\jenkins-slave\workspace\maven-plugins-ITs-m3-windows\maven-dependency-plugin\target\local-repo\org\apache\maven\plugins\maven-ant-plugin\2.5-SNAPSHOT\maven-ant-plugin-2.5-SNAPSHOT.jar
[INFO] Installing F:\jenkins\jenkins-slave\workspace\maven-plugins-ITs-m3-windows\maven-ant-plugin\pom.xml
to F:\jenkins\jenkins-slave\workspace\maven-plugins-ITs-m3-windows\maven-dependency-plugin\target\local-repo\org\apache\maven\plugins\maven-ant-plugin\2.5-SNAPSHOT\maven-ant-plugin-2.5-SNAPSHOT.pom
[INFO] Installing F:\jenkins\jenkins-slave\workspace\maven-plugins-ITs-m3-windows\maven-antrun-plugin\pom.xml
to F:\jenkins\jenkins-slave\workspace\maven-plugins-ITs-m3-windows\maven-dependency-plugin\target\local-repo\org\apache\maven\plugins\maven-antrun-plugin\1.9-SNAPSHOT\maven-antrun-plugin-1.9-SNAPSHOT.pom
[INFO] Installing F:\jenkins\jenkins-slave\workspace\maven-plugins-ITs-m3-windows\maven-antrun-plugin\target\maven-antrun-plugin-1.9-SNAPSHOT.jar
to F:\jenkins\jenkins-slave\workspace\maven-plugins-ITs-m3-windows\maven-dependency-plugin\target\local-repo\org\apache\maven\plugins\maven-antrun-plugin\1.9-SNAPSHOT\maven-antrun-plugin-1.9-SNAPSHOT.jar
[INFO] Installing F:\jenkins\jenkins-slave\workspace\maven-plugins-ITs-m3-windows\maven-antrun-plugin\pom.xml
to F:\jenkins\jenkins-slave\workspace\maven-plugins-ITs-m3-windows\maven-dependency-plugin\target\local-repo\org\apache\maven\plugins\maven-antrun-plugin\1.9-SNAPSHOT\maven-antrun-plugin-1.9-SNAPSHOT.pom
[INFO] Installing F:\jenkins\jenkins-slave\workspace\maven-plugins-ITs-m3-windows\maven-changelog-plugin\pom.xml
to F:\jenkins\jenkins-slave\workspace\maven-plugins-ITs-m3-windows\maven-dependency-plugin\target\local-repo\org\apache\maven\plugins\maven-changelog-plugin\2.4-SNAPSHOT\maven-changelog-plugin-2.4-SNAPSHOT.pom
[INFO] Installing F:\jenkins\jenkins-slave\workspace\maven-plugins-ITs-m3-windows\maven-changelog-plugin\target\maven-changelog-plugin-2.4-SNAPSHOT.jar
to F:\jenkins\jenkins-slave\workspace\maven-plugins-ITs-m3-windows\maven-dependency-plugin\target\local-repo\org\apache\maven\plugins\maven-changelog-plugin\2.4-SNAPSHOT\maven-changelog-plugin-2.4-SNAPSHOT.jar
[INFO] Installing F:\jenkins\jenkins-slave\workspace\maven-plugins-ITs-m3-windows\maven-changelog-plugin\pom.xml
to F:\jenkins\jenkins-slave\workspace\maven-plugins-ITs-m3-windows\maven-dependency-plugin\target\local-repo\org\apache\maven\plugins\maven-changelog-plugin\2.4-SNAPSHOT\maven-changelog-plugin-2.4-SNAPSHOT.pom
[INFO] Installing F:\jenkins\jenkins-slave\workspace\maven-plugins-ITs-m3-windows\maven-changes-plugin\pom.xml
to F:\jenkins\jenkins-slave\workspace\maven-plugins-ITs-m3-windows\maven-dependency-plugin\target\local-repo\org\apache\maven\plugins\maven-changes-plugin\2.13-SNAPSHOT\maven-changes-plugin-2.13-SNAPSHOT.pom
[INFO] Installing F:\jenkins\jenkins-slave\workspace\maven-plugins-ITs-m3-windows\maven-changes-plugin\target\maven-changes-plugin-2.13-SNAPSHOT.jar
to F:\jenkins\jenkins-slave\workspace\maven-plugins-ITs-m3-windows\maven-dependency-plugin\target\local-repo\org\apache\maven\plugins\maven-changes-plugin\2.13-SNAPSHOT\maven-changes-plugin-2.13-SNAPSHOT.jar
[INFO] Installing F:\jenkins\jenkins-slave\workspace\maven-plugins-ITs-m3-windows\maven-changes-plugin\pom.xml
to F:\jenkins\jenkins-slave\workspace\maven-plugins-ITs-m3-windows\maven-dependency-plugin\target\local-repo\org\apache\maven\plugins\maven-changes-plugin\2.13-SNAPSHOT\maven-changes-plugin-2.13-SNAPSHOT.pom
[INFO] Installing F:\jenkins\jenkins-slave\workspace\maven-plugins-ITs-m3-windows\maven-clean-plugin\pom.xml
to F:\jenkins\jenkins-slave\workspace\maven-plugins-ITs-m3-windows\maven-dependency-plugin\target\local-repo\org\apache\maven\plugins\maven-clean-plugin\3.0.1-SNAPSHOT\maven-clean-plugin-3.0.1-SNAPSHOT.pom
[INFO] Installing F:\jenkins\jenkins-slave\workspace\maven-plugins-ITs-m3-windows\maven-clean-plugin\target\maven-clean-plugin-3.0.1-SNAPSHOT.jar
to F:\jenkins\jenkins-slave\workspace\maven-plugins-ITs-m3-windows\maven-dependency-plugin\target\local-repo\org\apache\maven\plugins\maven-clean-plugin\3.0.1-SNAPSHOT\maven-clean-plugin-3.0.1-SNAPSHOT.jar
[INFO] Installing F:\jenkins\jenkins-slave\workspace\maven-plugins-ITs-m3-windows\maven-clean-plugin\pom.xml
to F:\jenkins\jenkins-slave\workspace\maven-plugins-ITs-m3-windows\maven-dependency-plugin\target\local-repo\org\apache\maven\plugins\maven-clean-plugin\3.0.1-SNAPSHOT\maven-clean-plugin-3.0.1-SNAPSHOT.pom
[INFO] Installing F:\jenkins\jenkins-slave\workspace\maven-plugins-ITs-m3-windows\maven-compiler-plugin\pom.xml
to F:\jenkins\jenkins-slave\workspace\maven-plugins-ITs-m3-windows\maven-dependency-plugin\target\local-repo\org\apache\maven\plugins\maven-compiler-plugin\3.6-SNAPSHOT\maven-compiler-plugin-3.6-SNAPSHOT.pom
[INFO] Installing F:\jenkins\jenkins-slave\workspace\maven-plugins-ITs-m3-windows\maven-compiler-plugin\target\maven-compiler-plugin-3.6-SNAPSHOT.jar
to F:\jenkins\jenkins-slave\workspace\maven-plugins-ITs-m3-windows\maven-dependency-plugin\target\local-repo\org\apache\maven\plugins\maven-compiler-plugin\3.6-SNAPSHOT\maven-compiler-plugin-3.6-SNAPSHOT.jar
[INFO] Installing F:\jenkins\jenkins-slave\workspace\maven-plugins-ITs-m3-windows\maven-compiler-plugin\pom.xml
to F:\jenkins\jenkins-slave\workspace\maven-plugins-ITs-m3-windows\maven-dependency-plugin\target\local-repo\org\apache\maven\plugins\maven-compiler-plugin\3.6-SNAPSHOT\maven-compiler-plugin-3.6-SNAPSHOT.pom
[INFO] Installing F:\jenkins\jenkins-slave\workspace\maven-plugins-ITs-m3-windows\maven-deploy-plugin\pom.xml
to F:\jenkins\jenkins-slave\workspace\maven-plugins-ITs-m3-windows\maven-dependency-plugin\target\local-repo\org\apache\maven\plugins\maven-deploy-plugin\3.0-SNAPSHOT\maven-deploy-plugin-3.0-SNAPSHOT.pom
[INFO] Installing F:\jenkins\jenkins-slave\workspace\maven-plugins-ITs-m3-windows\maven-deploy-plugin\target\maven-deploy-plugin-3.0-SNAPSHOT.jar
to F:\jenkins\jenkins-slave\workspace\maven-plugins-ITs-m3-windows\maven-dependency-plugin\target\local-repo\org\apache\maven\plugins\maven-deploy-plugin\3.0-SNAPSHOT\maven-deploy-plugin-3.0-SNAPSHOT.jar
[INFO] Installing F:\jenkins\jenkins-slave\workspace\maven-plugins-ITs-m3-windows\maven-docck-plugin\pom.xml
to F:\jenkins\jenkins-slave\workspace\maven-plugins-ITs-m3-windows\maven-dependency-plugin\target\local-repo\org\apache\maven\plugins\maven-docck-plugin\1.2-SNAPSHOT\maven-docck-plugin-1.2-SNAPSHOT.pom
[INFO] Installing F:\jenkins\jenkins-slave\workspace\maven-plugins-ITs-m3-windows\maven-docck-plugin\target\maven-docck-plugin-1.2-SNAPSHOT.jar
to F:\jenkins\jenkins-slave\workspace\maven-plugins-ITs-m3-windows\maven-dependency-plugin\target\local-repo\org\apache\maven\plugins\maven-docck-plugin\1.2-SNAPSHOT\maven-docck-plugin-1.2-SNAPSHOT.jar
[INFO] Installing F:\jenkins\jenkins-slave\workspace\maven-plugins-ITs-m3-windows\maven-docck-plugin\pom.xml
to F:\jenkins\jenkins-slave\workspace\maven-plugins-ITs-m3-windows\maven-dependency-plugin\target\local-repo\org\apache\maven\plugins\maven-docck-plugin\1.2-SNAPSHOT\maven-docck-plugin-1.2-SNAPSHOT.pom
[INFO] Installing F:\jenkins\jenkins-slave\workspace\maven-plugins-ITs-m3-windows\maven-ear-plugin\pom.xml
to F:\jenkins\jenkins-slave\workspace\maven-plugins-ITs-m3-windows\maven-dependency-plugin\target\local-repo\org\apache\maven\plugins\maven-ear-plugin\2.10.2-SNAPSHOT\maven-ear-plugin-2.10.2-SNAPSHOT.pom
[INFO] Installing F:\jenkins\jenkins-slave\workspace\maven-plugins-ITs-m3-windows\maven-ear-plugin\target\maven-ear-plugin-2.10.2-SNAPSHOT.jar
to F:\jenkins\jenkins-slave\workspace\maven-plugins-ITs-m3-windows\maven-dependency-plugin\target\local-repo\org\apache\maven\plugins\maven-ear-plugin\2.10.2-SNAPSHOT\maven-ear-plugin-2.10.2-SNAPSHOT.jar
[INFO] Installing F:\jenkins\jenkins-slave\workspace\maven-plugins-ITs-m3-windows\maven-ear-plugin\pom.xml
to F:\jenkins\jenkins-slave\workspace\maven-plugins-ITs-m3-windows\maven-dependency-plugin\target\local-repo\org\apache\maven\plugins\maven-ear-plugin\2.10.2-SNAPSHOT\maven-ear-plugin-2.10.2-SNAPSHOT.pom
[INFO] Installing F:\jenkins\jenkins-slave\workspace\maven-plugins-ITs-m3-windows\maven-ejb-plugin\pom.xml
to F:\jenkins\jenkins-slave\workspace\maven-plugins-ITs-m3-windows\maven-dependency-plugin\target\local-repo\org\apache\maven\plugins\maven-ejb-plugin\2.5.2-SNAPSHOT\maven-ejb-plugin-2.5.2-SNAPSHOT.pom
[INFO] Installing F:\jenkins\jenkins-slave\workspace\maven-plugins-ITs-m3-windows\maven-ejb-plugin\target\maven-ejb-plugin-2.5.2-SNAPSHOT.jar
to F:\jenkins\jenkins-slave\workspace\maven-plugins-ITs-m3-windows\maven-dependency-plugin\target\local-repo\org\apache\maven\plugins\maven-ejb-plugin\2.5.2-SNAPSHOT\maven-ejb-plugin-2.5.2-SNAPSHOT.jar
[INFO] Installing F:\jenkins\jenkins-slave\workspace\maven-plugins-ITs-m3-windows\maven-ejb-plugin\pom.xml
to F:\jenkins\jenkins-slave\workspace\maven-plugins-ITs-m3-windows\maven-dependency-plugin\target\local-repo\org\apache\maven\plugins\maven-ejb-plugin\2.5.2-SNAPSHOT\maven-ejb-plugin-2.5.2-SNAPSHOT.pom
[INFO] Installing F:\jenkins\jenkins-slave\workspace\maven-plugins-ITs-m3-windows\maven-help-plugin\pom.xml
to F:\jenkins\jenkins-slave\workspace\maven-plugins-ITs-m3-windows\maven-dependency-plugin\target\local-repo\org\apache\maven\plugins\maven-help-plugin\2.2.1-SNAPSHOT\maven-help-plugin-2.2.1-SNAPSHOT.pom
[INFO] Installing F:\jenkins\jenkins-slave\workspace\maven-plugins-ITs-m3-windows\maven-help-plugin\target\maven-help-plugin-2.2.1-SNAPSHOT.jar
to F:\jenkins\jenkins-slave\workspace\maven-plugins-ITs-m3-windows\maven-dependency-plugin\target\local-repo\org\apache\maven\plugins\maven-help-plugin\2.2.1-SNAPSHOT\maven-help-plugin-2.2.1-SNAPSHOT.jar
[INFO] Installing F:\jenkins\jenkins-slave\workspace\maven-plugins-ITs-m3-windows\maven-help-plugin\pom.xml
to F:\jenkins\jenkins-slave\workspace\maven-plugins-ITs-m3-windows\maven-dependency-plugin\target\local-repo\org\apache\maven\plugins\maven-help-plugin\2.2.1-SNAPSHOT\maven-help-plugin-2.2.1-SNAPSHOT.pom
[INFO] Installing F:\jenkins\jenkins-slave\workspace\maven-plugins-ITs-m3-windows\maven-install-plugin\pom.xml
to F:\jenkins\jenkins-slave\workspace\maven-plugins-ITs-m3-windows\maven-dependency-plugin\target\local-repo\org\apache\maven\plugins\maven-install-plugin\3.0-SNAPSHOT\maven-install-plugin-3.0-SNAPSHOT.pom
[INFO] Installing F:\jenkins\jenkins-slave\workspace\maven-plugins-ITs-m3-windows\maven-install-plugin\target\maven-install-plugin-3.0-SNAPSHOT.jar
to F:\jenkins\jenkins-slave\workspace\maven-plugins-ITs-m3-windows\maven-dependency-plugin\target\local-repo\org\apache\maven\plugins\maven-install-plugin\3.0-SNAPSHOT\maven-install-plugin-3.0-SNAPSHOT.jar
[INFO] Installing F:\jenkins\jenkins-slave\workspace\maven-plugins-ITs-m3-windows\maven-install-plugin\pom.xml
to F:\jenkins\jenkins-slave\workspace\maven-plugins-ITs-m3-windows\maven-dependency-plugin\target\local-repo\org\apache\maven\plugins\maven-install-plugin\3.0-SNAPSHOT\maven-install-plugin-3.0-SNAPSHOT.pom
[INFO] Installing F:\jenkins\jenkins-slave\workspace\maven-plugins-ITs-m3-windows\maven-jarsigner-plugin\pom.xml
to F:\jenkins\jenkins-slave\workspace\maven-plugins-ITs-m3-windows\maven-dependency-plugin\target\local-repo\org\apache\maven\plugins\maven-jarsigner-plugin\1.5-SNAPSHOT\maven-jarsigner-plugin-1.5-SNAPSHOT.pom
[INFO] Installing F:\jenkins\jenkins-slave\workspace\maven-plugins-ITs-m3-windows\maven-jarsigner-plugin\target\maven-jarsigner-plugin-1.5-SNAPSHOT.jar
to F:\jenkins\jenkins-slave\workspace\maven-plugins-ITs-m3-windows\maven-dependency-plugin\target\local-repo\org\apache\maven\plugins\maven-jarsigner-plugin\1.5-SNAPSHOT\maven-jarsigner-plugin-1.5-SNAPSHOT.jar
[INFO] Installing F:\jenkins\jenkins-slave\workspace\maven-plugins-ITs-m3-windows\maven-jarsigner-plugin\pom.xml
to F:\jenkins\jenkins-slave\workspace\maven-plugins-ITs-m3-windows\maven-dependency-plugin\target\local-repo\org\apache\maven\plugins\maven-jarsigner-plugin\1.5-SNAPSHOT\maven-jarsigner-plugin-1.5-SNAPSHOT.pom
[INFO] Installing F:\jenkins\jenkins-slave\workspace\maven-plugins-ITs-m3-windows\maven-javadoc-plugin\pom.xml
to F:\jenkins\jenkins-slave\workspace\maven-plugins-ITs-m3-windows\maven-dependency-plugin\target\local-repo\org\apache\maven\plugins\maven-javadoc-plugin\2.10.4-SNAPSHOT\maven-javadoc-plugin-2.10.4-SNAPSHOT.pom
[INFO] Installing F:\jenkins\jenkins-slave\workspace\maven-plugins-ITs-m3-windows\maven-javadoc-plugin\target\maven-javadoc-plugin-2.10.4-SNAPSHOT.jar
to F:\jenkins\jenkins-slave\workspace\maven-plugins-ITs-m3-windows\maven-dependency-plugin\target\local-repo\org\apache\maven\plugins\maven-javadoc-plugin\2.10.4-SNAPSHOT\maven-javadoc-plugin-2.10.4-SNAPSHOT.jar
[INFO] Installing F:\jenkins\jenkins-slave\workspace\maven-plugins-ITs-m3-windows\maven-javadoc-plugin\pom.xml
to F:\jenkins\jenkins-slave\workspace\maven-plugins-ITs-m3-windows\maven-dependency-plugin\target\local-repo\org\apache\maven\plugins\maven-javadoc-plugin\2.10.4-SNAPSHOT\maven-javadoc-plugin-2.10.4-SNAPSHOT.pom
[INFO] Installing F:\jenkins\jenkins-slave\workspace\maven-plugins-ITs-m3-windows\maven-linkcheck-plugin\pom.xml
to F:\jenkins\jenkins-slave\workspace\maven-plugins-ITs-m3-windows\maven-dependency-plugin\target\local-repo\org\apache\maven\plugins\maven-linkcheck-plugin\1.3-SNAPSHOT\maven-linkcheck-plugin-1.3-SNAPSHOT.pom
[INFO] Installing F:\jenkins\jenkins-slave\workspace\maven-plugins-ITs-m3-windows\maven-linkcheck-plugin\target\maven-linkcheck-plugin-1.3-SNAPSHOT.jar
to F:\jenkins\jenkins-slave\workspace\maven-plugins-ITs-m3-windows\maven-dependency-plugin\target\local-repo\org\apache\maven\plugins\maven-linkcheck-plugin\1.3-SNAPSHOT\maven-linkcheck-plugin-1.3-SNAPSHOT.jar
[INFO] Installing F:\jenkins\jenkins-slave\workspace\maven-plugins-ITs-m3-windows\maven-linkcheck-plugin\pom.xml
to F:\jenkins\jenkins-slave\workspace\maven-plugins-ITs-m3-windows\maven-dependency-plugin\target\local-repo\org\apache\maven\plugins\maven-linkcheck-plugin\1.3-SNAPSHOT\maven-linkcheck-plugin-1.3-SNAPSHOT.pom
[INFO] Installing F:\jenkins\jenkins-slave\workspace\maven-plugins-ITs-m3-windows\maven-patch-plugin\pom.xml
to F:\jenkins\jenkins-slave\workspace\maven-plugins-ITs-m3-windows\maven-dependency-plugin\target\local-repo\org\apache\maven\plugins\maven-patch-plugin\1.3-SNAPSHOT\maven-patch-plugin-1.3-SNAPSHOT.pom
[INFO] Installing F:\jenkins\jenkins-slave\workspace\maven-plugins-ITs-m3-windows\maven-patch-plugin\target\maven-patch-plugin-1.3-SNAPSHOT.jar
to F:\jenkins\jenkins-slave\workspace\maven-plugins-ITs-m3-windows\maven-dependency-plugin\target\local-repo\org\apache\maven\plugins\maven-patch-plugin\1.3-SNAPSHOT\maven-patch-plugin-1.3-SNAPSHOT.jar
[INFO] Installing F:\jenkins\jenkins-slave\workspace\maven-plugins-ITs-m3-windows\maven-patch-plugin\pom.xml
to F:\jenkins\jenkins-slave\workspace\maven-plugins-ITs-m3-windows\maven-dependency-plugin\target\local-repo\org\apache\maven\plugins\maven-patch-plugin\1.3-SNAPSHOT\maven-patch-plugin-1.3-SNAPSHOT.pom
[INFO] Installing F:\jenkins\jenkins-slave\workspace\maven-plugins-ITs-m3-windows\maven-pdf-plugin\pom.xml
to F:\jenkins\jenkins-slave\workspace\maven-plugins-ITs-m3-windows\maven-dependency-plugin\target\local-repo\org\apache\maven\plugins\maven-pdf-plugin\1.4-SNAPSHOT\maven-pdf-plugin-1.4-SNAPSHOT.pom
[INFO] Installing F:\jenkins\jenkins-slave\workspace\maven-plugins-ITs-m3-windows\maven-pdf-plugin\target\maven-pdf-plugin-1.4-SNAPSHOT.jar
to F:\jenkins\jenkins-slave\workspace\maven-plugins-ITs-m3-windows\maven-dependency-plugin\target\local-repo\org\apache\maven\plugins\maven-pdf-plugin\1.4-SNAPSHOT\maven-pdf-plugin-1.4-SNAPSHOT.jar
[INFO] Installing F:\jenkins\jenkins-slave\workspace\maven-plugins-ITs-m3-windows\maven-pdf-plugin\pom.xml
to F:\jenkins\jenkins-slave\workspace\maven-plugins-ITs-m3-windows\maven-dependency-plugin\target\local-repo\org\apache\maven\plugins\maven-pdf-plugin\1.4-SNAPSHOT\maven-pdf-plugin-1.4-SNAPSHOT.pom
[INFO] Installing F:\jenkins\jenkins-slave\workspace\maven-plugins-ITs-m3-windows\maven-rar-plugin\pom.xml
to F:\jenkins\jenkins-slave\workspace\maven-plugins-ITs-m3-windows\maven-dependency-plugin\target\local-repo\org\apache\maven\plugins\maven-rar-plugin\3.0.0-SNAPSHOT\maven-rar-plugin-3.0.0-SNAPSHOT.pom
[INFO] Installing F:\jenkins\jenkins-slave\workspace\maven-plugins-ITs-m3-windows\maven-rar-plugin\target\maven-rar-plugin-3.0.0-SNAPSHOT.jar
to F:\jenkins\jenkins-slave\workspace\maven-plugins-ITs-m3-windows\maven-dependency-plugin\target\local-repo\org\apache\maven\plugins\maven-rar-plugin\3.0.0-SNAPSHOT\maven-rar-plugin-3.0.0-SNAPSHOT.jar
[INFO] Installing F:\jenkins\jenkins-slave\workspace\maven-plugins-ITs-m3-windows\maven-rar-plugin\pom.xml
to F:\jenkins\jenkins-slave\workspace\maven-plugins-ITs-m3-windows\maven-dependency-plugin\target\local-repo\org\apache\maven\plugins\maven-rar-plugin\3.0.0-SNAPSHOT\maven-rar-plugin-3.0.0-SNAPSHOT.pom
[INFO] Installing F:\jenkins\jenkins-slave\workspace\maven-plugins-ITs-m3-windows\maven-repository-plugin\pom.xml
to F:\jenkins\jenkins-slave\workspace\maven-plugins-ITs-m3-windows\maven-dependency-plugin\target\local-repo\org\apache\maven\plugins\maven-repository-plugin\2.5-SNAPSHOT\maven-repository-plugin-2.5-SNAPSHOT.pom
[INFO] Installing F:\jenkins\jenkins-slave\workspace\maven-plugins-ITs-m3-windows\maven-repository-plugin\target\maven-repository-plugin-2.5-SNAPSHOT.jar
to F:\jenkins\jenkins-slave\workspace\maven-plugins-ITs-m3-windows\maven-dependency-plugin\target\local-repo\org\apache\maven\plugins\maven-repository-plugin\2.5-SNAPSHOT\maven-repository-plugin-2.5-SNAPSHOT.jar
[INFO] Installing F:\jenkins\jenkins-slave\workspace\maven-plugins-ITs-m3-windows\maven-repository-plugin\pom.xml
to F:\jenkins\jenkins-slave\workspace\maven-plugins-ITs-m3-windows\maven-dependency-plugin\target\local-repo\org\apache\maven\plugins\maven-repository-plugin\2.5-SNAPSHOT\maven-repository-plugin-2.5-SNAPSHOT.pom
[INFO] Installing F:\jenkins\jenkins-slave\workspace\maven-plugins-ITs-m3-windows\maven-resources-plugin\pom.xml
to F:\jenkins\jenkins-slave\workspace\maven-plugins-ITs-m3-windows\maven-dependency-plugin\target\local-repo\org\apache\maven\plugins\maven-resources-plugin\3.0.0-SNAPSHOT\maven-resources-plugin-3.0.0-SNAPSHOT.pom
[INFO] Installing F:\jenkins\jenkins-slave\workspace\maven-plugins-ITs-m3-windows\maven-resources-plugin\target\maven-resources-plugin-3.0.0-SNAPSHOT.jar
to F:\jenkins\jenkins-slave\workspace\maven-plugins-ITs-m3-windows\maven-dependency-plugin\target\local-repo\org\apache\maven\plugins\maven-resources-plugin\3.0.0-SNAPSHOT\maven-resources-plugin-3.0.0-SNAPSHOT.jar
[INFO] Installing F:\jenkins\jenkins-slave\workspace\maven-plugins-ITs-m3-windows\maven-resources-plugin\pom.xml
to F:\jenkins\jenkins-slave\workspace\maven-plugins-ITs-m3-windows\maven-dependency-plugin\target\local-repo\org\apache\maven\plugins\maven-resources-plugin\3.0.0-SNAPSHOT\maven-resources-plugin-3.0.0-SNAPSHOT.pom
[INFO] Installing F:\jenkins\jenkins-slave\workspace\maven-plugins-ITs-m3-windows\maven-resources-plugin\target\maven-resources-plugin-3.0.0-SNAPSHOT-tests.jar
to F:\jenkins\jenkins-slave\workspace\maven-plugins-ITs-m3-windows\maven-dependency-plugin\target\local-repo\org\apache\maven\plugins\maven-resources-plugin\3.0.0-SNAPSHOT\maven-resources-plugin-3.0.0-SNAPSHOT-tests.jar
[INFO] Installing F:\jenkins\jenkins-slave\workspace\maven-plugins-ITs-m3-windows\maven-site-plugin\dependency-reduced-pom.xml
to F:\jenkins\jenkins-slave\workspace\maven-plugins-ITs-m3-windows\maven-dependency-plugin\target\local-repo\org\apache\maven\plugins\maven-site-plugin\3.6-SNAPSHOT\maven-site-plugin-3.6-SNAPSHOT.pom
[INFO] Installing F:\jenkins\jenkins-slave\workspace\maven-plugins-ITs-m3-windows\maven-site-plugin\target\maven-site-plugin-3.6-SNAPSHOT.jar
to F:\jenkins\jenkins-slave\workspace\maven-plugins-ITs-m3-windows\maven-dependency-plugin\target\local-repo\org\apache\maven\plugins\maven-site-plugin\3.6-SNAPSHOT\maven-site-plugin-3.6-SNAPSHOT.jar
[INFO] Installing F:\jenkins\jenkins-slave\workspace\maven-plugins-ITs-m3-windows\maven-site-plugin\dependency-reduced-pom.xml
to F:\jenkins\jenkins-slave\workspace\maven-plugins-ITs-m3-windows\maven-dependency-plugin\target\local-repo\org\apache\maven\plugins\maven-site-plugin\3.6-SNAPSHOT\maven-site-plugin-3.6-SNAPSHOT.pom
[INFO] Installing F:\jenkins\jenkins-slave\workspace\maven-plugins-ITs-m3-windows\maven-source-plugin\pom.xml
to F:\jenkins\jenkins-slave\workspace\maven-plugins-ITs-m3-windows\maven-dependency-plugin\target\local-repo\org\apache\maven\plugins\maven-source-plugin\3.0.1-SNAPSHOT\maven-source-plugin-3.0.1-SNAPSHOT.pom
[INFO] Installing F:\jenkins\jenkins-slave\workspace\maven-plugins-ITs-m3-windows\maven-source-plugin\target\maven-source-plugin-3.0.1-SNAPSHOT.jar
to F:\jenkins\jenkins-slave\workspace\maven-plugins-ITs-m3-windows\maven-dependency-plugin\target\local-repo\org\apache\maven\plugins\maven-source-plugin\3.0.1-SNAPSHOT\maven-source-plugin-3.0.1-SNAPSHOT.jar
[INFO] Installing F:\jenkins\jenkins-slave\workspace\maven-plugins-ITs-m3-windows\maven-source-plugin\pom.xml
to F:\jenkins\jenkins-slave\workspace\maven-plugins-ITs-m3-windows\maven-dependency-plugin\target\local-repo\org\apache\maven\plugins\maven-source-plugin\3.0.1-SNAPSHOT\maven-source-plugin-3.0.1-SNAPSHOT.pom
[INFO] Installing F:\jenkins\jenkins-slave\workspace\maven-plugins-ITs-m3-windows\maven-stage-plugin\pom.xml
to F:\jenkins\jenkins-slave\workspace\maven-plugins-ITs-m3-windows\maven-dependency-plugin\target\local-repo\org\apache\maven\plugins\maven-stage-plugin\1.1-SNAPSHOT\maven-stage-plugin-1.1-SNAPSHOT.pom
[INFO] Installing F:\jenkins\jenkins-slave\workspace\maven-plugins-ITs-m3-windows\maven-stage-plugin\target\maven-stage-plugin-1.1-SNAPSHOT.jar
to F:\jenkins\jenkins-slave\workspace\maven-plugins-ITs-m3-windows\maven-dependency-plugin\target\local-repo\org\apache\maven\plugins\maven-stage-plugin\1.1-SNAPSHOT\maven-stage-plugin-1.1-SNAPSHOT.jar
[INFO] Installing F:\jenkins\jenkins-slave\workspace\maven-plugins-ITs-m3-windows\maven-stage-plugin\pom.xml
to F:\jenkins\jenkins-slave\workspace\maven-plugins-ITs-m3-windows\maven-dependency-plugin\target\local-repo\org\apache\maven\plugins\maven-stage-plugin\1.1-SNAPSHOT\maven-stage-plugin-1.1-SNAPSHOT.pom
[INFO] Installing F:\jenkins\jenkins-slave\workspace\maven-plugins-ITs-m3-windows\maven-toolchains-plugin\pom.xml
to F:\jenkins\jenkins-slave\workspace\maven-plugins-ITs-m3-windows\maven-dependency-plugin\target\local-repo\org\apache\maven\plugins\maven-toolchains-plugin\1.2-SNAPSHOT\maven-toolchains-plugin-1.2-SNAPSHOT.pom
[INFO] Installing F:\jenkins\jenkins-slave\workspace\maven-plugins-ITs-m3-windows\maven-toolchains-plugin\target\maven-toolchains-plugin-1.2-SNAPSHOT.jar
to F:\jenkins\jenkins-slave\workspace\maven-plugins-ITs-m3-windows\maven-dependency-plugin\target\local-repo\org\apache\maven\plugins\maven-toolchains-plugin\1.2-SNAPSHOT\maven-toolchains-plugin-1.2-SNAPSHOT.jar
[INFO] Installing F:\jenkins\jenkins-slave\workspace\maven-plugins-ITs-m3-windows\maven-toolchains-plugin\pom.xml
to F:\jenkins\jenkins-slave\workspace\maven-plugins-ITs-m3-windows\maven-dependency-plugin\target\local-repo\org\apache\maven\plugins\maven-toolchains-plugin\1.2-SNAPSHOT\maven-toolchains-plugin-1.2-SNAPSHOT.pom
[INFO] Installing F:\jenkins\jenkins-slave\workspace\maven-plugins-ITs-m3-windows\maven-verifier-plugin\pom.xml
to F:\jenkins\jenkins-slave\workspace\maven-plugins-ITs-m3-windows\maven-dependency-plugin\target\local-repo\org\apache\maven\plugins\maven-verifier-plugin\3.0.0-SNAPSHOT\maven-verifier-plugin-3.0.0-SNAPSHOT.pom
[INFO] Installing F:\jenkins\jenkins-slave\workspace\maven-plugins-ITs-m3-windows\maven-verifier-plugin\target\maven-verifier-plugin-3.0.0-SNAPSHOT.jar
to F:\jenkins\jenkins-slave\workspace\maven-plugins-ITs-m3-windows\maven-dependency-plugin\target\local-repo\org\apache\maven\plugins\maven-verifier-plugin\3.0.0-SNAPSHOT\maven-verifier-plugin-3.0.0-SNAPSHOT.jar
[INFO] Installing F:\jenkins\jenkins-slave\workspace\maven-plugins-ITs-m3-windows\maven-verifier-plugin\pom.xml
to F:\jenkins\jenkins-slave\workspace\maven-plugins-ITs-m3-windows\maven-dependency-plugin\target\local-repo\org\apache\maven\plugins\maven-verifier-plugin\3.0.0-SNAPSHOT\maven-verifier-plugin-3.0.0-SNAPSHOT.pom
[INFO] Installing F:\jenkins\jenkins-slave\workspace\maven-plugins-ITs-m3-windows\maven-war-plugin\pom.xml
to F:\jenkins\jenkins-slave\workspace\maven-plugins-ITs-m3-windows\maven-dependency-plugin\target\local-repo\org\apache\maven\plugins\maven-war-plugin\3.0.0-SNAPSHOT\maven-war-plugin-3.0.0-SNAPSHOT.pom
[INFO] Installing F:\jenkins\jenkins-slave\workspace\maven-plugins-ITs-m3-windows\maven-war-plugin\target\maven-war-plugin-3.0.0-SNAPSHOT.jar
to F:\jenkins\jenkins-slave\workspace\maven-plugins-ITs-m3-windows\maven-dependency-plugin\target\local-repo\org\apache\maven\plugins\maven-war-plugin\3.0.0-SNAPSHOT\maven-war-plugin-3.0.0-SNAPSHOT.jar
[INFO] Installing F:\jenkins\jenkins-slave\workspace\maven-plugins-ITs-m3-windows\maven-war-plugin\pom.xml
to F:\jenkins\jenkins-slave\workspace\maven-plugins-ITs-m3-windows\maven-dependency-plugin\target\local-repo\org\apache\maven\plugins\maven-war-plugin\3.0.0-SNAPSHOT\maven-war-plugin-3.0.0-SNAPSHOT.pom
[INFO] Installing F:\jenkins\jenkins-slave\workspace\maven-plugins-ITs-m3-windows\maven-doap-plugin\pom.xml
to F:\jenkins\jenkins-slave\workspace\maven-plugins-ITs-m3-windows\maven-dependency-plugin\target\local-repo\org\apache\maven\plugins\maven-doap-plugin\1.3-SNAPSHOT\maven-doap-plugin-1.3-SNAPSHOT.pom
[INFO] Installing F:\jenkins\jenkins-slave\workspace\maven-plugins-ITs-m3-windows\maven-doap-plugin\target\maven-doap-plugin-1.3-SNAPSHOT.jar
to F:\jenkins\jenkins-slave\workspace\maven-plugins-ITs-m3-windows\maven-dependency-plugin\target\local-repo\org\apache\maven\plugins\maven-doap-plugin\1.3-SNAPSHOT\maven-doap-plugin-1.3-SNAPSHOT.jar
[INFO] Installing F:\jenkins\jenkins-slave\workspace\maven-plugins-ITs-m3-windows\maven-doap-plugin\pom.xml
to F:\jenkins\jenkins-slave\workspace\maven-plugins-ITs-m3-windows\maven-dependency-plugin\target\local-repo\org\apache\maven\plugins\maven-doap-plugin\1.3-SNAPSHOT\maven-doap-plugin-1.3-SNAPSHOT.pom
[INFO] Installing F:\jenkins\jenkins-slave\workspace\maven-plugins-ITs-m3-windows\maven-pmd-plugin\pom.xml
to F:\jenkins\jenkins-slave\workspace\maven-plugins-ITs-m3-windows\maven-dependency-plugin\target\local-repo\org\apache\maven\plugins\maven-pmd-plugin\3.7-SNAPSHOT\maven-pmd-plugin-3.7-SNAPSHOT.pom
[INFO] Installing F:\jenkins\jenkins-slave\workspace\maven-plugins-ITs-m3-windows\maven-pmd-plugin\target\maven-pmd-plugin-3.7-SNAPSHOT.jar
to F:\jenkins\jenkins-slave\workspace\maven-plugins-ITs-m3-windows\maven-dependency-plugin\target\local-repo\org\apache\maven\plugins\maven-pmd-plugin\3.7-SNAPSHOT\maven-pmd-plugin-3.7-SNAPSHOT.jar
[INFO] Installing F:\jenkins\jenkins-slave\workspace\maven-plugins-ITs-m3-windows\maven-pmd-plugin\pom.xml
to F:\jenkins\jenkins-slave\workspace\maven-plugins-ITs-m3-windows\maven-dependency-plugin\target\local-repo\org\apache\maven\plugins\maven-pmd-plugin\3.7-SNAPSHOT\maven-pmd-plugin-3.7-SNAPSHOT.pom
[INFO] Installing F:\jenkins\jenkins-slave\workspace\maven-plugins-ITs-m3-windows\maven-invoker-plugin\pom.xml
to F:\jenkins\jenkins-slave\workspace\maven-plugins-ITs-m3-windows\maven-dependency-plugin\target\local-repo\org\apache\maven\plugins\maven-invoker-plugin\2.0.1-SNAPSHOT\maven-invoker-plugin-2.0.1-SNAPSHOT.pom
[INFO] Installing F:\jenkins\jenkins-slave\workspace\maven-plugins-ITs-m3-windows\maven-invoker-plugin\target\maven-invoker-plugin-2.0.1-SNAPSHOT.jar
to F:\jenkins\jenkins-slave\workspace\maven-plugins-ITs-m3-windows\maven-dependency-plugin\target\local-repo\org\apache\maven\plugins\maven-invoker-plugin\2.0.1-SNAPSHOT\maven-invoker-plugin-2.0.1-SNAPSHOT.jar
[INFO] Installing F:\jenkins\jenkins-slave\workspace\maven-plugins-ITs-m3-windows\maven-invoker-plugin\pom.xml
to F:\jenkins\jenkins-slave\workspace\maven-plugins-ITs-m3-windows\maven-dependency-plugin\target\local-repo\org\apache\maven\plugins\maven-invoker-plugin\2.0.1-SNAPSHOT\maven-invoker-plugin-2.0.1-SNAPSHOT.pom
[INFO] Installing F:\jenkins\jenkins-slave\workspace\maven-plugins-ITs-m3-windows\maven-jar-plugin\pom.xml
to F:\jenkins\jenkins-slave\workspace\maven-plugins-ITs-m3-windows\maven-dependency-plugin\target\local-repo\org\apache\maven\plugins\maven-jar-plugin\3.0.1-SNAPSHOT\maven-jar-plugin-3.0.1-SNAPSHOT.pom
[INFO] Installing F:\jenkins\jenkins-slave\workspace\maven-plugins-ITs-m3-windows\maven-jar-plugin\target\maven-jar-plugin-3.0.1-SNAPSHOT.jar
to F:\jenkins\jenkins-slave\workspace\maven-plugins-ITs-m3-windows\maven-dependency-plugin\target\local-repo\org\apache\maven\plugins\maven-jar-plugin\3.0.1-SNAPSHOT\maven-jar-plugin-3.0.1-SNAPSHOT.jar
[INFO] Installing F:\jenkins\jenkins-slave\workspace\maven-plugins-ITs-m3-windows\maven-jar-plugin\pom.xml
to F:\jenkins\jenkins-slave\workspace\maven-plugins-ITs-m3-windows\maven-dependency-plugin\target\local-repo\org\apache\maven\plugins\maven-jar-plugin\3.0.1-SNAPSHOT\maven-jar-plugin-3.0.1-SNAPSHOT.pom
[INFO] Installing F:\jenkins\jenkins-slave\workspace\maven-plugins-ITs-m3-windows\maven-checkstyle-plugin\pom.xml
to F:\jenkins\jenkins-slave\workspace\maven-plugins-ITs-m3-windows\maven-dependency-plugin\target\local-repo\org\apache\maven\plugins\maven-checkstyle-plugin\2.18-SNAPSHOT\maven-checkstyle-plugin-2.18-SNAPSHOT.pom
[INFO] Installing F:\jenkins\jenkins-slave\workspace\maven-plugins-ITs-m3-windows\maven-checkstyle-plugin\target\maven-checkstyle-plugin-2.18-SNAPSHOT.jar
to F:\jenkins\jenkins-slave\workspace\maven-plugins-ITs-m3-windows\maven-dependency-plugin\target\local-repo\org\apache\maven\plugins\maven-checkstyle-plugin\2.18-SNAPSHOT\maven-checkstyle-plugin-2.18-SNAPSHOT.jar
[INFO] Installing F:\jenkins\jenkins-slave\workspace\maven-plugins-ITs-m3-windows\maven-checkstyle-plugin\pom.xml
to F:\jenkins\jenkins-slave\workspace\maven-plugins-ITs-m3-windows\maven-dependency-plugin\target\local-repo\org\apache\maven\plugins\maven-checkstyle-plugin\2.18-SNAPSHOT\maven-checkstyle-plugin-2.18-SNAPSHOT.pom
[INFO] Installing F:\jenkins\jenkins-slave\workspace\maven-plugins-ITs-m3-windows\maven-project-info-reports-plugin\pom.xml
to F:\jenkins\jenkins-slave\workspace\maven-plugins-ITs-m3-windows\maven-dependency-plugin\target\local-repo\org\apache\maven\plugins\maven-project-info-reports-plugin\2.10-SNAPSHOT\maven-project-info-reports-plugin-2.10-SNAPSHOT.pom
[INFO] Installing F:\jenkins\jenkins-slave\workspace\maven-plugins-ITs-m3-windows\maven-project-info-reports-plugin\target\maven-project-info-reports-plugin-2.10-SNAPSHOT.jar
to F:\jenkins\jenkins-slave\workspace\maven-plugins-ITs-m3-windows\maven-dependency-plugin\target\local-repo\org\apache\maven\plugins\maven-project-info-reports-plugin\2.10-SNAPSHOT\maven-project-info-reports-plugin-2.10-SNAPSHOT.jar
[INFO] Installing F:\jenkins\jenkins-slave\workspace\maven-plugins-ITs-m3-windows\maven-project-info-reports-plugin\pom.xml
to F:\jenkins\jenkins-slave\workspace\maven-plugins-ITs-m3-windows\maven-dependency-plugin\target\local-repo\org\apache\maven\plugins\maven-project-info-reports-plugin\2.10-SNAPSHOT\maven-project-info-reports-plugin-2.10-SNAPSHOT.pom
[INFO] Installing F:\jenkins\jenkins-slave\workspace\maven-plugins-ITs-m3-windows\maven-remote-resources-plugin\pom.xml
to F:\jenkins\jenkins-slave\workspace\maven-plugins-ITs-m3-windows\maven-dependency-plugin\target\local-repo\org\apache\maven\plugins\maven-remote-resources-plugin\1.6-SNAPSHOT\maven-remote-resources-plugin-1.6-SNAPSHOT.pom
[INFO] Installing F:\jenkins\jenkins-slave\workspace\maven-plugins-ITs-m3-windows\maven-remote-resources-plugin\target\maven-remote-resources-plugin-1.6-SNAPSHOT.jar
to F:\jenkins\jenkins-slave\workspace\maven-plugins-ITs-m3-windows\maven-dependency-plugin\target\local-repo\org\apache\maven\plugins\maven-remote-resources-plugin\1.6-SNAPSHOT\maven-remote-resources-plugin-1.6-SNAPSHOT.jar
[INFO] Installing F:\jenkins\jenkins-slave\workspace\maven-plugins-ITs-m3-windows\maven-remote-resources-plugin\pom.xml
to F:\jenkins\jenkins-slave\workspace\maven-plugins-ITs-m3-windows\maven-dependency-plugin\target\local-repo\org\apache\maven\plugins\maven-remote-resources-plugin\1.6-SNAPSHOT\maven-remote-resources-plugin-1.6-SNAPSHOT.pom
[INFO] Installing F:\jenkins\jenkins-slave\workspace\maven-plugins-ITs-m3-windows\maven-shade-plugin\pom.xml
to F:\jenkins\jenkins-slave\workspace\maven-plugins-ITs-m3-windows\maven-dependency-plugin\target\local-repo\org\apache\maven\plugins\maven-shade-plugin\3.0.0-SNAPSHOT\maven-shade-plugin-3.0.0-SNAPSHOT.pom
[INFO]                                                                         
[INFO] ------------------------------------------------------------------------
[INFO] Building Apache Maven Plugins Aggregator 1-SNAPSHOT
[INFO] ------------------------------------------------------------------------
[INFO] 
[INFO] --- maven-clean-plugin:2.5:clean (default-clean) @ maven-plugins-aggregator ---
[INFO] Deleting <https://builds.apache.org/job/maven-plugins-ITs-m3-windows/ws/target>
[INFO] 
[INFO] --- maven-enforcer-plugin:1.3.1:enforce (enforce-bytecode-version) @ maven-plugins-aggregator
---
[INFO] 
[INFO] --- maven-enforcer-plugin:1.3.1:enforce (ban-known-bad-maven-versions) @ maven-plugins-aggregator
---
[INFO] 
[INFO] --- maven-remote-resources-plugin:1.5:process (default) @ maven-plugins-aggregator
---
[INFO] 
[INFO] --- maven-site-plugin:3.3:attach-descriptor (attach-descriptor) @ maven-plugins-aggregator
---
[INFO] 
[INFO] --- maven-install-plugin:2.5.1:install (default-install) @ maven-plugins-aggregator
---
[INFO] Installing <https://builds.apache.org/job/maven-plugins-ITs-m3-windows/ws/pom.xml>
to C:\.m2\repository\org\apache\maven\plugins\maven-plugins-aggregator\1-SNAPSHOT\maven-plugins-aggregator-1-SNAPSHOT.pom
[INFO] ------------------------------------------------------------------------
[INFO] Reactor Summary:
[INFO] 
[INFO] Apache Maven ACR Plugin ............................ SUCCESS [ 48.243 s]
[INFO] Apache Maven Ant Plugin ............................ SUCCESS [02:12 min]
[INFO] Apache Maven AntRun Plugin ......................... SUCCESS [01:30 min]
[INFO] Apache Maven Changelog Plugin ...................... SUCCESS [01:22 min]
[INFO] Apache Maven Changes Plugin ........................ SUCCESS [01:43 min]
[INFO] Apache Maven Clean Plugin .......................... SUCCESS [ 36.550 s]
[INFO] Apache Maven Compiler Plugin ....................... SUCCESS [03:34 min]
[INFO] Apache Maven Deploy Plugin ......................... FAILURE [02:43 min]
[INFO] Apache Maven Documentation Checker Plugin .......... SUCCESS [  7.396 s]
[INFO] Apache Maven EAR Plugin ............................ SUCCESS [08:53 min]
[INFO] Apache Maven EJB Plugin ............................ SUCCESS [01:10 min]
[INFO] Apache Maven Help Plugin ........................... SUCCESS [01:23 min]
[INFO] Apache Maven Install Plugin ........................ SUCCESS [02:18 min]
[INFO] Apache Maven Jarsigner Plugin ...................... SUCCESS [01:19 min]
[INFO] Apache Maven Javadoc Plugin ........................ SUCCESS [07:16 min]
[INFO] Apache Maven Linkcheck Plugin ...................... SUCCESS [  4.490 s]
[INFO] Apache Maven Patch Plugin .......................... SUCCESS [  7.697 s]
[INFO] Apache Maven PDF Plugin ............................ SUCCESS [ 52.623 s]
[INFO] Apache Maven RAR Plugin ............................ SUCCESS [ 21.756 s]
[INFO] Apache Maven Repository Plugin ..................... SUCCESS [ 54.115 s]
[INFO] Apache Maven Resources Plugin ...................... SUCCESS [02:17 min]
[INFO] Apache Maven Site Plugin ........................... SUCCESS [12:34 min]
[INFO] Apache Maven Source Plugin ......................... SUCCESS [01:43 min]
[INFO] Apache Maven Stage Plugin .......................... SUCCESS [  3.037 s]
[INFO] Apache Maven Toolchains Plugin ..................... SUCCESS [ 28.274 s]
[INFO] Apache Maven Verifier Plugin ....................... SUCCESS [ 15.915 s]
[INFO] Apache Maven WAR Plugin ............................ SUCCESS [02:49 min]
[INFO] Apache Maven DOAP Plugin ........................... SUCCESS [ 31.277 s]
[INFO] Apache Maven PMD Plugin ............................ SUCCESS [03:49 min]
[INFO] Apache Maven Invoker Plugin ........................ SUCCESS [09:22 min]
[INFO] Apache Maven JAR Plugin ............................ SUCCESS [03:02 min]
[INFO] Apache Maven Checkstyle Plugin ..................... SUCCESS [08:27 min]
[INFO] Apache Maven Project Info Reports Plugin ........... SUCCESS [05:05 min]
[INFO] Apache Maven Remote Resources Plugin ............... SUCCESS [01:49 min]
[INFO] Apache Maven Shade Plugin .......................... FAILURE [  7.722 s]
[INFO] Apache Maven SCM Publish Plugin .................... FAILURE [  4.435 s]
[INFO] Apache Maven Assembly Plugin ....................... FAILURE [ 28.253 s]
[INFO] Apache Maven Dependency Plugin ..................... FAILURE [01:41 min]
[INFO] Apache Maven Plugins Aggregator .................... SUCCESS [  1.614 s]
[INFO] ------------------------------------------------------------------------
[INFO] BUILD FAILURE
[INFO] ------------------------------------------------------------------------
[INFO] Total time: 01:34 h
[INFO] Finished at: 2016-05-14T07:54:27-07:00
[INFO] Final Memory: 157M/492M
[INFO] ------------------------------------------------------------------------
[WARNING] The requested profile "apache.snapshots" could not be activated because it does
not exist.
[ERROR] Failed to execute goal org.apache.maven.plugins:maven-invoker-plugin:2.0.0:verify
(integration-test) on project maven-deploy-plugin: 1 build failed. See console output above
for details. -> [Help 1]
[ERROR] Failed to execute goal org.apache.maven.plugins:maven-surefire-plugin:2.18.1:test
(default-test) on project maven-shade-plugin: There are test failures.
[ERROR] 
[ERROR] Please refer to F:\jenkins\jenkins-slave\workspace\maven-plugins-ITs-m3-windows\maven-shade-plugin\target\surefire-reports
for the individual test results.
[ERROR] -> [Help 1]
[ERROR] Failed to execute goal org.apache.maven.plugins:maven-invoker-plugin:2.0.0:install
(integration-test) on project maven-scm-publish-plugin: Failed to install project dependencies:
MavenProject: org.apache.maven.plugins:maven-scm-publish-plugin:1.2-SNAPSHOT @ F:\jenkins\jenkins-slave\workspace\maven-plugins-ITs-m3-windows\maven-scm-publish-plugin\pom.xml:
Failed to install project artifacts: MavenProject: org.apache.maven.plugins:maven-shade-plugin:3.0.0-SNAPSHOT
@ F:\jenkins\jenkins-slave\workspace\maven-plugins-ITs-m3-windows\maven-shade-plugin\pom.xml:
Failed to install artifact: org.apache.maven.plugins:maven-shade-plugin:maven-plugin:3.0.0-SNAPSHOT:
Artifact is not fully assembled: F:\jenkins\jenkins-slave\workspace\maven-plugins-ITs-m3-windows\maven-shade-plugin\target\classes
-> [Help 2]
[ERROR] Failed to execute goal org.apache.maven.plugins:maven-invoker-plugin:2.0.0:install
(integration-test) on project maven-assembly-plugin: Failed to install project dependencies:
MavenProject: org.apache.maven.plugins:maven-assembly-plugin:3.0-SNAPSHOT @ F:\jenkins\jenkins-slave\workspace\maven-plugins-ITs-m3-windows\maven-assembly-plugin\pom.xml:
Failed to install project artifacts: MavenProject: org.apache.maven.plugins:maven-shade-plugin:3.0.0-SNAPSHOT
@ F:\jenkins\jenkins-slave\workspace\maven-plugins-ITs-m3-windows\maven-shade-plugin\pom.xml:
Failed to install artifact: org.apache.maven.plugins:maven-shade-plugin:maven-plugin:3.0.0-SNAPSHOT:
Artifact is not fully assembled: F:\jenkins\jenkins-slave\workspace\maven-plugins-ITs-m3-windows\maven-shade-plugin\target\classes
-> [Help 2]
[ERROR] Failed to execute goal org.apache.maven.plugins:maven-invoker-plugin:2.0.0:install
(integration-test) on project maven-dependency-plugin: Failed to install project dependencies:
MavenProject: org.apache.maven.plugins:maven-dependency-plugin:3.0-SNAPSHOT @ F:\jenkins\jenkins-slave\workspace\maven-plugins-ITs-m3-windows\maven-dependency-plugin\pom.xml:
Failed to install project artifacts: MavenProject: org.apache.maven.plugins:maven-shade-plugin:3.0.0-SNAPSHOT
@ F:\jenkins\jenkins-slave\workspace\maven-plugins-ITs-m3-windows\maven-shade-plugin\pom.xml:
Failed to install artifact: org.apache.maven.plugins:maven-shade-plugin:maven-plugin:3.0.0-SNAPSHOT:
Artifact is not fully assembled: F:\jenkins\jenkins-slave\workspace\maven-plugins-ITs-m3-windows\maven-shade-plugin\target\classes
-> [Help 2]
[ERROR] 
[ERROR] To see the full stack trace of the errors, re-run Maven with the -e switch.
[ERROR] Re-run Maven using the -X switch to enable full debug logging.
[ERROR] 
[ERROR] For more information about the errors and possible solutions, please read the following
articles:
[ERROR] [Help 1] http://cwiki.apache.org/confluence/display/MAVEN/MojoFailureException
[ERROR] [Help 2] http://cwiki.apache.org/confluence/display/MAVEN/MojoExecutionException
[ERROR] 
[ERROR] After correcting the problems, you can resume the build with the command
[ERROR]   mvn <goals> -rf :maven-deploy-plugin
Build step 'Invoke top-level Maven targets' marked build as failure
Deleting 1 temporary files
Recording test results

Mime
View raw message