maven-notifications mailing list archives

Site index · List index
Message view « Date » · « Thread »
Top « Date » · « Thread »
From Apache Jenkins Server <jenk...@builds.apache.org>
Subject Build failed in Jenkins: maven-plugins-ITs-m3.0.4 #1601
Date Thu, 05 May 2016 23:19:29 GMT
See <https://builds.apache.org/job/maven-plugins-ITs-m3.0.4/1601/changes>

Changes:

[khmarbaise] [maven-release-plugin] prepare for next development iteration

[khmarbaise] [maven-release-plugin] prepare release maven-resources-plugin-3.0.0

[khmarbaise] Code Polishing
 o Prevent assignment to parameters.

[khmarbaise] Bump to 3.0.0-SNAPSHOT

[khmarbaise] Fixed checkstyle reported errors/warnings.

------------------------------------------
[...truncated 2371 lines...]
[INFO] Compiling 4 source files to <https://builds.apache.org/job/maven-plugins-ITs-m3.0.4/ws/maven-jar-plugin/target/classes>
[INFO] 
[INFO] --- maven-plugin-plugin:3.4:descriptor (default-descriptor) @ maven-jar-plugin ---
[INFO] Using 'UTF-8' encoding to read mojo metadata.
[INFO] Mojo extractor with id: java-annotations found 3 mojo descriptors.
[INFO] Mojo extractor with id: java-javadoc found 0 mojo descriptors.
[INFO] 
[INFO] --- maven-resources-plugin:2.7:testResources (default-testResources) @ maven-jar-plugin
---
[INFO] Using 'UTF-8' encoding to copy filtered resources.
[INFO] Copying 2 resources
[INFO] Copying 3 resources
[INFO] 
[INFO] --- maven-compiler-plugin:3.2:testCompile (default-testCompile) @ maven-jar-plugin
---
[INFO] Changes detected - recompiling the module!
[INFO] Compiling 2 source files to <https://builds.apache.org/job/maven-plugins-ITs-m3.0.4/ws/maven-jar-plugin/target/test-classes>
[INFO] <https://builds.apache.org/job/maven-plugins-ITs-m3.0.4/ws/maven-jar-plugin/src/test/java/org/apache/maven/plugins/jar/MockArtifact.java>
uses or overrides a deprecated API.
[INFO] Recompile with -Xlint:deprecation for details.
[INFO] <https://builds.apache.org/job/maven-plugins-ITs-m3.0.4/ws/maven-jar-plugin/src/test/java/org/apache/maven/plugins/jar/MockArtifact.java>
uses unchecked or unsafe operations.
[INFO] Recompile with -Xlint:unchecked for details.
[INFO] 
[INFO] --- maven-surefire-plugin:2.18.1:test (default-test) @ maven-jar-plugin ---
[INFO] Surefire report directory: <https://builds.apache.org/job/maven-plugins-ITs-m3.0.4/ws/maven-jar-plugin/target/surefire-reports>

-------------------------------------------------------
 T E S T S
-------------------------------------------------------
#
# There is insufficient memory for the Java Runtime Environment to continue.
# Cannot create GC thread. Out of system resources.
# An error report file with more information is saved as:
# <https://builds.apache.org/job/maven-plugins-ITs-m3.0.4/ws/maven-jar-plugin/hs_err_pid30351.log>

Results :

Tests run: 0, Failures: 0, Errors: 0, Skipped: 0

[INFO]                                                                         
[INFO] ------------------------------------------------------------------------
[INFO] Building Apache Maven GPG Plugin 1.7-SNAPSHOT
[INFO] ------------------------------------------------------------------------
[INFO] 
[INFO] --- maven-clean-plugin:2.5:clean (default-clean) @ maven-gpg-plugin ---
[INFO] Deleting <https://builds.apache.org/job/maven-plugins-ITs-m3.0.4/ws/maven-gpg-plugin/target>
[INFO] 
[INFO] --- maven-enforcer-plugin:1.3.1:enforce (enforce-bytecode-version) @ maven-gpg-plugin
---
[INFO] 
[INFO] --- maven-enforcer-plugin:1.3.1:enforce (ban-known-bad-maven-versions) @ maven-gpg-plugin
---
[INFO] 
[INFO] --- maven-enforcer-plugin:1.3.1:enforce (ensure-no-container-api) @ maven-gpg-plugin
---
[INFO] 
[INFO] --- apache-rat-plugin:0.11:check (rat-check) @ maven-gpg-plugin ---
[INFO] 51 implicit excludes (use -debug for more details).
[INFO] Exclude: src/test/resources/gnupg/*
[INFO] Exclude: DEPENDENCIES
[INFO] 66 resources included (use -debug for more details)
[INFO] Rat check: Summary of files. Unapproved: 0 unknown: 0 generated: 0 approved: 54 licence.
[INFO] 
[INFO] --- maven-plugin-plugin:3.4:helpmojo (generate-helpmojo) @ maven-gpg-plugin ---
[INFO] Using 'UTF-8' encoding to read mojo metadata.
[INFO] Mojo extractor with id: java-annotations found 0 mojo descriptors.
[INFO] Mojo extractor with id: java-javadoc found 0 mojo descriptors.
[INFO] 
[INFO] --- maven-remote-resources-plugin:1.5:process (default) @ maven-gpg-plugin ---
[INFO] 
[INFO] --- maven-resources-plugin:2.7:resources (default-resources) @ maven-gpg-plugin ---
[INFO] Using 'UTF-8' encoding to copy filtered resources.
[INFO] Copying 1 resource
[INFO] Copying 3 resources
[INFO] 
[INFO] --- maven-compiler-plugin:3.2:compile (default-compile) @ maven-gpg-plugin ---
[INFO] Changes detected - recompiling the module!
[INFO] Compiling 9 source files to <https://builds.apache.org/job/maven-plugins-ITs-m3.0.4/ws/maven-gpg-plugin/target/classes>
[INFO] Some input files use unchecked or unsafe operations.
[INFO] Recompile with -Xlint:unchecked for details.
[INFO] 
[INFO] --- maven-plugin-plugin:3.4:descriptor (default-descriptor) @ maven-gpg-plugin ---
[INFO] Using 'UTF-8' encoding to read mojo metadata.
[INFO] Mojo extractor with id: java-annotations found 3 mojo descriptors.
[INFO] Mojo extractor with id: java-javadoc found 0 mojo descriptors.
[INFO] 
[INFO] --- maven-resources-plugin:2.7:testResources (default-testResources) @ maven-gpg-plugin
---
[INFO] Using 'UTF-8' encoding to copy filtered resources.
[INFO] Copying 8 resources
[INFO] Copying 3 resources
[INFO] 
[INFO] --- maven-compiler-plugin:3.2:testCompile (default-testCompile) @ maven-gpg-plugin
---
[INFO] No sources to compile
[INFO] 
[INFO] --- maven-surefire-plugin:2.18.1:test (default-test) @ maven-gpg-plugin ---
[INFO] 
[INFO] --- maven-jar-plugin:2.5:jar (default-jar) @ maven-gpg-plugin ---
[INFO] Building jar: <https://builds.apache.org/job/maven-plugins-ITs-m3.0.4/ws/maven-gpg-plugin/target/maven-gpg-plugin-1.7-SNAPSHOT.jar>
[INFO] 
[INFO] --- maven-plugin-plugin:3.4:addPluginArtifactMetadata (default-addPluginArtifactMetadata)
@ maven-gpg-plugin ---
[INFO] 
[INFO] --- maven-invoker-plugin:2.0.0:install (integration-test) @ maven-gpg-plugin ---
[INFO] Installing <https://builds.apache.org/job/maven-plugins-ITs-m3.0.4/ws/maven-acr-plugin/pom.xml>
to <https://builds.apache.org/job/maven-plugins-ITs-m3.0.4/ws/maven-gpg-plugin/target/local-repo/org/apache/maven/plugins/maven-acr-plugin/3.0.1-SNAPSHOT/maven-acr-plugin-3.0.1-SNAPSHOT.pom>
[INFO]                                                                         
[INFO] ------------------------------------------------------------------------
[INFO] Building Apache Maven Plugins Aggregator 1-SNAPSHOT
[INFO] ------------------------------------------------------------------------
[INFO] 
[INFO] --- maven-clean-plugin:2.5:clean (default-clean) @ maven-plugins-aggregator ---
[INFO] Deleting <https://builds.apache.org/job/maven-plugins-ITs-m3.0.4/ws/target>
[INFO] 
[INFO] --- maven-enforcer-plugin:1.3.1:enforce (enforce-bytecode-version) @ maven-plugins-aggregator
---
[INFO] 
[INFO] --- maven-enforcer-plugin:1.3.1:enforce (ban-known-bad-maven-versions) @ maven-plugins-aggregator
---
[INFO] 
[INFO] --- maven-remote-resources-plugin:1.5:process (default) @ maven-plugins-aggregator
---
[INFO] 
[INFO] --- maven-site-plugin:3.3:attach-descriptor (attach-descriptor) @ maven-plugins-aggregator
---
[INFO] 
[INFO] --- maven-install-plugin:2.5.1:install (default-install) @ maven-plugins-aggregator
---
[INFO] Installing <https://builds.apache.org/job/maven-plugins-ITs-m3.0.4/ws/pom.xml>
to /home/jenkins/.m2/repository/org/apache/maven/plugins/maven-plugins-aggregator/1-SNAPSHOT/maven-plugins-aggregator-1-SNAPSHOT.pom
[INFO] ------------------------------------------------------------------------
[INFO] Reactor Summary:
[INFO] 
[INFO] Apache Maven ACR Plugin ........................... FAILURE [22.140s]
[INFO] Apache Maven Ant Plugin ........................... FAILURE [11.801s]
[INFO] Apache Maven AntRun Plugin ........................ FAILURE [3.948s]
[INFO] Apache Maven Changelog Plugin ..................... FAILURE [10.050s]
[INFO] Apache Maven Changes Plugin ....................... FAILURE [16.138s]
[INFO] Apache Maven Clean Plugin ......................... FAILURE [3.465s]
[INFO] Apache Maven Compiler Plugin ...................... FAILURE [15.540s]
[INFO] Apache Maven Deploy Plugin ........................ FAILURE [4.562s]
[INFO] Apache Maven Documentation Checker Plugin ......... FAILURE [3.122s]
[INFO] Apache Maven EAR Plugin ........................... FAILURE [7.105s]
[INFO] Apache Maven EJB Plugin ........................... FAILURE [4.425s]
[INFO] Apache Maven Help Plugin .......................... FAILURE [5.814s]
[INFO] Apache Maven Install Plugin ....................... FAILURE [4.536s]
[INFO] Apache Maven Jarsigner Plugin ..................... FAILURE [3.578s]
[INFO] Apache Maven Javadoc Plugin ....................... FAILURE [18.934s]
[INFO] Apache Maven Linkcheck Plugin ..................... FAILURE [6.734s]
[INFO] Apache Maven Patch Plugin ......................... FAILURE [1.164s]
[INFO] Apache Maven PDF Plugin ........................... FAILURE [12.230s]
[INFO] Apache Maven RAR Plugin ........................... FAILURE [2.340s]
[INFO] Apache Maven Repository Plugin .................... FAILURE [2.467s]
[INFO] Apache Maven Resources Plugin ..................... FAILURE [3.949s]
[INFO] Apache Maven Site Plugin .......................... FAILURE [12.992s]
[INFO] Apache Maven Source Plugin ........................ FAILURE [3.498s]
[INFO] Apache Maven Stage Plugin ......................... FAILURE [3.717s]
[INFO] Apache Maven Toolchains Plugin .................... FAILURE [2.847s]
[INFO] Apache Maven Verifier Plugin ...................... FAILURE [1.780s]
[INFO] Apache Maven WAR Plugin ........................... FAILURE [5.384s]
[INFO] Apache Maven DOAP Plugin .......................... FAILURE [4.400s]
[INFO] Apache Maven PMD Plugin ........................... FAILURE [15.233s]
[INFO] Apache Maven Invoker Plugin ....................... FAILURE [12.819s]
[INFO] Apache Maven JAR Plugin ........................... FAILURE [3.514s]
[INFO] Apache Maven GPG Plugin ........................... FAILURE [1.971s]
[INFO] Apache Maven Plugins Aggregator ................... SUCCESS [2.180s]
[INFO] ------------------------------------------------------------------------
[INFO] BUILD FAILURE
[INFO] ------------------------------------------------------------------------
[INFO] Total time: 3:57.695s
[INFO] Finished at: Thu May 05 23:19:31 UTC 2016
[INFO] Final Memory: 60M/424M
[INFO] ------------------------------------------------------------------------
[WARNING] The requested profile "apache.snapshots" could not be activated because it does
not exist.
[ERROR] Failed to execute goal org.apache.maven.plugins:maven-jar-plugin:2.5:jar (default-jar)
on project maven-acr-plugin: Error assembling JAR: Failed to read filesystem attributes for:
<https://builds.apache.org/job/maven-plugins-ITs-m3.0.4/ws/maven-acr-plugin/pom.xml>:
Failed to retrieve numeric file attributes using: '/bin/sh -c ls -1lad <https://builds.apache.org/job/maven-plugins-ITs-m3.0.4/ws/maven-acr-plugin/pom.xml'>:
Error while executing process. Cannot run program "/bin/sh": java.io.IOException: error=11,
Resource temporarily unavailable -> [Help 1]
[ERROR] Failed to execute goal org.apache.maven.plugins:maven-surefire-plugin:2.18.1:test
(default-test) on project maven-ant-plugin: Execution default-test of goal org.apache.maven.plugins:maven-surefire-plugin:2.18.1:test
failed: The forked VM terminated without properly saying goodbye. VM crash or System.exit
called?
[ERROR] Command was /bin/sh -c cd <https://builds.apache.org/job/maven-plugins-ITs-m3.0.4/ws/maven-ant-plugin>
&& /home/jenkins/tools/java/jdk1.6.0_45-32/jre/bin/java -jar <https://builds.apache.org/job/maven-plugins-ITs-m3.0.4/ws/maven-ant-plugin/target/surefire/surefirebooter2870959281396408692.jar>
<https://builds.apache.org/job/maven-plugins-ITs-m3.0.4/ws/maven-ant-plugin/target/surefire/surefire3398566147506069905tmp>
<https://builds.apache.org/job/maven-plugins-ITs-m3.0.4/ws/maven-ant-plugin/target/surefire/surefire_05554157311404959017tmp>
[ERROR] -> [Help 2]
[ERROR] Failed to execute goal org.apache.maven.plugins:maven-jar-plugin:2.5:jar (default-jar)
on project maven-antrun-plugin: Error assembling JAR: Failed to read filesystem attributes
for: <https://builds.apache.org/job/maven-plugins-ITs-m3.0.4/ws/maven-antrun-plugin/pom.xml>:
Failed to retrieve numeric file attributes using: '/bin/sh -c ls -1lad <https://builds.apache.org/job/maven-plugins-ITs-m3.0.4/ws/maven-antrun-plugin/pom.xml'>
-> [Help 1]
[ERROR] Failed to execute goal org.apache.maven.plugins:maven-surefire-plugin:2.18.1:test
(default-test) on project maven-changelog-plugin: Execution default-test of goal org.apache.maven.plugins:maven-surefire-plugin:2.18.1:test
failed: The forked VM terminated without properly saying goodbye. VM crash or System.exit
called?
[ERROR] Command was /bin/sh -c cd <https://builds.apache.org/job/maven-plugins-ITs-m3.0.4/ws/maven-changelog-plugin>
&& /home/jenkins/tools/java/jdk1.6.0_45-32/jre/bin/java -jar <https://builds.apache.org/job/maven-plugins-ITs-m3.0.4/ws/maven-changelog-plugin/target/surefire/surefirebooter1480064217478187588.jar>
<https://builds.apache.org/job/maven-plugins-ITs-m3.0.4/ws/maven-changelog-plugin/target/surefire/surefire6269748734150434300tmp>
<https://builds.apache.org/job/maven-plugins-ITs-m3.0.4/ws/maven-changelog-plugin/target/surefire/surefire_17517715273019699842tmp>
[ERROR] -> [Help 2]
[ERROR] Failed to execute goal org.apache.maven.plugins:maven-surefire-plugin:2.18.1:test
(default-test) on project maven-changes-plugin: Execution default-test of goal org.apache.maven.plugins:maven-surefire-plugin:2.18.1:test
failed: The forked VM terminated without properly saying goodbye. VM crash or System.exit
called?
[ERROR] Command was /bin/sh -c cd <https://builds.apache.org/job/maven-plugins-ITs-m3.0.4/ws/maven-changes-plugin>
&& /home/jenkins/tools/java/jdk1.6.0_45-32/jre/bin/java -jar <https://builds.apache.org/job/maven-plugins-ITs-m3.0.4/ws/maven-changes-plugin/target/surefire/surefirebooter2817555380435589787.jar>
<https://builds.apache.org/job/maven-plugins-ITs-m3.0.4/ws/maven-changes-plugin/target/surefire/surefire4782581115809489508tmp>
<https://builds.apache.org/job/maven-plugins-ITs-m3.0.4/ws/maven-changes-plugin/target/surefire/surefire_22301841668789478133tmp>
[ERROR] -> [Help 2]
[ERROR] Failed to execute goal org.apache.maven.plugins:maven-surefire-plugin:2.18.1:test
(default-test) on project maven-clean-plugin: Execution default-test of goal org.apache.maven.plugins:maven-surefire-plugin:2.18.1:test
failed: The forked VM terminated without properly saying goodbye. VM crash or System.exit
called?
[ERROR] Command was /bin/sh -c cd <https://builds.apache.org/job/maven-plugins-ITs-m3.0.4/ws/maven-clean-plugin>
&& /home/jenkins/tools/java/jdk1.6.0_45-32/jre/bin/java -jar <https://builds.apache.org/job/maven-plugins-ITs-m3.0.4/ws/maven-clean-plugin/target/surefire/surefirebooter7444082066209194739.jar>
<https://builds.apache.org/job/maven-plugins-ITs-m3.0.4/ws/maven-clean-plugin/target/surefire/surefire9092081864092464387tmp>
<https://builds.apache.org/job/maven-plugins-ITs-m3.0.4/ws/maven-clean-plugin/target/surefire/surefire_33475368111307486620tmp>
[ERROR] -> [Help 2]
[ERROR] Failed to execute goal org.apache.maven.plugins:maven-surefire-plugin:2.18.1:test
(default-test) on project maven-compiler-plugin: Execution default-test of goal org.apache.maven.plugins:maven-surefire-plugin:2.18.1:test
failed: The forked VM terminated without properly saying goodbye. VM crash or System.exit
called?
[ERROR] Command was /bin/sh -c cd <https://builds.apache.org/job/maven-plugins-ITs-m3.0.4/ws/maven-compiler-plugin>
&& /home/jenkins/tools/java/jdk1.6.0_45-32/jre/bin/java -jar <https://builds.apache.org/job/maven-plugins-ITs-m3.0.4/ws/maven-compiler-plugin/target/surefire/surefirebooter7924962576632884771.jar>
<https://builds.apache.org/job/maven-plugins-ITs-m3.0.4/ws/maven-compiler-plugin/target/surefire/surefire7504332125733060174tmp>
<https://builds.apache.org/job/maven-plugins-ITs-m3.0.4/ws/maven-compiler-plugin/target/surefire/surefire_48457619321185062213tmp>
[ERROR] -> [Help 2]
[ERROR] Failed to execute goal org.apache.maven.plugins:maven-surefire-plugin:2.18.1:test
(default-test) on project maven-deploy-plugin: Execution default-test of goal org.apache.maven.plugins:maven-surefire-plugin:2.18.1:test
failed: The forked VM terminated without properly saying goodbye. VM crash or System.exit
called?
[ERROR] Command was /bin/sh -c cd <https://builds.apache.org/job/maven-plugins-ITs-m3.0.4/ws/maven-deploy-plugin>
&& /home/jenkins/tools/java/jdk1.6.0_45-32/jre/bin/java -jar <https://builds.apache.org/job/maven-plugins-ITs-m3.0.4/ws/maven-deploy-plugin/target/surefire/surefirebooter2098140208892447880.jar>
<https://builds.apache.org/job/maven-plugins-ITs-m3.0.4/ws/maven-deploy-plugin/target/surefire/surefire6237945124446840401tmp>
<https://builds.apache.org/job/maven-plugins-ITs-m3.0.4/ws/maven-deploy-plugin/target/surefire/surefire_57607483173817122734tmp>
[ERROR] -> [Help 2]
[ERROR] Failed to execute goal org.apache.maven.plugins:maven-jar-plugin:2.5:jar (default-jar)
on project maven-docck-plugin: Error assembling JAR: Failed to read filesystem attributes
for: <https://builds.apache.org/job/maven-plugins-ITs-m3.0.4/ws/maven-docck-plugin/pom.xml>:
Failed to retrieve numeric file attributes using: '/bin/sh -c ls -1nlad <https://builds.apache.org/job/maven-plugins-ITs-m3.0.4/ws/maven-docck-plugin/pom.xml'>
-> [Help 1]
[ERROR] Failed to execute goal org.apache.maven.plugins:maven-surefire-plugin:2.18.1:test
(default-test) on project maven-ear-plugin: Execution default-test of goal org.apache.maven.plugins:maven-surefire-plugin:2.18.1:test
failed: The forked VM terminated without properly saying goodbye. VM crash or System.exit
called?
[ERROR] Command was /bin/sh -c cd <https://builds.apache.org/job/maven-plugins-ITs-m3.0.4/ws/maven-ear-plugin>
&& /home/jenkins/tools/java/jdk1.6.0_45-32/jre/bin/java -jar <https://builds.apache.org/job/maven-plugins-ITs-m3.0.4/ws/maven-ear-plugin/target/surefire/surefirebooter669693458457201832.jar>
<https://builds.apache.org/job/maven-plugins-ITs-m3.0.4/ws/maven-ear-plugin/target/surefire/surefire5795772060267493814tmp>
<https://builds.apache.org/job/maven-plugins-ITs-m3.0.4/ws/maven-ear-plugin/target/surefire/surefire_61081174825784808259tmp>
[ERROR] -> [Help 2]
[ERROR] Failed to execute goal org.apache.maven.plugins:maven-surefire-plugin:2.18.1:test
(default-test) on project maven-ejb-plugin: Execution default-test of goal org.apache.maven.plugins:maven-surefire-plugin:2.18.1:test
failed: The forked VM terminated without properly saying goodbye. VM crash or System.exit
called?
[ERROR] Command was /bin/sh -c cd <https://builds.apache.org/job/maven-plugins-ITs-m3.0.4/ws/maven-ejb-plugin>
&& /home/jenkins/tools/java/jdk1.6.0_45-32/jre/bin/java -jar <https://builds.apache.org/job/maven-plugins-ITs-m3.0.4/ws/maven-ejb-plugin/target/surefire/surefirebooter6421313387562247653.jar>
<https://builds.apache.org/job/maven-plugins-ITs-m3.0.4/ws/maven-ejb-plugin/target/surefire/surefire3125384316369074179tmp>
<https://builds.apache.org/job/maven-plugins-ITs-m3.0.4/ws/maven-ejb-plugin/target/surefire/surefire_75966165478052242525tmp>
[ERROR] -> [Help 2]
[ERROR] Failed to execute goal org.apache.maven.plugins:maven-surefire-plugin:2.18.1:test
(default-test) on project maven-help-plugin: Execution default-test of goal org.apache.maven.plugins:maven-surefire-plugin:2.18.1:test
failed: The forked VM terminated without properly saying goodbye. VM crash or System.exit
called?
[ERROR] Command was /bin/sh -c cd <https://builds.apache.org/job/maven-plugins-ITs-m3.0.4/ws/maven-help-plugin>
&& /home/jenkins/tools/java/jdk1.6.0_45-32/jre/bin/java -jar <https://builds.apache.org/job/maven-plugins-ITs-m3.0.4/ws/maven-help-plugin/target/surefire/surefirebooter3436397541854706159.jar>
<https://builds.apache.org/job/maven-plugins-ITs-m3.0.4/ws/maven-help-plugin/target/surefire/surefire5928389069857345567tmp>
<https://builds.apache.org/job/maven-plugins-ITs-m3.0.4/ws/maven-help-plugin/target/surefire/surefire_86802197732050310553tmp>
[ERROR] -> [Help 2]
[ERROR] Failed to execute goal org.apache.maven.plugins:maven-surefire-plugin:2.18.1:test
(default-test) on project maven-install-plugin: Execution default-test of goal org.apache.maven.plugins:maven-surefire-plugin:2.18.1:test
failed: The forked VM terminated without properly saying goodbye. VM crash or System.exit
called?
[ERROR] Command was /bin/sh -c cd <https://builds.apache.org/job/maven-plugins-ITs-m3.0.4/ws/maven-install-plugin>
&& /home/jenkins/tools/java/jdk1.6.0_45-32/jre/bin/java -jar <https://builds.apache.org/job/maven-plugins-ITs-m3.0.4/ws/maven-install-plugin/target/surefire/surefirebooter6369294300028950306.jar>
<https://builds.apache.org/job/maven-plugins-ITs-m3.0.4/ws/maven-install-plugin/target/surefire/surefire8555846289413054289tmp>
<https://builds.apache.org/job/maven-plugins-ITs-m3.0.4/ws/maven-install-plugin/target/surefire/surefire_9443865346820511191tmp>
[ERROR] -> [Help 2]
[ERROR] Failed to execute goal org.apache.maven.plugins:maven-invoker-plugin:2.0.0:install
(integration-test) on project maven-jarsigner-plugin: Failed to install project dependencies:
MavenProject: org.apache.maven.plugins:maven-jarsigner-plugin:1.5-SNAPSHOT @ <https://builds.apache.org/job/maven-plugins-ITs-m3.0.4/ws/maven-jarsigner-plugin/pom.xml>:
Failed to install project artifacts: MavenProject: org.apache.maven.plugins:maven-acr-plugin:3.0.1-SNAPSHOT
@ <https://builds.apache.org/job/maven-plugins-ITs-m3.0.4/ws/maven-acr-plugin/pom.xml>:
Failed to install artifact: org.apache.maven.plugins:maven-acr-plugin:maven-plugin:3.0.1-SNAPSHOT:
Artifact is not fully assembled: <https://builds.apache.org/job/maven-plugins-ITs-m3.0.4/ws/maven-acr-plugin/target/classes>
-> [Help 1]
[ERROR] Failed to execute goal org.apache.maven.plugins:maven-surefire-plugin:2.18.1:test
(default-test) on project maven-javadoc-plugin: Execution default-test of goal org.apache.maven.plugins:maven-surefire-plugin:2.18.1:test
failed: The forked VM terminated without properly saying goodbye. VM crash or System.exit
called?
[ERROR] Command was /bin/sh -c cd <https://builds.apache.org/job/maven-plugins-ITs-m3.0.4/ws/maven-javadoc-plugin>
&& /home/jenkins/tools/java/jdk1.6.0_45-32/jre/bin/java -jar <https://builds.apache.org/job/maven-plugins-ITs-m3.0.4/ws/maven-javadoc-plugin/target/surefire/surefirebooter8685736871969508996.jar>
<https://builds.apache.org/job/maven-plugins-ITs-m3.0.4/ws/maven-javadoc-plugin/target/surefire/surefire8679552544484095657tmp>
<https://builds.apache.org/job/maven-plugins-ITs-m3.0.4/ws/maven-javadoc-plugin/target/surefire/surefire_107070633859317056974tmp>
[ERROR] -> [Help 2]
[ERROR] Failed to execute goal org.apache.maven.plugins:maven-invoker-plugin:2.0.0:install
(integration-test) on project maven-linkcheck-plugin: Failed to install project dependencies:
MavenProject: org.apache.maven.plugins:maven-linkcheck-plugin:1.3-SNAPSHOT @ <https://builds.apache.org/job/maven-plugins-ITs-m3.0.4/ws/maven-linkcheck-plugin/pom.xml>:
Failed to install project artifacts: MavenProject: org.apache.maven.plugins:maven-acr-plugin:3.0.1-SNAPSHOT
@ <https://builds.apache.org/job/maven-plugins-ITs-m3.0.4/ws/maven-acr-plugin/pom.xml>:
Failed to install artifact: org.apache.maven.plugins:maven-acr-plugin:maven-plugin:3.0.1-SNAPSHOT:
Artifact is not fully assembled: <https://builds.apache.org/job/maven-plugins-ITs-m3.0.4/ws/maven-acr-plugin/target/classes>
-> [Help 1]
[ERROR] Failed to execute goal org.apache.maven.plugins:maven-invoker-plugin:2.0.0:install
(integration-test) on project maven-patch-plugin: Failed to install project dependencies:
MavenProject: org.apache.maven.plugins:maven-patch-plugin:1.3-SNAPSHOT @ <https://builds.apache.org/job/maven-plugins-ITs-m3.0.4/ws/maven-patch-plugin/pom.xml>:
Failed to install project artifacts: MavenProject: org.apache.maven.plugins:maven-acr-plugin:3.0.1-SNAPSHOT
@ <https://builds.apache.org/job/maven-plugins-ITs-m3.0.4/ws/maven-acr-plugin/pom.xml>:
Failed to install artifact: org.apache.maven.plugins:maven-acr-plugin:maven-plugin:3.0.1-SNAPSHOT:
Artifact is not fully assembled: <https://builds.apache.org/job/maven-plugins-ITs-m3.0.4/ws/maven-acr-plugin/target/classes>
-> [Help 1]
[ERROR] Failed to execute goal org.apache.maven.plugins:maven-surefire-plugin:2.18.1:test
(default-test) on project maven-pdf-plugin: Execution default-test of goal org.apache.maven.plugins:maven-surefire-plugin:2.18.1:test
failed: The forked VM terminated without properly saying goodbye. VM crash or System.exit
called?
[ERROR] Command was /bin/sh -c cd <https://builds.apache.org/job/maven-plugins-ITs-m3.0.4/ws/maven-pdf-plugin>
&& /home/jenkins/tools/java/jdk1.6.0_45-32/jre/bin/java -jar <https://builds.apache.org/job/maven-plugins-ITs-m3.0.4/ws/maven-pdf-plugin/target/surefire/surefirebooter3410188884114251476.jar>
<https://builds.apache.org/job/maven-plugins-ITs-m3.0.4/ws/maven-pdf-plugin/target/surefire/surefire7220843885675885652tmp>
<https://builds.apache.org/job/maven-plugins-ITs-m3.0.4/ws/maven-pdf-plugin/target/surefire/surefire_113795086144267763089tmp>
[ERROR] -> [Help 2]
[ERROR] Failed to execute goal org.apache.maven.plugins:maven-surefire-plugin:2.18.1:test
(default-test) on project maven-rar-plugin: Execution default-test of goal org.apache.maven.plugins:maven-surefire-plugin:2.18.1:test
failed: The forked VM terminated without properly saying goodbye. VM crash or System.exit
called?
[ERROR] Command was /bin/sh -c cd <https://builds.apache.org/job/maven-plugins-ITs-m3.0.4/ws/maven-rar-plugin>
&& /home/jenkins/tools/java/jdk1.6.0_45-32/jre/bin/java -jar <https://builds.apache.org/job/maven-plugins-ITs-m3.0.4/ws/maven-rar-plugin/target/surefire/surefirebooter7614367515039740794.jar>
<https://builds.apache.org/job/maven-plugins-ITs-m3.0.4/ws/maven-rar-plugin/target/surefire/surefire5754754590325359076tmp>
<https://builds.apache.org/job/maven-plugins-ITs-m3.0.4/ws/maven-rar-plugin/target/surefire/surefire_123096235724576687320tmp>
[ERROR] -> [Help 2]
[ERROR] Failed to execute goal org.apache.maven.plugins:maven-surefire-plugin:2.18.1:test
(default-test) on project maven-repository-plugin: Execution default-test of goal org.apache.maven.plugins:maven-surefire-plugin:2.18.1:test
failed: The forked VM terminated without properly saying goodbye. VM crash or System.exit
called?
[ERROR] Command was /bin/sh -c cd <https://builds.apache.org/job/maven-plugins-ITs-m3.0.4/ws/maven-repository-plugin>
&& /home/jenkins/tools/java/jdk1.6.0_45-32/jre/bin/java -jar <https://builds.apache.org/job/maven-plugins-ITs-m3.0.4/ws/maven-repository-plugin/target/surefire/surefirebooter8725072450809347591.jar>
<https://builds.apache.org/job/maven-plugins-ITs-m3.0.4/ws/maven-repository-plugin/target/surefire/surefire6060056014123733320tmp>
<https://builds.apache.org/job/maven-plugins-ITs-m3.0.4/ws/maven-repository-plugin/target/surefire/surefire_139074977374715403757tmp>
[ERROR] -> [Help 2]
[ERROR] Failed to execute goal org.apache.maven.plugins:maven-surefire-plugin:2.18.1:test
(default-test) on project maven-resources-plugin: Execution default-test of goal org.apache.maven.plugins:maven-surefire-plugin:2.18.1:test
failed: The forked VM terminated without properly saying goodbye. VM crash or System.exit
called?
[ERROR] Command was /bin/sh -c cd <https://builds.apache.org/job/maven-plugins-ITs-m3.0.4/ws/maven-resources-plugin>
&& /home/jenkins/tools/java/jdk1.6.0_45-32/jre/bin/java -jar <https://builds.apache.org/job/maven-plugins-ITs-m3.0.4/ws/maven-resources-plugin/target/surefire/surefirebooter2747005418709901851.jar>
<https://builds.apache.org/job/maven-plugins-ITs-m3.0.4/ws/maven-resources-plugin/target/surefire/surefire6722712301620880799tmp>
<https://builds.apache.org/job/maven-plugins-ITs-m3.0.4/ws/maven-resources-plugin/target/surefire/surefire_144688670483258204099tmp>
[ERROR] -> [Help 2]
[ERROR] Failed to execute goal org.apache.maven.plugins:maven-surefire-plugin:2.18.1:test
(default-test) on project maven-site-plugin: Execution default-test of goal org.apache.maven.plugins:maven-surefire-plugin:2.18.1:test
failed: The forked VM terminated without properly saying goodbye. VM crash or System.exit
called?
[ERROR] Command was /bin/sh -c cd <https://builds.apache.org/job/maven-plugins-ITs-m3.0.4/ws/maven-site-plugin>
&& /home/jenkins/tools/java/jdk1.6.0_45-32/jre/bin/java -jar <https://builds.apache.org/job/maven-plugins-ITs-m3.0.4/ws/maven-site-plugin/target/surefire/surefirebooter2821923220007962633.jar>
<https://builds.apache.org/job/maven-plugins-ITs-m3.0.4/ws/maven-site-plugin/target/surefire/surefire3637385668067635289tmp>
<https://builds.apache.org/job/maven-plugins-ITs-m3.0.4/ws/maven-site-plugin/target/surefire/surefire_15277772872347496365tmp>
[ERROR] -> [Help 2]
[ERROR] Failed to execute goal org.apache.maven.plugins:maven-surefire-plugin:2.18.1:test
(default-test) on project maven-source-plugin: Execution default-test of goal org.apache.maven.plugins:maven-surefire-plugin:2.18.1:test
failed: The forked VM terminated without properly saying goodbye. VM crash or System.exit
called?
[ERROR] Command was /bin/sh -c cd <https://builds.apache.org/job/maven-plugins-ITs-m3.0.4/ws/maven-source-plugin>
&& /home/jenkins/tools/java/jdk1.6.0_45-32/jre/bin/java -jar <https://builds.apache.org/job/maven-plugins-ITs-m3.0.4/ws/maven-source-plugin/target/surefire/surefirebooter728847499312319958.jar>
<https://builds.apache.org/job/maven-plugins-ITs-m3.0.4/ws/maven-source-plugin/target/surefire/surefire185489138810566187tmp>
<https://builds.apache.org/job/maven-plugins-ITs-m3.0.4/ws/maven-source-plugin/target/surefire/surefire_161092125554474146638tmp>
[ERROR] -> [Help 2]
[ERROR] Failed to execute goal org.apache.maven.plugins:maven-invoker-plugin:2.0.0:install
(integration-test) on project maven-stage-plugin: Failed to install project dependencies:
MavenProject: org.apache.maven.plugins:maven-stage-plugin:1.1-SNAPSHOT @ <https://builds.apache.org/job/maven-plugins-ITs-m3.0.4/ws/maven-stage-plugin/pom.xml>:
Failed to install project artifacts: MavenProject: org.apache.maven.plugins:maven-acr-plugin:3.0.1-SNAPSHOT
@ <https://builds.apache.org/job/maven-plugins-ITs-m3.0.4/ws/maven-acr-plugin/pom.xml>:
Failed to install artifact: org.apache.maven.plugins:maven-acr-plugin:maven-plugin:3.0.1-SNAPSHOT:
Artifact is not fully assembled: <https://builds.apache.org/job/maven-plugins-ITs-m3.0.4/ws/maven-acr-plugin/target/classes>
-> [Help 1]
[ERROR] Failed to execute goal org.apache.maven.plugins:maven-invoker-plugin:2.0.0:install
(integration-test) on project maven-toolchains-plugin: Failed to install project dependencies:
MavenProject: org.apache.maven.plugins:maven-toolchains-plugin:1.2-SNAPSHOT @ <https://builds.apache.org/job/maven-plugins-ITs-m3.0.4/ws/maven-toolchains-plugin/pom.xml>:
Failed to install project artifacts: MavenProject: org.apache.maven.plugins:maven-acr-plugin:3.0.1-SNAPSHOT
@ <https://builds.apache.org/job/maven-plugins-ITs-m3.0.4/ws/maven-acr-plugin/pom.xml>:
Failed to install artifact: org.apache.maven.plugins:maven-acr-plugin:maven-plugin:3.0.1-SNAPSHOT:
Artifact is not fully assembled: <https://builds.apache.org/job/maven-plugins-ITs-m3.0.4/ws/maven-acr-plugin/target/classes>
-> [Help 1]
[ERROR] Failed to execute goal org.apache.maven.plugins:maven-surefire-plugin:2.18.1:test
(default-test) on project maven-verifier-plugin: Execution default-test of goal org.apache.maven.plugins:maven-surefire-plugin:2.18.1:test
failed: The forked VM terminated without properly saying goodbye. VM crash or System.exit
called?
[ERROR] Command was /bin/sh -c cd <https://builds.apache.org/job/maven-plugins-ITs-m3.0.4/ws/maven-verifier-plugin>
&& /home/jenkins/tools/java/jdk1.6.0_45-32/jre/bin/java -jar <https://builds.apache.org/job/maven-plugins-ITs-m3.0.4/ws/maven-verifier-plugin/target/surefire/surefirebooter2775726734028223653.jar>
<https://builds.apache.org/job/maven-plugins-ITs-m3.0.4/ws/maven-verifier-plugin/target/surefire/surefire8143229228551555579tmp>
<https://builds.apache.org/job/maven-plugins-ITs-m3.0.4/ws/maven-verifier-plugin/target/surefire/surefire_175833779131752181580tmp>
[ERROR] -> [Help 2]
[ERROR] Failed to execute goal org.apache.maven.plugins:maven-surefire-plugin:2.18.1:test
(default-test) on project maven-war-plugin: Execution default-test of goal org.apache.maven.plugins:maven-surefire-plugin:2.18.1:test
failed: The forked VM terminated without properly saying goodbye. VM crash or System.exit
called?
[ERROR] Command was /bin/sh -c cd <https://builds.apache.org/job/maven-plugins-ITs-m3.0.4/ws/maven-war-plugin>
&& /home/jenkins/tools/java/jdk1.6.0_45-32/jre/bin/java -jar <https://builds.apache.org/job/maven-plugins-ITs-m3.0.4/ws/maven-war-plugin/target/surefire/surefirebooter3424309228236171065.jar>
<https://builds.apache.org/job/maven-plugins-ITs-m3.0.4/ws/maven-war-plugin/target/surefire/surefire7795270078118498113tmp>
<https://builds.apache.org/job/maven-plugins-ITs-m3.0.4/ws/maven-war-plugin/target/surefire/surefire_182053019289880038868tmp>
[ERROR] -> [Help 2]
[ERROR] Failed to execute goal org.apache.maven.plugins:maven-surefire-plugin:2.18.1:test
(default-test) on project maven-doap-plugin: Execution default-test of goal org.apache.maven.plugins:maven-surefire-plugin:2.18.1:test
failed: The forked VM terminated without properly saying goodbye. VM crash or System.exit
called?
[ERROR] Command was /bin/sh -c cd <https://builds.apache.org/job/maven-plugins-ITs-m3.0.4/ws/maven-doap-plugin>
&& /home/jenkins/tools/java/jdk1.6.0_45-32/jre/bin/java -jar <https://builds.apache.org/job/maven-plugins-ITs-m3.0.4/ws/maven-doap-plugin/target/surefire/surefirebooter2498498218778200416.jar>
<https://builds.apache.org/job/maven-plugins-ITs-m3.0.4/ws/maven-doap-plugin/target/surefire/surefire4778291825387691519tmp>
<https://builds.apache.org/job/maven-plugins-ITs-m3.0.4/ws/maven-doap-plugin/target/surefire/surefire_19160582724486937298tmp>
[ERROR] -> [Help 2]
[ERROR] Failed to execute goal org.apache.maven.plugins:maven-surefire-plugin:2.18.1:test
(default-test) on project maven-pmd-plugin: Execution default-test of goal org.apache.maven.plugins:maven-surefire-plugin:2.18.1:test
failed: The forked VM terminated without properly saying goodbye. VM crash or System.exit
called?
[ERROR] Command was /bin/sh -c cd <https://builds.apache.org/job/maven-plugins-ITs-m3.0.4/ws/maven-pmd-plugin>
&& /home/jenkins/tools/java/jdk1.6.0_45-32/jre/bin/java -jar <https://builds.apache.org/job/maven-plugins-ITs-m3.0.4/ws/maven-pmd-plugin/target/surefire/surefirebooter1958395766394420894.jar>
<https://builds.apache.org/job/maven-plugins-ITs-m3.0.4/ws/maven-pmd-plugin/target/surefire/surefire953920669222634871tmp>
<https://builds.apache.org/job/maven-plugins-ITs-m3.0.4/ws/maven-pmd-plugin/target/surefire/surefire_208067783235449252351tmp>
[ERROR] -> [Help 2]
[ERROR] Failed to execute goal org.apache.maven.plugins:maven-surefire-plugin:2.18.1:test
(default-test) on project maven-invoker-plugin: Execution default-test of goal org.apache.maven.plugins:maven-surefire-plugin:2.18.1:test
failed: The forked VM terminated without properly saying goodbye. VM crash or System.exit
called?
[ERROR] Command was /bin/sh -c cd <https://builds.apache.org/job/maven-plugins-ITs-m3.0.4/ws/maven-invoker-plugin>
&& /home/jenkins/tools/java/jdk1.6.0_45-32/jre/bin/java -jar <https://builds.apache.org/job/maven-plugins-ITs-m3.0.4/ws/maven-invoker-plugin/target/surefire/surefirebooter1360899901274257959.jar>
<https://builds.apache.org/job/maven-plugins-ITs-m3.0.4/ws/maven-invoker-plugin/target/surefire/surefire8351408015230085081tmp>
<https://builds.apache.org/job/maven-plugins-ITs-m3.0.4/ws/maven-invoker-plugin/target/surefire/surefire_212508495416036935954tmp>
[ERROR] -> [Help 2]
[ERROR] Failed to execute goal org.apache.maven.plugins:maven-surefire-plugin:2.18.1:test
(default-test) on project maven-jar-plugin: Execution default-test of goal org.apache.maven.plugins:maven-surefire-plugin:2.18.1:test
failed: The forked VM terminated without properly saying goodbye. VM crash or System.exit
called?
[ERROR] Command was /bin/sh -c cd <https://builds.apache.org/job/maven-plugins-ITs-m3.0.4/ws/maven-jar-plugin>
&& /home/jenkins/tools/java/jdk1.6.0_45-32/jre/bin/java -jar <https://builds.apache.org/job/maven-plugins-ITs-m3.0.4/ws/maven-jar-plugin/target/surefire/surefirebooter1788193430385217697.jar>
<https://builds.apache.org/job/maven-plugins-ITs-m3.0.4/ws/maven-jar-plugin/target/surefire/surefire8218707197019585972tmp>
<https://builds.apache.org/job/maven-plugins-ITs-m3.0.4/ws/maven-jar-plugin/target/surefire/surefire_228721934189797542617tmp>
[ERROR] -> [Help 2]
[ERROR] Failed to execute goal org.apache.maven.plugins:maven-invoker-plugin:2.0.0:install
(integration-test) on project maven-gpg-plugin: Failed to install project dependencies: MavenProject:
org.apache.maven.plugins:maven-gpg-plugin:1.7-SNAPSHOT @ <https://builds.apache.org/job/maven-plugins-ITs-m3.0.4/ws/maven-gpg-plugin/pom.xml>:
Failed to install project artifacts: MavenProject: org.apache.maven.plugins:maven-acr-plugin:3.0.1-SNAPSHOT
@ <https://builds.apache.org/job/maven-plugins-ITs-m3.0.4/ws/maven-acr-plugin/pom.xml>:
Failed to install artifact: org.apache.maven.plugins:maven-acr-plugin:maven-plugin:3.0.1-SNAPSHOT:
Artifact is not fully assembled: <https://builds.apache.org/job/maven-plugins-ITs-m3.0.4/ws/maven-acr-plugin/target/classes>
-> [Help 1]
[ERROR] 
[ERROR] To see the full stack trace of the errors, re-run Maven with the -e switch.
[ERROR] Re-run Maven using the -X switch to enable full debug logging.
[ERROR] 
[ERROR] For more information about the errors and possible solutions, please read the following
articles:
[ERROR] [Help 1] http://cwiki.apache.org/confluence/display/MAVEN/MojoExecutionException
[ERROR] [Help 2] http://cwiki.apache.org/confluence/display/MAVEN/PluginExecutionException
Build step 'Invoke top-level Maven targets' marked build as failure
Deleting 1 temporary files
Recording test results
ERROR: Step ?Publish JUnit test result report? failed: No test report files were found. Configuration
error?


Mime
View raw message