maven-notifications mailing list archives

Site index · List index
Message view « Date » · « Thread »
Top « Date » · « Thread »
From Apache Jenkins Server <jenk...@builds.apache.org>
Subject Build failed in Jenkins: core-it-maven-3-win #1153
Date Wed, 04 May 2016 23:30:14 GMT
See <https://builds.apache.org/job/core-it-maven-3-win/1153/changes>

Changes:

[schulte] [MNG-5967] Dependency updates.

------------------------------------------
[...truncated 3176 lines...]
[INFO] Building Maven Core ITs 2.1-SNAPSHOT
[INFO] ------------------------------------------------------------------------
[INFO] Downloading: https://repo.maven.apache.org/maven2/org/apache/maven/plugins/maven-remote-resources-plugin/1.5/maven-remote-resources-plugin-1.5.pom
[INFO] Downloaded: https://repo.maven.apache.org/maven2/org/apache/maven/plugins/maven-remote-resources-plugin/1.5/maven-remote-resources-plugin-1.5.pom
(14 KB at 138.7 KB/sec)
[INFO] Downloading: https://repo.maven.apache.org/maven2/org/apache/maven/plugins/maven-plugins/24/maven-plugins-24.pom
[INFO] Downloaded: https://repo.maven.apache.org/maven2/org/apache/maven/plugins/maven-plugins/24/maven-plugins-24.pom
(11 KB at 112.3 KB/sec)
[INFO] Downloading: https://repo.maven.apache.org/maven2/org/apache/maven/maven-parent/23/maven-parent-23.pom
[INFO] Downloaded: https://repo.maven.apache.org/maven2/org/apache/maven/maven-parent/23/maven-parent-23.pom
(32 KB at 342.2 KB/sec)
[INFO] Downloading: https://repo.maven.apache.org/maven2/org/apache/apache/13/apache-13.pom
[INFO] Downloaded: https://repo.maven.apache.org/maven2/org/apache/apache/13/apache-13.pom
(14 KB at 145.2 KB/sec)
[INFO] Downloading: https://repo.maven.apache.org/maven2/org/apache/maven/plugins/maven-remote-resources-plugin/1.5/maven-remote-resources-plugin-1.5.jar
[INFO] Downloaded: https://repo.maven.apache.org/maven2/org/apache/maven/plugins/maven-remote-resources-plugin/1.5/maven-remote-resources-plugin-1.5.jar
(68 KB at 480.4 KB/sec)
[INFO] Downloading: https://repo.maven.apache.org/maven2/org/apache/maven/plugins/maven-site-plugin/3.4/maven-site-plugin-3.4.pom
[INFO] Downloaded: https://repo.maven.apache.org/maven2/org/apache/maven/plugins/maven-site-plugin/3.4/maven-site-plugin-3.4.pom
(20 KB at 209.8 KB/sec)
[INFO] Downloading: https://repo.maven.apache.org/maven2/org/apache/maven/plugins/maven-plugins/25/maven-plugins-25.pom
[INFO] Downloaded: https://repo.maven.apache.org/maven2/org/apache/maven/plugins/maven-plugins/25/maven-plugins-25.pom
(10 KB at 99.2 KB/sec)
[INFO] Downloading: https://repo.maven.apache.org/maven2/org/apache/maven/maven-parent/24/maven-parent-24.pom
[INFO] Downloaded: https://repo.maven.apache.org/maven2/org/apache/maven/maven-parent/24/maven-parent-24.pom
(37 KB at 387.5 KB/sec)
[INFO] Downloading: https://repo.maven.apache.org/maven2/org/apache/apache/14/apache-14.pom
[INFO] Downloaded: https://repo.maven.apache.org/maven2/org/apache/apache/14/apache-14.pom
(15 KB at 152.6 KB/sec)
[INFO] Downloading: https://repo.maven.apache.org/maven2/org/apache/maven/plugins/maven-site-plugin/3.4/maven-site-plugin-3.4.jar
[INFO] Downloaded: https://repo.maven.apache.org/maven2/org/apache/maven/plugins/maven-site-plugin/3.4/maven-site-plugin-3.4.jar
(125 KB at 881.4 KB/sec)
[INFO] Downloading: https://repo.maven.apache.org/maven2/org/apache/maven/plugins/maven-checkstyle-plugin/2.15/maven-checkstyle-plugin-2.15.pom
[INFO] Downloaded: https://repo.maven.apache.org/maven2/org/apache/maven/plugins/maven-checkstyle-plugin/2.15/maven-checkstyle-plugin-2.15.pom
(14 KB at 141.6 KB/sec)
[INFO] Downloading: https://repo.maven.apache.org/maven2/org/apache/maven/plugins/maven-plugins/27/maven-plugins-27.pom
[INFO] Downloaded: https://repo.maven.apache.org/maven2/org/apache/maven/plugins/maven-plugins/27/maven-plugins-27.pom
(12 KB at 100.9 KB/sec)
[INFO] Downloading: https://repo.maven.apache.org/maven2/org/apache/maven/maven-parent/26/maven-parent-26.pom
[INFO] Downloaded: https://repo.maven.apache.org/maven2/org/apache/maven/maven-parent/26/maven-parent-26.pom
(39 KB at 413.3 KB/sec)
[INFO] Downloading: https://repo.maven.apache.org/maven2/org/apache/apache/16/apache-16.pom
[INFO] Downloaded: https://repo.maven.apache.org/maven2/org/apache/apache/16/apache-16.pom
(16 KB at 137.9 KB/sec)
[INFO] Downloading: https://repo.maven.apache.org/maven2/org/apache/maven/plugins/maven-checkstyle-plugin/2.15/maven-checkstyle-plugin-2.15.jar
[INFO] Downloaded: https://repo.maven.apache.org/maven2/org/apache/maven/plugins/maven-checkstyle-plugin/2.15/maven-checkstyle-plugin-2.15.jar
(109 KB at 774.6 KB/sec)
[INFO] Downloading: https://repo.maven.apache.org/maven2/org/apache/maven/plugins/maven-enforcer-plugin/1.3.1/maven-enforcer-plugin-1.3.1.pom
[INFO] Downloaded: https://repo.maven.apache.org/maven2/org/apache/maven/plugins/maven-enforcer-plugin/1.3.1/maven-enforcer-plugin-1.3.1.pom
(7 KB at 67.3 KB/sec)
[INFO] Downloading: https://repo.maven.apache.org/maven2/org/apache/maven/enforcer/enforcer/1.3.1/enforcer-1.3.1.pom
[INFO] Downloaded: https://repo.maven.apache.org/maven2/org/apache/maven/enforcer/enforcer/1.3.1/enforcer-1.3.1.pom
(12 KB at 121.9 KB/sec)
[INFO] Downloading: https://repo.maven.apache.org/maven2/org/apache/maven/plugins/maven-enforcer-plugin/1.3.1/maven-enforcer-plugin-1.3.1.jar
[INFO] Downloaded: https://repo.maven.apache.org/maven2/org/apache/maven/plugins/maven-enforcer-plugin/1.3.1/maven-enforcer-plugin-1.3.1.jar
(26 KB at 160.7 KB/sec)
[INFO] Downloading: https://repo.maven.apache.org/maven2/org/apache/rat/apache-rat-plugin/0.11/apache-rat-plugin-0.11.pom
[INFO] Downloaded: https://repo.maven.apache.org/maven2/org/apache/rat/apache-rat-plugin/0.11/apache-rat-plugin-0.11.pom
(10 KB at 83.6 KB/sec)
[INFO] Downloading: https://repo.maven.apache.org/maven2/org/apache/rat/apache-rat-project/0.11/apache-rat-project-0.11.pom
[INFO] Downloaded: https://repo.maven.apache.org/maven2/org/apache/rat/apache-rat-project/0.11/apache-rat-project-0.11.pom
(21 KB at 215.8 KB/sec)
[INFO] Downloading: https://repo.maven.apache.org/maven2/org/apache/rat/apache-rat-plugin/0.11/apache-rat-plugin-0.11.jar
[INFO] Downloaded: https://repo.maven.apache.org/maven2/org/apache/rat/apache-rat-plugin/0.11/apache-rat-plugin-0.11.jar
(43 KB at 452.9 KB/sec)
[INFO] Downloading: https://repo.maven.apache.org/maven2/org/apache/maven/plugins/maven-clean-plugin/2.5/maven-clean-plugin-2.5.pom
[INFO] Downloaded: https://repo.maven.apache.org/maven2/org/apache/maven/plugins/maven-clean-plugin/2.5/maven-clean-plugin-2.5.pom
(4 KB at 35.1 KB/sec)
[INFO] Downloading: https://repo.maven.apache.org/maven2/org/apache/maven/plugins/maven-plugins/22/maven-plugins-22.pom
[INFO] Downloaded: https://repo.maven.apache.org/maven2/org/apache/maven/plugins/maven-plugins/22/maven-plugins-22.pom
(13 KB at 115.8 KB/sec)
[INFO] Downloading: https://repo.maven.apache.org/maven2/org/apache/maven/maven-parent/21/maven-parent-21.pom
[INFO] Downloaded: https://repo.maven.apache.org/maven2/org/apache/maven/maven-parent/21/maven-parent-21.pom
(26 KB at 273.8 KB/sec)
[INFO] Downloading: https://repo.maven.apache.org/maven2/org/apache/apache/10/apache-10.pom
[INFO] Downloaded: https://repo.maven.apache.org/maven2/org/apache/apache/10/apache-10.pom
(15 KB at 155.4 KB/sec)
[INFO] Downloading: https://repo.maven.apache.org/maven2/org/apache/maven/plugins/maven-clean-plugin/2.5/maven-clean-plugin-2.5.jar
[INFO] Downloaded: https://repo.maven.apache.org/maven2/org/apache/maven/plugins/maven-clean-plugin/2.5/maven-clean-plugin-2.5.jar
(25 KB at 258.7 KB/sec)
[INFO] Downloading: https://repo.maven.apache.org/maven2/org/apache/maven/plugins/maven-install-plugin/2.5.2/maven-install-plugin-2.5.2.pom
[INFO] Downloaded: https://repo.maven.apache.org/maven2/org/apache/maven/plugins/maven-install-plugin/2.5.2/maven-install-plugin-2.5.2.pom
(7 KB at 66.7 KB/sec)
[INFO] Downloading: https://repo.maven.apache.org/maven2/org/apache/maven/plugins/maven-install-plugin/2.5.2/maven-install-plugin-2.5.2.jar
[INFO] Downloaded: https://repo.maven.apache.org/maven2/org/apache/maven/plugins/maven-install-plugin/2.5.2/maven-install-plugin-2.5.2.jar
(33 KB at 344.0 KB/sec)
[INFO] 
[INFO] --- maven-clean-plugin:2.5:clean (default-clean) @ core-its ---
[INFO] Downloading: https://repo.maven.apache.org/maven2/org/apache/maven/maven-plugin-api/2.0.6/maven-plugin-api-2.0.6.pom
[INFO] Downloaded: https://repo.maven.apache.org/maven2/org/apache/maven/maven-plugin-api/2.0.6/maven-plugin-api-2.0.6.pom
(2 KB at 12.9 KB/sec)
[INFO] Downloading: https://repo.maven.apache.org/maven2/org/apache/maven/maven/2.0.6/maven-2.0.6.pom
[INFO] Downloaded: https://repo.maven.apache.org/maven2/org/apache/maven/maven/2.0.6/maven-2.0.6.pom
(9 KB at 95.0 KB/sec)
[INFO] Downloading: https://repo.maven.apache.org/maven2/org/apache/maven/maven-parent/5/maven-parent-5.pom
[INFO] Downloaded: https://repo.maven.apache.org/maven2/org/apache/maven/maven-parent/5/maven-parent-5.pom
(15 KB at 158.3 KB/sec)
[INFO] Downloading: https://repo.maven.apache.org/maven2/org/apache/apache/3/apache-3.pom
[INFO] Downloaded: https://repo.maven.apache.org/maven2/org/apache/apache/3/apache-3.pom (4
KB at 35.6 KB/sec)
[INFO] Downloading: https://repo.maven.apache.org/maven2/org/codehaus/plexus/plexus-utils/3.0/plexus-utils-3.0.pom
[INFO] Downloaded: https://repo.maven.apache.org/maven2/org/codehaus/plexus/plexus-utils/3.0/plexus-utils-3.0.pom
(4 KB at 42.3 KB/sec)
[INFO] Downloading: https://repo.maven.apache.org/maven2/org/sonatype/spice/spice-parent/16/spice-parent-16.pom
[INFO] Downloaded: https://repo.maven.apache.org/maven2/org/sonatype/spice/spice-parent/16/spice-parent-16.pom
(9 KB at 87.8 KB/sec)
[INFO] Downloading: https://repo.maven.apache.org/maven2/org/sonatype/forge/forge-parent/5/forge-parent-5.pom
[INFO] Downloaded: https://repo.maven.apache.org/maven2/org/sonatype/forge/forge-parent/5/forge-parent-5.pom
(9 KB at 74.2 KB/sec)
[INFO] Downloading: https://repo.maven.apache.org/maven2/org/apache/maven/maven-plugin-api/2.0.6/maven-plugin-api-2.0.6.jar
[INFO] Downloading: https://repo.maven.apache.org/maven2/org/codehaus/plexus/plexus-utils/3.0/plexus-utils-3.0.jar
[INFO] Downloaded: https://repo.maven.apache.org/maven2/org/apache/maven/maven-plugin-api/2.0.6/maven-plugin-api-2.0.6.jar
(13 KB at 133.6 KB/sec)
[INFO] ------------------------------------------------------------------------
[INFO] Reactor Summary:
[INFO] 
[INFO] Maven Core ITs ..................................... FAILURE [  4.781 s]
[INFO] Maven IT Support ................................... SKIPPED
[INFO] Maven IT :: Plugins ................................ SKIPPED
[INFO] Maven IT Plugin :: Active Collection ............... SKIPPED
[INFO] Maven IT Plugin :: Ant-Based ....................... SKIPPED
[INFO] Maven IT Plugin :: Artifact ........................ SKIPPED
[INFO] Maven IT Plugin :: Class Loader :: Dependency A .... SKIPPED
[INFO] Maven IT Plugin :: Class Loader :: Dependency B .... SKIPPED
[INFO] Maven IT Plugin :: Class Loader :: Dependency C .... SKIPPED
[INFO] Maven IT Plugin :: Class Loader .................... SKIPPED
[INFO] Maven IT Plugin :: Class Loader :: Aggregator ...... SKIPPED
[INFO] Maven IT Plugin :: Configuration ................... SKIPPED
[INFO] Maven IT Plugin :: Context Passing ................. SKIPPED
[INFO] Maven ITs :: Core Plugin Stubs ..................... SKIPPED
[INFO] Maven IT Clean Plugin Stub ......................... SKIPPED
[INFO] Maven IT Compiler Plugin Stub ...................... SKIPPED
[INFO] Maven IT Deploy Plugin Stub ........................ SKIPPED
[INFO] Maven IT EAR Plugin Stub ........................... SKIPPED
[INFO] Maven IT EJB Plugin Stub ........................... SKIPPED
[INFO] Maven IT Install Plugin Stub ....................... SKIPPED
[INFO] Maven IT JAR Plugin Stub ........................... SKIPPED
[INFO] Maven IT Javadoc Plugin Stub ....................... SKIPPED
[INFO] Maven IT Plugin Plugin Stub ........................ SKIPPED
[INFO] Maven IT RAR Plugin Stub ........................... SKIPPED
[INFO] Maven IT Resources Plugin Stub ..................... SKIPPED
[INFO] Maven IT Site Plugin Stub .......................... SKIPPED
[INFO] Maven IT Source Plugin Stub ........................ SKIPPED
[INFO] Maven IT Surefire Plugin Stub ...................... SKIPPED
[INFO] Maven IT WAR Plugin Stub ........................... SKIPPED
[INFO] Maven IT Plugin :: Dependency Collection ........... SKIPPED
[INFO] Maven IT Plugin :: Dependency Resolution ........... SKIPPED
[INFO] Maven IT Plugin :: Expression ...................... SKIPPED
[INFO] Maven IT Plugin :: Error Mojos ..................... SKIPPED
[INFO] Maven IT Component ................................. SKIPPED
[INFO] Maven IT Plugin :: Extension Consumer .............. SKIPPED
[INFO] Maven IT Plugin :: Extension Provider .............. SKIPPED
[INFO] Maven IT Plugin :: Fork ............................ SKIPPED
[INFO] Maven IT Plugin :: Invalid Descriptor .............. SKIPPED
[INFO] Maven IT Plugin :: Log File ........................ SKIPPED
[INFO] Maven IT Helper Library ............................ SKIPPED
[INFO] Maven IT Plugin :: Model Interpolation ............. SKIPPED
[INFO] Maven IT Plugin :: No Default Component ............ SKIPPED
[INFO] Maven IT Plugin :: No Project ...................... SKIPPED
[INFO] Maven IT Plugin :: Online .......................... SKIPPED
[INFO] Maven IT Plugin :: Optional Mojos .................. SKIPPED
[INFO] Maven IT Plugin :: Packaging ....................... SKIPPED
[INFO] Maven IT Plugin :: Parameter Implementation ........ SKIPPED
[INFO] Maven IT Plugin :: Plugin Dependency ............... SKIPPED
[INFO] Maven IT Plugin :: Project ......................... SKIPPED
[INFO] Maven IT Plugin :: Project Interpolation ........... SKIPPED
[INFO] Maven IT Plugin :: Setter .......................... SKIPPED
[INFO] Maven IT Plugin :: Singleton Component ............. SKIPPED
[INFO] Maven IT Plugin :: Site ............................ SKIPPED
[INFO] Maven IT Plugin :: Toolchain ....................... SKIPPED
[INFO] Maven IT Plugin :: Touch ........................... SKIPPED
[INFO] Maven IT Plugin :: Uses Properties Plugin .......... SKIPPED
[INFO] Maven IT Plugin :: Uses Wagon Plugin ............... SKIPPED
[INFO] Maven IT Plugin :: This plugin should contain the mojos needed by all tests. SKIPPED
[INFO] Maven IT Plugin :: Plexus Utils 1.1 ................ SKIPPED
[INFO] Maven IT Plugin :: Plexus Utils New ................ SKIPPED
[INFO] Maven IT Plugin :: Plexus Component API ............ SKIPPED
[INFO] Maven IT Plugin :: Log4J Client .................... SKIPPED
[INFO] Maven IT Plugin :: Extension 1 ..................... SKIPPED
[INFO] Maven IT Plugin :: Extension 2 ..................... SKIPPED
[INFO] Maven IT Plugin :: Plexus Lifecycle ................ SKIPPED
[INFO] Maven IT Plugin :: Settings ........................ SKIPPED
[INFO] Maven IT Plugin :: mng-5805 extension .............. SKIPPED
[INFO] Maven IT Plugin :: mng-5805 plugin ................. SKIPPED
[INFO] Maven IT Plugin :: mng-5805 plugin-dep ............. SKIPPED
[INFO] Maven IT Plugin :: mng-5958 extension .............. SKIPPED
[INFO] Maven IT Toolchain ................................. SKIPPED
[INFO] Maven IT Wagon ..................................... SKIPPED
[INFO] Maven IT Support Artifacts ......................... SKIPPED
[INFO] Maven IT Extension ................................. SKIPPED
[INFO] Maven ITs .......................................... SKIPPED
[INFO] ------------------------------------------------------------------------
[INFO] BUILD FAILURE
[INFO] ------------------------------------------------------------------------
[INFO] Total time: 10.562 s
[INFO] Finished at: 2016-05-04T16:30:13-07:00
[INFO] Final Memory: 56M/742M
[INFO] ------------------------------------------------------------------------
[ERROR] Failed to execute goal org.apache.maven.plugins:maven-clean-plugin:2.5:clean (default-clean)
on project core-its: Execution default-clean of goal org.apache.maven.plugins:maven-clean-plugin:2.5:clean
failed: Plugin org.apache.maven.plugins:maven-clean-plugin:2.5 or one of its dependencies
could not be resolved: Could not transfer artifact org.codehaus.plexus:plexus-utils:jar:3.0
from/to central (https://repo.maven.apache.org/maven2): GET request of: org/codehaus/plexus/plexus-utils/3.0/plexus-utils-3.0.jar
from central failed: Connection reset -> [Help 1]
org.apache.maven.lifecycle.LifecycleExecutionException: Failed to execute goal org.apache.maven.plugins:maven-clean-plugin:2.5:clean
(default-clean) on project core-its: Execution default-clean of goal org.apache.maven.plugins:maven-clean-plugin:2.5:clean
failed: Plugin org.apache.maven.plugins:maven-clean-plugin:2.5 or one of its dependencies
could not be resolved: Could not transfer artifact org.codehaus.plexus:plexus-utils:jar:3.0
from/to central (https://repo.maven.apache.org/maven2): GET request of: org/codehaus/plexus/plexus-utils/3.0/plexus-utils-3.0.jar
from central failed
	at org.apache.maven.lifecycle.internal.MojoExecutor.execute(MojoExecutor.java:224)
	at org.apache.maven.lifecycle.internal.MojoExecutor.execute(MojoExecutor.java:153)
	at org.apache.maven.lifecycle.internal.MojoExecutor.execute(MojoExecutor.java:145)
	at org.apache.maven.lifecycle.internal.LifecycleModuleBuilder.buildProject(LifecycleModuleBuilder.java:116)
	at org.apache.maven.lifecycle.internal.LifecycleModuleBuilder.buildProject(LifecycleModuleBuilder.java:80)
	at org.apache.maven.lifecycle.internal.builder.singlethreaded.SingleThreadedBuilder.build(SingleThreadedBuilder.java:51)
	at org.apache.maven.lifecycle.internal.LifecycleStarter.execute(LifecycleStarter.java:128)
	at org.apache.maven.DefaultMaven.doExecute(DefaultMaven.java:307)
	at org.apache.maven.DefaultMaven.doExecute(DefaultMaven.java:193)
	at org.apache.maven.DefaultMaven.execute(DefaultMaven.java:106)
	at org.apache.maven.cli.MavenCli.execute(MavenCli.java:862)
	at org.apache.maven.cli.MavenCli.doMain(MavenCli.java:286)
	at org.apache.maven.cli.MavenCli.main(MavenCli.java:197)
	at sun.reflect.NativeMethodAccessorImpl.invoke0(Native Method)
	at sun.reflect.NativeMethodAccessorImpl.invoke(NativeMethodAccessorImpl.java:57)
	at sun.reflect.DelegatingMethodAccessorImpl.invoke(DelegatingMethodAccessorImpl.java:43)
	at java.lang.reflect.Method.invoke(Method.java:601)
	at org.codehaus.plexus.classworlds.launcher.Launcher.launchEnhanced(Launcher.java:289)
	at org.codehaus.plexus.classworlds.launcher.Launcher.launch(Launcher.java:229)
	at org.codehaus.plexus.classworlds.launcher.Launcher.mainWithExitCode(Launcher.java:415)
	at org.codehaus.plexus.classworlds.launcher.Launcher.main(Launcher.java:356)
Caused by: org.apache.maven.plugin.PluginExecutionException: Execution default-clean of goal
org.apache.maven.plugins:maven-clean-plugin:2.5:clean failed: Plugin org.apache.maven.plugins:maven-clean-plugin:2.5
or one of its dependencies could not be resolved: Could not transfer artifact org.codehaus.plexus:plexus-utils:jar:3.0
from/to central (https://repo.maven.apache.org/maven2): GET request of: org/codehaus/plexus/plexus-utils/3.0/plexus-utils-3.0.jar
from central failed
	at org.apache.maven.plugin.DefaultBuildPluginManager.executeMojo(DefaultBuildPluginManager.java:106)
	at org.apache.maven.lifecycle.internal.MojoExecutor.execute(MojoExecutor.java:208)
	... 20 more
Caused by: org.apache.maven.plugin.PluginResolutionException: Plugin org.apache.maven.plugins:maven-clean-plugin:2.5
or one of its dependencies could not be resolved: Could not transfer artifact org.codehaus.plexus:plexus-utils:jar:3.0
from/to central (https://repo.maven.apache.org/maven2): GET request of: org/codehaus/plexus/plexus-utils/3.0/plexus-utils-3.0.jar
from central failed
	at org.apache.maven.plugin.internal.DefaultPluginDependenciesResolver.resolveInternal(DefaultPluginDependenciesResolver.java:218)
	at org.apache.maven.plugin.internal.DefaultPluginDependenciesResolver.resolve(DefaultPluginDependenciesResolver.java:149)
	at org.apache.maven.plugin.internal.DefaultMavenPluginManager.createPluginRealm(DefaultMavenPluginManager.java:418)
	at org.apache.maven.plugin.internal.DefaultMavenPluginManager.setupPluginRealm(DefaultMavenPluginManager.java:358)
	at org.apache.maven.plugin.DefaultBuildPluginManager.getPluginRealm(DefaultBuildPluginManager.java:231)
	at org.apache.maven.plugin.DefaultBuildPluginManager.executeMojo(DefaultBuildPluginManager.java:102)
	... 21 more
Caused by: org.eclipse.aether.resolution.ArtifactResolutionException: Could not transfer artifact
org.codehaus.plexus:plexus-utils:jar:3.0 from/to central (https://repo.maven.apache.org/maven2):
GET request of: org/codehaus/plexus/plexus-utils/3.0/plexus-utils-3.0.jar from central failed
	at org.eclipse.aether.internal.impl.DefaultArtifactResolver.resolve(DefaultArtifactResolver.java:444)
	at org.eclipse.aether.internal.impl.DefaultArtifactResolver.resolveArtifacts(DefaultArtifactResolver.java:246)
	at org.eclipse.aether.internal.impl.DefaultRepositorySystem.resolveDependencies(DefaultRepositorySystem.java:367)
	at org.apache.maven.plugin.internal.DefaultPluginDependenciesResolver.resolveInternal(DefaultPluginDependenciesResolver.java:210)
	... 26 more
Caused by: org.eclipse.aether.transfer.ArtifactTransferException: Could not transfer artifact
org.codehaus.plexus:plexus-utils:jar:3.0 from/to central (https://repo.maven.apache.org/maven2):
GET request of: org/codehaus/plexus/plexus-utils/3.0/plexus-utils-3.0.jar from central failed
	at org.eclipse.aether.connector.basic.ArtifactTransportListener.transferFailed(ArtifactTransportListener.java:43)
	at org.eclipse.aether.connector.basic.BasicRepositoryConnector$TaskRunner.run(BasicRepositoryConnector.java:355)
	at org.eclipse.aether.util.concurrency.RunnableErrorForwarder$1.run(RunnableErrorForwarder.java:67)
	at java.util.concurrent.ThreadPoolExecutor.runWorker(ThreadPoolExecutor.java:1110)
	at java.util.concurrent.ThreadPoolExecutor$Worker.run(ThreadPoolExecutor.java:603)
	at java.lang.Thread.run(Thread.java:722)
Caused by: org.apache.maven.wagon.TransferFailedException: GET request of: org/codehaus/plexus/plexus-utils/3.0/plexus-utils-3.0.jar
from central failed
	at org.apache.maven.wagon.AbstractWagon.getTransfer(AbstractWagon.java:363)
	at org.apache.maven.wagon.AbstractWagon.getTransfer(AbstractWagon.java:316)
	at org.apache.maven.wagon.AbstractWagon.getTransfer(AbstractWagon.java:285)
	at org.apache.maven.wagon.StreamWagon.getIfNewer(StreamWagon.java:97)
	at org.apache.maven.wagon.StreamWagon.get(StreamWagon.java:61)
	at org.eclipse.aether.transport.wagon.WagonTransporter$GetTaskRunner.run(WagonTransporter.java:560)
	at org.eclipse.aether.transport.wagon.WagonTransporter.execute(WagonTransporter.java:427)
	at org.eclipse.aether.transport.wagon.WagonTransporter.get(WagonTransporter.java:404)
	at org.eclipse.aether.connector.basic.BasicRepositoryConnector$GetTaskRunner.runTask(BasicRepositoryConnector.java:447)
	at org.eclipse.aether.connector.basic.BasicRepositoryConnector$TaskRunner.run(BasicRepositoryConnector.java:350)
	... 4 more
Caused by: java.net.SocketException: Connection reset
	at java.net.SocketInputStream.read(SocketInputStream.java:189)
	at java.net.SocketInputStream.read(SocketInputStream.java:121)
	at sun.security.ssl.InputRecord.readFully(InputRecord.java:312)
	at sun.security.ssl.InputRecord.readV3Record(InputRecord.java:424)
	at sun.security.ssl.InputRecord.read(InputRecord.java:379)
	at sun.security.ssl.SSLSocketImpl.readRecord(SSLSocketImpl.java:861)
	at sun.security.ssl.SSLSocketImpl.readDataRecord(SSLSocketImpl.java:818)
	at sun.security.ssl.AppInputStream.read(AppInputStream.java:102)
	at org.apache.maven.wagon.providers.http.httpclient.impl.io.SessionInputBufferImpl.streamRead(SessionInputBufferImpl.java:136)
	at org.apache.maven.wagon.providers.http.httpclient.impl.io.SessionInputBufferImpl.read(SessionInputBufferImpl.java:195)
	at org.apache.maven.wagon.providers.http.httpclient.impl.io.ContentLengthInputStream.read(ContentLengthInputStream.java:178)
	at org.apache.maven.wagon.providers.http.httpclient.conn.EofSensorInputStream.read(EofSensorInputStream.java:137)
	at org.apache.maven.wagon.AbstractWagon.transfer(AbstractWagon.java:531)
	at org.apache.maven.wagon.AbstractWagon.getTransfer(AbstractWagon.java:353)
	... 13 more
[ERROR] 
[ERROR] Re-run Maven using the -X switch to enable full debug logging.
[ERROR] 
[ERROR] For more information about the errors and possible solutions, please read the following
articles:
[ERROR] [Help 1] http://cwiki.apache.org/confluence/display/MAVEN/PluginResolutionException
Build step 'Invoke top-level Maven targets' marked build as failure
Recording test results
ERROR: Step ‘Publish JUnit test result report’ failed: Test reports were found but none
of them are new. Did tests run? 
For example, <https://builds.apache.org/job/core-it-maven-3-win/ws/core-integration-testing-trunk\core-it-suite\target\surefire-reports\TEST-org.apache.maven.it.IntegrationTestSuite.xml>
is 1 day 2 hr old



Mime
View raw message