maven-notifications mailing list archives

Site index · List index
Message view « Date » · « Thread »
Top « Date » · « Thread »
From Apache Jenkins Server <jenk...@builds.apache.org>
Subject Build failed in Jenkins: maven-plugins-ITs-m3 #2406
Date Wed, 25 May 2016 23:23:36 GMT
See <https://builds.apache.org/job/maven-plugins-ITs-m3/2406/changes>

Changes:

[khmarbaise] Cleaned up code.
 o Removed unused code.

------------------------------------------
[...truncated 31852 lines...]
[INFO] Installing <https://builds.apache.org/job/maven-plugins-ITs-m3/ws/maven-docck-plugin/target/maven-docck-plugin-1.2-SNAPSHOT.jar>
to <https://builds.apache.org/job/maven-plugins-ITs-m3/ws/maven-gpg-plugin/target/local-repo/org/apache/maven/plugins/maven-docck-plugin/1.2-SNAPSHOT/maven-docck-plugin-1.2-SNAPSHOT.jar>
[INFO] Installing <https://builds.apache.org/job/maven-plugins-ITs-m3/ws/maven-docck-plugin/pom.xml>
to <https://builds.apache.org/job/maven-plugins-ITs-m3/ws/maven-gpg-plugin/target/local-repo/org/apache/maven/plugins/maven-docck-plugin/1.2-SNAPSHOT/maven-docck-plugin-1.2-SNAPSHOT.pom>
[INFO] Installing <https://builds.apache.org/job/maven-plugins-ITs-m3/ws/maven-ear-plugin/pom.xml>
to <https://builds.apache.org/job/maven-plugins-ITs-m3/ws/maven-gpg-plugin/target/local-repo/org/apache/maven/plugins/maven-ear-plugin/2.10.2-SNAPSHOT/maven-ear-plugin-2.10.2-SNAPSHOT.pom>
[INFO] Installing <https://builds.apache.org/job/maven-plugins-ITs-m3/ws/maven-ear-plugin/target/maven-ear-plugin-2.10.2-SNAPSHOT.jar>
to <https://builds.apache.org/job/maven-plugins-ITs-m3/ws/maven-gpg-plugin/target/local-repo/org/apache/maven/plugins/maven-ear-plugin/2.10.2-SNAPSHOT/maven-ear-plugin-2.10.2-SNAPSHOT.jar>
[INFO] Installing <https://builds.apache.org/job/maven-plugins-ITs-m3/ws/maven-ear-plugin/pom.xml>
to <https://builds.apache.org/job/maven-plugins-ITs-m3/ws/maven-gpg-plugin/target/local-repo/org/apache/maven/plugins/maven-ear-plugin/2.10.2-SNAPSHOT/maven-ear-plugin-2.10.2-SNAPSHOT.pom>
[INFO] Installing <https://builds.apache.org/job/maven-plugins-ITs-m3/ws/maven-ejb-plugin/pom.xml>
to <https://builds.apache.org/job/maven-plugins-ITs-m3/ws/maven-gpg-plugin/target/local-repo/org/apache/maven/plugins/maven-ejb-plugin/2.5.2-SNAPSHOT/maven-ejb-plugin-2.5.2-SNAPSHOT.pom>
[INFO] Installing <https://builds.apache.org/job/maven-plugins-ITs-m3/ws/maven-ejb-plugin/target/maven-ejb-plugin-2.5.2-SNAPSHOT.jar>
to <https://builds.apache.org/job/maven-plugins-ITs-m3/ws/maven-gpg-plugin/target/local-repo/org/apache/maven/plugins/maven-ejb-plugin/2.5.2-SNAPSHOT/maven-ejb-plugin-2.5.2-SNAPSHOT.jar>
[INFO] Installing <https://builds.apache.org/job/maven-plugins-ITs-m3/ws/maven-ejb-plugin/pom.xml>
to <https://builds.apache.org/job/maven-plugins-ITs-m3/ws/maven-gpg-plugin/target/local-repo/org/apache/maven/plugins/maven-ejb-plugin/2.5.2-SNAPSHOT/maven-ejb-plugin-2.5.2-SNAPSHOT.pom>
[INFO] Installing <https://builds.apache.org/job/maven-plugins-ITs-m3/ws/maven-help-plugin/pom.xml>
to <https://builds.apache.org/job/maven-plugins-ITs-m3/ws/maven-gpg-plugin/target/local-repo/org/apache/maven/plugins/maven-help-plugin/2.2.1-SNAPSHOT/maven-help-plugin-2.2.1-SNAPSHOT.pom>
[INFO] Installing <https://builds.apache.org/job/maven-plugins-ITs-m3/ws/maven-help-plugin/target/maven-help-plugin-2.2.1-SNAPSHOT.jar>
to <https://builds.apache.org/job/maven-plugins-ITs-m3/ws/maven-gpg-plugin/target/local-repo/org/apache/maven/plugins/maven-help-plugin/2.2.1-SNAPSHOT/maven-help-plugin-2.2.1-SNAPSHOT.jar>
[INFO] Installing <https://builds.apache.org/job/maven-plugins-ITs-m3/ws/maven-help-plugin/pom.xml>
to <https://builds.apache.org/job/maven-plugins-ITs-m3/ws/maven-gpg-plugin/target/local-repo/org/apache/maven/plugins/maven-help-plugin/2.2.1-SNAPSHOT/maven-help-plugin-2.2.1-SNAPSHOT.pom>
[INFO] Installing <https://builds.apache.org/job/maven-plugins-ITs-m3/ws/maven-install-plugin/pom.xml>
to <https://builds.apache.org/job/maven-plugins-ITs-m3/ws/maven-gpg-plugin/target/local-repo/org/apache/maven/plugins/maven-install-plugin/3.0-SNAPSHOT/maven-install-plugin-3.0-SNAPSHOT.pom>
[INFO] Installing <https://builds.apache.org/job/maven-plugins-ITs-m3/ws/maven-install-plugin/target/maven-install-plugin-3.0-SNAPSHOT.jar>
to <https://builds.apache.org/job/maven-plugins-ITs-m3/ws/maven-gpg-plugin/target/local-repo/org/apache/maven/plugins/maven-install-plugin/3.0-SNAPSHOT/maven-install-plugin-3.0-SNAPSHOT.jar>
[INFO] Installing <https://builds.apache.org/job/maven-plugins-ITs-m3/ws/maven-install-plugin/pom.xml>
to <https://builds.apache.org/job/maven-plugins-ITs-m3/ws/maven-gpg-plugin/target/local-repo/org/apache/maven/plugins/maven-install-plugin/3.0-SNAPSHOT/maven-install-plugin-3.0-SNAPSHOT.pom>
[INFO] Installing <https://builds.apache.org/job/maven-plugins-ITs-m3/ws/maven-jarsigner-plugin/pom.xml>
to <https://builds.apache.org/job/maven-plugins-ITs-m3/ws/maven-gpg-plugin/target/local-repo/org/apache/maven/plugins/maven-jarsigner-plugin/1.5-SNAPSHOT/maven-jarsigner-plugin-1.5-SNAPSHOT.pom>
[INFO] Installing <https://builds.apache.org/job/maven-plugins-ITs-m3/ws/maven-jarsigner-plugin/target/maven-jarsigner-plugin-1.5-SNAPSHOT.jar>
to <https://builds.apache.org/job/maven-plugins-ITs-m3/ws/maven-gpg-plugin/target/local-repo/org/apache/maven/plugins/maven-jarsigner-plugin/1.5-SNAPSHOT/maven-jarsigner-plugin-1.5-SNAPSHOT.jar>
[INFO] Installing <https://builds.apache.org/job/maven-plugins-ITs-m3/ws/maven-jarsigner-plugin/pom.xml>
to <https://builds.apache.org/job/maven-plugins-ITs-m3/ws/maven-gpg-plugin/target/local-repo/org/apache/maven/plugins/maven-jarsigner-plugin/1.5-SNAPSHOT/maven-jarsigner-plugin-1.5-SNAPSHOT.pom>
[INFO] Installing <https://builds.apache.org/job/maven-plugins-ITs-m3/ws/maven-javadoc-plugin/pom.xml>
to <https://builds.apache.org/job/maven-plugins-ITs-m3/ws/maven-gpg-plugin/target/local-repo/org/apache/maven/plugins/maven-javadoc-plugin/2.10.4-SNAPSHOT/maven-javadoc-plugin-2.10.4-SNAPSHOT.pom>
[INFO] Installing <https://builds.apache.org/job/maven-plugins-ITs-m3/ws/maven-javadoc-plugin/target/maven-javadoc-plugin-2.10.4-SNAPSHOT.jar>
to <https://builds.apache.org/job/maven-plugins-ITs-m3/ws/maven-gpg-plugin/target/local-repo/org/apache/maven/plugins/maven-javadoc-plugin/2.10.4-SNAPSHOT/maven-javadoc-plugin-2.10.4-SNAPSHOT.jar>
[INFO] Installing <https://builds.apache.org/job/maven-plugins-ITs-m3/ws/maven-javadoc-plugin/pom.xml>
to <https://builds.apache.org/job/maven-plugins-ITs-m3/ws/maven-gpg-plugin/target/local-repo/org/apache/maven/plugins/maven-javadoc-plugin/2.10.4-SNAPSHOT/maven-javadoc-plugin-2.10.4-SNAPSHOT.pom>
[INFO] Installing <https://builds.apache.org/job/maven-plugins-ITs-m3/ws/maven-linkcheck-plugin/pom.xml>
to <https://builds.apache.org/job/maven-plugins-ITs-m3/ws/maven-gpg-plugin/target/local-repo/org/apache/maven/plugins/maven-linkcheck-plugin/1.3-SNAPSHOT/maven-linkcheck-plugin-1.3-SNAPSHOT.pom>
[INFO] Installing <https://builds.apache.org/job/maven-plugins-ITs-m3/ws/maven-linkcheck-plugin/target/maven-linkcheck-plugin-1.3-SNAPSHOT.jar>
to <https://builds.apache.org/job/maven-plugins-ITs-m3/ws/maven-gpg-plugin/target/local-repo/org/apache/maven/plugins/maven-linkcheck-plugin/1.3-SNAPSHOT/maven-linkcheck-plugin-1.3-SNAPSHOT.jar>
[INFO] Installing <https://builds.apache.org/job/maven-plugins-ITs-m3/ws/maven-linkcheck-plugin/pom.xml>
to <https://builds.apache.org/job/maven-plugins-ITs-m3/ws/maven-gpg-plugin/target/local-repo/org/apache/maven/plugins/maven-linkcheck-plugin/1.3-SNAPSHOT/maven-linkcheck-plugin-1.3-SNAPSHOT.pom>
[INFO] Installing <https://builds.apache.org/job/maven-plugins-ITs-m3/ws/maven-patch-plugin/pom.xml>
to <https://builds.apache.org/job/maven-plugins-ITs-m3/ws/maven-gpg-plugin/target/local-repo/org/apache/maven/plugins/maven-patch-plugin/1.3-SNAPSHOT/maven-patch-plugin-1.3-SNAPSHOT.pom>
[INFO] Installing <https://builds.apache.org/job/maven-plugins-ITs-m3/ws/maven-patch-plugin/target/maven-patch-plugin-1.3-SNAPSHOT.jar>
to <https://builds.apache.org/job/maven-plugins-ITs-m3/ws/maven-gpg-plugin/target/local-repo/org/apache/maven/plugins/maven-patch-plugin/1.3-SNAPSHOT/maven-patch-plugin-1.3-SNAPSHOT.jar>
[INFO] Installing <https://builds.apache.org/job/maven-plugins-ITs-m3/ws/maven-patch-plugin/pom.xml>
to <https://builds.apache.org/job/maven-plugins-ITs-m3/ws/maven-gpg-plugin/target/local-repo/org/apache/maven/plugins/maven-patch-plugin/1.3-SNAPSHOT/maven-patch-plugin-1.3-SNAPSHOT.pom>
[INFO] Installing <https://builds.apache.org/job/maven-plugins-ITs-m3/ws/maven-pdf-plugin/pom.xml>
to <https://builds.apache.org/job/maven-plugins-ITs-m3/ws/maven-gpg-plugin/target/local-repo/org/apache/maven/plugins/maven-pdf-plugin/1.4-SNAPSHOT/maven-pdf-plugin-1.4-SNAPSHOT.pom>
[INFO] Installing <https://builds.apache.org/job/maven-plugins-ITs-m3/ws/maven-pdf-plugin/target/maven-pdf-plugin-1.4-SNAPSHOT.jar>
to <https://builds.apache.org/job/maven-plugins-ITs-m3/ws/maven-gpg-plugin/target/local-repo/org/apache/maven/plugins/maven-pdf-plugin/1.4-SNAPSHOT/maven-pdf-plugin-1.4-SNAPSHOT.jar>
[INFO] Installing <https://builds.apache.org/job/maven-plugins-ITs-m3/ws/maven-pdf-plugin/pom.xml>
to <https://builds.apache.org/job/maven-plugins-ITs-m3/ws/maven-gpg-plugin/target/local-repo/org/apache/maven/plugins/maven-pdf-plugin/1.4-SNAPSHOT/maven-pdf-plugin-1.4-SNAPSHOT.pom>
[INFO] Installing <https://builds.apache.org/job/maven-plugins-ITs-m3/ws/maven-rar-plugin/pom.xml>
to <https://builds.apache.org/job/maven-plugins-ITs-m3/ws/maven-gpg-plugin/target/local-repo/org/apache/maven/plugins/maven-rar-plugin/3.0.0-SNAPSHOT/maven-rar-plugin-3.0.0-SNAPSHOT.pom>
[INFO] Installing <https://builds.apache.org/job/maven-plugins-ITs-m3/ws/maven-rar-plugin/target/maven-rar-plugin-3.0.0-SNAPSHOT.jar>
to <https://builds.apache.org/job/maven-plugins-ITs-m3/ws/maven-gpg-plugin/target/local-repo/org/apache/maven/plugins/maven-rar-plugin/3.0.0-SNAPSHOT/maven-rar-plugin-3.0.0-SNAPSHOT.jar>
[INFO] Installing <https://builds.apache.org/job/maven-plugins-ITs-m3/ws/maven-rar-plugin/pom.xml>
to <https://builds.apache.org/job/maven-plugins-ITs-m3/ws/maven-gpg-plugin/target/local-repo/org/apache/maven/plugins/maven-rar-plugin/3.0.0-SNAPSHOT/maven-rar-plugin-3.0.0-SNAPSHOT.pom>
[INFO] Installing <https://builds.apache.org/job/maven-plugins-ITs-m3/ws/maven-repository-plugin/pom.xml>
to <https://builds.apache.org/job/maven-plugins-ITs-m3/ws/maven-gpg-plugin/target/local-repo/org/apache/maven/plugins/maven-repository-plugin/2.5-SNAPSHOT/maven-repository-plugin-2.5-SNAPSHOT.pom>
[INFO] Installing <https://builds.apache.org/job/maven-plugins-ITs-m3/ws/maven-repository-plugin/target/maven-repository-plugin-2.5-SNAPSHOT.jar>
to <https://builds.apache.org/job/maven-plugins-ITs-m3/ws/maven-gpg-plugin/target/local-repo/org/apache/maven/plugins/maven-repository-plugin/2.5-SNAPSHOT/maven-repository-plugin-2.5-SNAPSHOT.jar>
[INFO] Installing <https://builds.apache.org/job/maven-plugins-ITs-m3/ws/maven-repository-plugin/pom.xml>
to <https://builds.apache.org/job/maven-plugins-ITs-m3/ws/maven-gpg-plugin/target/local-repo/org/apache/maven/plugins/maven-repository-plugin/2.5-SNAPSHOT/maven-repository-plugin-2.5-SNAPSHOT.pom>
[INFO] Installing <https://builds.apache.org/job/maven-plugins-ITs-m3/ws/maven-resources-plugin/pom.xml>
to <https://builds.apache.org/job/maven-plugins-ITs-m3/ws/maven-gpg-plugin/target/local-repo/org/apache/maven/plugins/maven-resources-plugin/3.0.1-SNAPSHOT/maven-resources-plugin-3.0.1-SNAPSHOT.pom>
[INFO] Installing <https://builds.apache.org/job/maven-plugins-ITs-m3/ws/maven-resources-plugin/target/maven-resources-plugin-3.0.1-SNAPSHOT.jar>
to <https://builds.apache.org/job/maven-plugins-ITs-m3/ws/maven-gpg-plugin/target/local-repo/org/apache/maven/plugins/maven-resources-plugin/3.0.1-SNAPSHOT/maven-resources-plugin-3.0.1-SNAPSHOT.jar>
[INFO] Installing <https://builds.apache.org/job/maven-plugins-ITs-m3/ws/maven-resources-plugin/pom.xml>
to <https://builds.apache.org/job/maven-plugins-ITs-m3/ws/maven-gpg-plugin/target/local-repo/org/apache/maven/plugins/maven-resources-plugin/3.0.1-SNAPSHOT/maven-resources-plugin-3.0.1-SNAPSHOT.pom>
[INFO] Installing <https://builds.apache.org/job/maven-plugins-ITs-m3/ws/maven-resources-plugin/target/maven-resources-plugin-3.0.1-SNAPSHOT-tests.jar>
to <https://builds.apache.org/job/maven-plugins-ITs-m3/ws/maven-gpg-plugin/target/local-repo/org/apache/maven/plugins/maven-resources-plugin/3.0.1-SNAPSHOT/maven-resources-plugin-3.0.1-SNAPSHOT-tests.jar>
[INFO] Installing <https://builds.apache.org/job/maven-plugins-ITs-m3/ws/maven-site-plugin/dependency-reduced-pom.xml>
to <https://builds.apache.org/job/maven-plugins-ITs-m3/ws/maven-gpg-plugin/target/local-repo/org/apache/maven/plugins/maven-site-plugin/3.6-SNAPSHOT/maven-site-plugin-3.6-SNAPSHOT.pom>
[INFO] Installing <https://builds.apache.org/job/maven-plugins-ITs-m3/ws/maven-site-plugin/target/maven-site-plugin-3.6-SNAPSHOT.jar>
to <https://builds.apache.org/job/maven-plugins-ITs-m3/ws/maven-gpg-plugin/target/local-repo/org/apache/maven/plugins/maven-site-plugin/3.6-SNAPSHOT/maven-site-plugin-3.6-SNAPSHOT.jar>
[INFO] Installing <https://builds.apache.org/job/maven-plugins-ITs-m3/ws/maven-site-plugin/dependency-reduced-pom.xml>
to <https://builds.apache.org/job/maven-plugins-ITs-m3/ws/maven-gpg-plugin/target/local-repo/org/apache/maven/plugins/maven-site-plugin/3.6-SNAPSHOT/maven-site-plugin-3.6-SNAPSHOT.pom>
[INFO] Installing <https://builds.apache.org/job/maven-plugins-ITs-m3/ws/maven-source-plugin/pom.xml>
to <https://builds.apache.org/job/maven-plugins-ITs-m3/ws/maven-gpg-plugin/target/local-repo/org/apache/maven/plugins/maven-source-plugin/3.0.1-SNAPSHOT/maven-source-plugin-3.0.1-SNAPSHOT.pom>
[INFO] Installing <https://builds.apache.org/job/maven-plugins-ITs-m3/ws/maven-source-plugin/target/maven-source-plugin-3.0.1-SNAPSHOT.jar>
to <https://builds.apache.org/job/maven-plugins-ITs-m3/ws/maven-gpg-plugin/target/local-repo/org/apache/maven/plugins/maven-source-plugin/3.0.1-SNAPSHOT/maven-source-plugin-3.0.1-SNAPSHOT.jar>
[INFO] Installing <https://builds.apache.org/job/maven-plugins-ITs-m3/ws/maven-source-plugin/pom.xml>
to <https://builds.apache.org/job/maven-plugins-ITs-m3/ws/maven-gpg-plugin/target/local-repo/org/apache/maven/plugins/maven-source-plugin/3.0.1-SNAPSHOT/maven-source-plugin-3.0.1-SNAPSHOT.pom>
[INFO] Installing <https://builds.apache.org/job/maven-plugins-ITs-m3/ws/maven-stage-plugin/pom.xml>
to <https://builds.apache.org/job/maven-plugins-ITs-m3/ws/maven-gpg-plugin/target/local-repo/org/apache/maven/plugins/maven-stage-plugin/1.1-SNAPSHOT/maven-stage-plugin-1.1-SNAPSHOT.pom>
[INFO] Installing <https://builds.apache.org/job/maven-plugins-ITs-m3/ws/maven-stage-plugin/target/maven-stage-plugin-1.1-SNAPSHOT.jar>
to <https://builds.apache.org/job/maven-plugins-ITs-m3/ws/maven-gpg-plugin/target/local-repo/org/apache/maven/plugins/maven-stage-plugin/1.1-SNAPSHOT/maven-stage-plugin-1.1-SNAPSHOT.jar>
[INFO] Installing <https://builds.apache.org/job/maven-plugins-ITs-m3/ws/maven-stage-plugin/pom.xml>
to <https://builds.apache.org/job/maven-plugins-ITs-m3/ws/maven-gpg-plugin/target/local-repo/org/apache/maven/plugins/maven-stage-plugin/1.1-SNAPSHOT/maven-stage-plugin-1.1-SNAPSHOT.pom>
[INFO] Installing <https://builds.apache.org/job/maven-plugins-ITs-m3/ws/maven-toolchains-plugin/pom.xml>
to <https://builds.apache.org/job/maven-plugins-ITs-m3/ws/maven-gpg-plugin/target/local-repo/org/apache/maven/plugins/maven-toolchains-plugin/1.2-SNAPSHOT/maven-toolchains-plugin-1.2-SNAPSHOT.pom>
[INFO] Installing <https://builds.apache.org/job/maven-plugins-ITs-m3/ws/maven-toolchains-plugin/target/maven-toolchains-plugin-1.2-SNAPSHOT.jar>
to <https://builds.apache.org/job/maven-plugins-ITs-m3/ws/maven-gpg-plugin/target/local-repo/org/apache/maven/plugins/maven-toolchains-plugin/1.2-SNAPSHOT/maven-toolchains-plugin-1.2-SNAPSHOT.jar>
[INFO] Installing <https://builds.apache.org/job/maven-plugins-ITs-m3/ws/maven-toolchains-plugin/pom.xml>
to <https://builds.apache.org/job/maven-plugins-ITs-m3/ws/maven-gpg-plugin/target/local-repo/org/apache/maven/plugins/maven-toolchains-plugin/1.2-SNAPSHOT/maven-toolchains-plugin-1.2-SNAPSHOT.pom>
[INFO] Installing <https://builds.apache.org/job/maven-plugins-ITs-m3/ws/maven-verifier-plugin/pom.xml>
to <https://builds.apache.org/job/maven-plugins-ITs-m3/ws/maven-gpg-plugin/target/local-repo/org/apache/maven/plugins/maven-verifier-plugin/3.0.0-SNAPSHOT/maven-verifier-plugin-3.0.0-SNAPSHOT.pom>
[INFO] Installing <https://builds.apache.org/job/maven-plugins-ITs-m3/ws/maven-verifier-plugin/target/maven-verifier-plugin-3.0.0-SNAPSHOT.jar>
to <https://builds.apache.org/job/maven-plugins-ITs-m3/ws/maven-gpg-plugin/target/local-repo/org/apache/maven/plugins/maven-verifier-plugin/3.0.0-SNAPSHOT/maven-verifier-plugin-3.0.0-SNAPSHOT.jar>
[INFO] Installing <https://builds.apache.org/job/maven-plugins-ITs-m3/ws/maven-verifier-plugin/pom.xml>
to <https://builds.apache.org/job/maven-plugins-ITs-m3/ws/maven-gpg-plugin/target/local-repo/org/apache/maven/plugins/maven-verifier-plugin/3.0.0-SNAPSHOT/maven-verifier-plugin-3.0.0-SNAPSHOT.pom>
[INFO] Installing <https://builds.apache.org/job/maven-plugins-ITs-m3/ws/maven-war-plugin/pom.xml>
to <https://builds.apache.org/job/maven-plugins-ITs-m3/ws/maven-gpg-plugin/target/local-repo/org/apache/maven/plugins/maven-war-plugin/3.0.0-SNAPSHOT/maven-war-plugin-3.0.0-SNAPSHOT.pom>
[INFO] Installing <https://builds.apache.org/job/maven-plugins-ITs-m3/ws/maven-war-plugin/target/maven-war-plugin-3.0.0-SNAPSHOT.jar>
to <https://builds.apache.org/job/maven-plugins-ITs-m3/ws/maven-gpg-plugin/target/local-repo/org/apache/maven/plugins/maven-war-plugin/3.0.0-SNAPSHOT/maven-war-plugin-3.0.0-SNAPSHOT.jar>
[INFO] Installing <https://builds.apache.org/job/maven-plugins-ITs-m3/ws/maven-war-plugin/pom.xml>
to <https://builds.apache.org/job/maven-plugins-ITs-m3/ws/maven-gpg-plugin/target/local-repo/org/apache/maven/plugins/maven-war-plugin/3.0.0-SNAPSHOT/maven-war-plugin-3.0.0-SNAPSHOT.pom>
[INFO] Installing <https://builds.apache.org/job/maven-plugins-ITs-m3/ws/maven-doap-plugin/pom.xml>
to <https://builds.apache.org/job/maven-plugins-ITs-m3/ws/maven-gpg-plugin/target/local-repo/org/apache/maven/plugins/maven-doap-plugin/1.3-SNAPSHOT/maven-doap-plugin-1.3-SNAPSHOT.pom>
[INFO] Installing <https://builds.apache.org/job/maven-plugins-ITs-m3/ws/maven-doap-plugin/target/maven-doap-plugin-1.3-SNAPSHOT.jar>
to <https://builds.apache.org/job/maven-plugins-ITs-m3/ws/maven-gpg-plugin/target/local-repo/org/apache/maven/plugins/maven-doap-plugin/1.3-SNAPSHOT/maven-doap-plugin-1.3-SNAPSHOT.jar>
[INFO] Installing <https://builds.apache.org/job/maven-plugins-ITs-m3/ws/maven-doap-plugin/pom.xml>
to <https://builds.apache.org/job/maven-plugins-ITs-m3/ws/maven-gpg-plugin/target/local-repo/org/apache/maven/plugins/maven-doap-plugin/1.3-SNAPSHOT/maven-doap-plugin-1.3-SNAPSHOT.pom>
[INFO] Installing <https://builds.apache.org/job/maven-plugins-ITs-m3/ws/maven-pmd-plugin/pom.xml>
to <https://builds.apache.org/job/maven-plugins-ITs-m3/ws/maven-gpg-plugin/target/local-repo/org/apache/maven/plugins/maven-pmd-plugin/3.7-SNAPSHOT/maven-pmd-plugin-3.7-SNAPSHOT.pom>
[INFO] Installing <https://builds.apache.org/job/maven-plugins-ITs-m3/ws/maven-pmd-plugin/target/maven-pmd-plugin-3.7-SNAPSHOT.jar>
to <https://builds.apache.org/job/maven-plugins-ITs-m3/ws/maven-gpg-plugin/target/local-repo/org/apache/maven/plugins/maven-pmd-plugin/3.7-SNAPSHOT/maven-pmd-plugin-3.7-SNAPSHOT.jar>
[INFO] Installing <https://builds.apache.org/job/maven-plugins-ITs-m3/ws/maven-pmd-plugin/pom.xml>
to <https://builds.apache.org/job/maven-plugins-ITs-m3/ws/maven-gpg-plugin/target/local-repo/org/apache/maven/plugins/maven-pmd-plugin/3.7-SNAPSHOT/maven-pmd-plugin-3.7-SNAPSHOT.pom>
[INFO] Installing <https://builds.apache.org/job/maven-plugins-ITs-m3/ws/maven-invoker-plugin/pom.xml>
to <https://builds.apache.org/job/maven-plugins-ITs-m3/ws/maven-gpg-plugin/target/local-repo/org/apache/maven/plugins/maven-invoker-plugin/2.0.1-SNAPSHOT/maven-invoker-plugin-2.0.1-SNAPSHOT.pom>
[INFO] Installing <https://builds.apache.org/job/maven-plugins-ITs-m3/ws/maven-invoker-plugin/target/maven-invoker-plugin-2.0.1-SNAPSHOT.jar>
to <https://builds.apache.org/job/maven-plugins-ITs-m3/ws/maven-gpg-plugin/target/local-repo/org/apache/maven/plugins/maven-invoker-plugin/2.0.1-SNAPSHOT/maven-invoker-plugin-2.0.1-SNAPSHOT.jar>
[INFO] Installing <https://builds.apache.org/job/maven-plugins-ITs-m3/ws/maven-invoker-plugin/pom.xml>
to <https://builds.apache.org/job/maven-plugins-ITs-m3/ws/maven-gpg-plugin/target/local-repo/org/apache/maven/plugins/maven-invoker-plugin/2.0.1-SNAPSHOT/maven-invoker-plugin-2.0.1-SNAPSHOT.pom>
[INFO] Installing <https://builds.apache.org/job/maven-plugins-ITs-m3/ws/maven-jar-plugin/pom.xml>
to <https://builds.apache.org/job/maven-plugins-ITs-m3/ws/maven-gpg-plugin/target/local-repo/org/apache/maven/plugins/maven-jar-plugin/3.0.1-SNAPSHOT/maven-jar-plugin-3.0.1-SNAPSHOT.pom>
[INFO] Installing <https://builds.apache.org/job/maven-plugins-ITs-m3/ws/maven-jar-plugin/target/maven-jar-plugin-3.0.1-SNAPSHOT.jar>
to <https://builds.apache.org/job/maven-plugins-ITs-m3/ws/maven-gpg-plugin/target/local-repo/org/apache/maven/plugins/maven-jar-plugin/3.0.1-SNAPSHOT/maven-jar-plugin-3.0.1-SNAPSHOT.jar>
[INFO] Installing <https://builds.apache.org/job/maven-plugins-ITs-m3/ws/maven-jar-plugin/pom.xml>
to <https://builds.apache.org/job/maven-plugins-ITs-m3/ws/maven-gpg-plugin/target/local-repo/org/apache/maven/plugins/maven-jar-plugin/3.0.1-SNAPSHOT/maven-jar-plugin-3.0.1-SNAPSHOT.pom>
[INFO] Installing <https://builds.apache.org/job/maven-plugins-ITs-m3/ws/maven-checkstyle-plugin/pom.xml>
to <https://builds.apache.org/job/maven-plugins-ITs-m3/ws/maven-gpg-plugin/target/local-repo/org/apache/maven/plugins/maven-checkstyle-plugin/2.18-SNAPSHOT/maven-checkstyle-plugin-2.18-SNAPSHOT.pom>
[INFO] Installing <https://builds.apache.org/job/maven-plugins-ITs-m3/ws/maven-checkstyle-plugin/target/maven-checkstyle-plugin-2.18-SNAPSHOT.jar>
to <https://builds.apache.org/job/maven-plugins-ITs-m3/ws/maven-gpg-plugin/target/local-repo/org/apache/maven/plugins/maven-checkstyle-plugin/2.18-SNAPSHOT/maven-checkstyle-plugin-2.18-SNAPSHOT.jar>
[INFO] Installing <https://builds.apache.org/job/maven-plugins-ITs-m3/ws/maven-checkstyle-plugin/pom.xml>
to <https://builds.apache.org/job/maven-plugins-ITs-m3/ws/maven-gpg-plugin/target/local-repo/org/apache/maven/plugins/maven-checkstyle-plugin/2.18-SNAPSHOT/maven-checkstyle-plugin-2.18-SNAPSHOT.pom>
[INFO] Installing <https://builds.apache.org/job/maven-plugins-ITs-m3/ws/maven-project-info-reports-plugin/pom.xml>
to <https://builds.apache.org/job/maven-plugins-ITs-m3/ws/maven-gpg-plugin/target/local-repo/org/apache/maven/plugins/maven-project-info-reports-plugin/2.10-SNAPSHOT/maven-project-info-reports-plugin-2.10-SNAPSHOT.pom>
[INFO] Installing <https://builds.apache.org/job/maven-plugins-ITs-m3/ws/maven-project-info-reports-plugin/target/maven-project-info-reports-plugin-2.10-SNAPSHOT.jar>
to <https://builds.apache.org/job/maven-plugins-ITs-m3/ws/maven-gpg-plugin/target/local-repo/org/apache/maven/plugins/maven-project-info-reports-plugin/2.10-SNAPSHOT/maven-project-info-reports-plugin-2.10-SNAPSHOT.jar>
[INFO] Installing <https://builds.apache.org/job/maven-plugins-ITs-m3/ws/maven-project-info-reports-plugin/pom.xml>
to <https://builds.apache.org/job/maven-plugins-ITs-m3/ws/maven-gpg-plugin/target/local-repo/org/apache/maven/plugins/maven-project-info-reports-plugin/2.10-SNAPSHOT/maven-project-info-reports-plugin-2.10-SNAPSHOT.pom>
[INFO] Installing <https://builds.apache.org/job/maven-plugins-ITs-m3/ws/maven-remote-resources-plugin/pom.xml>
to <https://builds.apache.org/job/maven-plugins-ITs-m3/ws/maven-gpg-plugin/target/local-repo/org/apache/maven/plugins/maven-remote-resources-plugin/1.6-SNAPSHOT/maven-remote-resources-plugin-1.6-SNAPSHOT.pom>
[INFO] Installing <https://builds.apache.org/job/maven-plugins-ITs-m3/ws/maven-remote-resources-plugin/target/maven-remote-resources-plugin-1.6-SNAPSHOT.jar>
to <https://builds.apache.org/job/maven-plugins-ITs-m3/ws/maven-gpg-plugin/target/local-repo/org/apache/maven/plugins/maven-remote-resources-plugin/1.6-SNAPSHOT/maven-remote-resources-plugin-1.6-SNAPSHOT.jar>
[INFO] Installing <https://builds.apache.org/job/maven-plugins-ITs-m3/ws/maven-remote-resources-plugin/pom.xml>
to <https://builds.apache.org/job/maven-plugins-ITs-m3/ws/maven-gpg-plugin/target/local-repo/org/apache/maven/plugins/maven-remote-resources-plugin/1.6-SNAPSHOT/maven-remote-resources-plugin-1.6-SNAPSHOT.pom>
[INFO] Installing <https://builds.apache.org/job/maven-plugins-ITs-m3/ws/maven-shade-plugin/pom.xml>
to <https://builds.apache.org/job/maven-plugins-ITs-m3/ws/maven-gpg-plugin/target/local-repo/org/apache/maven/plugins/maven-shade-plugin/3.0.0-SNAPSHOT/maven-shade-plugin-3.0.0-SNAPSHOT.pom>
[INFO] Installing <https://builds.apache.org/job/maven-plugins-ITs-m3/ws/maven-shade-plugin/target/maven-shade-plugin-3.0.0-SNAPSHOT.jar>
to <https://builds.apache.org/job/maven-plugins-ITs-m3/ws/maven-gpg-plugin/target/local-repo/org/apache/maven/plugins/maven-shade-plugin/3.0.0-SNAPSHOT/maven-shade-plugin-3.0.0-SNAPSHOT.jar>
[INFO] Installing <https://builds.apache.org/job/maven-plugins-ITs-m3/ws/maven-shade-plugin/pom.xml>
to <https://builds.apache.org/job/maven-plugins-ITs-m3/ws/maven-gpg-plugin/target/local-repo/org/apache/maven/plugins/maven-shade-plugin/3.0.0-SNAPSHOT/maven-shade-plugin-3.0.0-SNAPSHOT.pom>
[INFO] Installing <https://builds.apache.org/job/maven-plugins-ITs-m3/ws/maven-shade-plugin/target/maven-shade-plugin-3.0.0-SNAPSHOT-tests.jar>
to <https://builds.apache.org/job/maven-plugins-ITs-m3/ws/maven-gpg-plugin/target/local-repo/org/apache/maven/plugins/maven-shade-plugin/3.0.0-SNAPSHOT/maven-shade-plugin-3.0.0-SNAPSHOT-tests.jar>
[INFO] Installing <https://builds.apache.org/job/maven-plugins-ITs-m3/ws/maven-scm-publish-plugin/pom.xml>
to <https://builds.apache.org/job/maven-plugins-ITs-m3/ws/maven-gpg-plugin/target/local-repo/org/apache/maven/plugins/maven-scm-publish-plugin/1.2-SNAPSHOT/maven-scm-publish-plugin-1.2-SNAPSHOT.pom>
[INFO] Installing <https://builds.apache.org/job/maven-plugins-ITs-m3/ws/maven-scm-publish-plugin/target/maven-scm-publish-plugin-1.2-SNAPSHOT.jar>
to <https://builds.apache.org/job/maven-plugins-ITs-m3/ws/maven-gpg-plugin/target/local-repo/org/apache/maven/plugins/maven-scm-publish-plugin/1.2-SNAPSHOT/maven-scm-publish-plugin-1.2-SNAPSHOT.jar>
[INFO] Installing <https://builds.apache.org/job/maven-plugins-ITs-m3/ws/maven-scm-publish-plugin/pom.xml>
to <https://builds.apache.org/job/maven-plugins-ITs-m3/ws/maven-gpg-plugin/target/local-repo/org/apache/maven/plugins/maven-scm-publish-plugin/1.2-SNAPSHOT/maven-scm-publish-plugin-1.2-SNAPSHOT.pom>
[INFO] Installing <https://builds.apache.org/job/maven-plugins-ITs-m3/ws/maven-assembly-plugin/pom.xml>
to <https://builds.apache.org/job/maven-plugins-ITs-m3/ws/maven-gpg-plugin/target/local-repo/org/apache/maven/plugins/maven-assembly-plugin/3.0-SNAPSHOT/maven-assembly-plugin-3.0-SNAPSHOT.pom>
[INFO] Installing <https://builds.apache.org/job/maven-plugins-ITs-m3/ws/maven-assembly-plugin/target/maven-assembly-plugin-3.0-SNAPSHOT.jar>
to <https://builds.apache.org/job/maven-plugins-ITs-m3/ws/maven-gpg-plugin/target/local-repo/org/apache/maven/plugins/maven-assembly-plugin/3.0-SNAPSHOT/maven-assembly-plugin-3.0-SNAPSHOT.jar>
[INFO] Installing <https://builds.apache.org/job/maven-plugins-ITs-m3/ws/maven-assembly-plugin/pom.xml>
to <https://builds.apache.org/job/maven-plugins-ITs-m3/ws/maven-gpg-plugin/target/local-repo/org/apache/maven/plugins/maven-assembly-plugin/3.0-SNAPSHOT/maven-assembly-plugin-3.0-SNAPSHOT.pom>
[INFO] Installing <https://builds.apache.org/job/maven-plugins-ITs-m3/ws/maven-dependency-plugin/pom.xml>
to <https://builds.apache.org/job/maven-plugins-ITs-m3/ws/maven-gpg-plugin/target/local-repo/org/apache/maven/plugins/maven-dependency-plugin/3.0-SNAPSHOT/maven-dependency-plugin-3.0-SNAPSHOT.pom>
[INFO] Installing <https://builds.apache.org/job/maven-plugins-ITs-m3/ws/maven-dependency-plugin/target/maven-dependency-plugin-3.0-SNAPSHOT.jar>
to <https://builds.apache.org/job/maven-plugins-ITs-m3/ws/maven-gpg-plugin/target/local-repo/org/apache/maven/plugins/maven-dependency-plugin/3.0-SNAPSHOT/maven-dependency-plugin-3.0-SNAPSHOT.jar>
[INFO] Installing <https://builds.apache.org/job/maven-plugins-ITs-m3/ws/maven-gpg-plugin/pom.xml>
to <https://builds.apache.org/job/maven-plugins-ITs-m3/ws/maven-gpg-plugin/target/local-repo/org/apache/maven/plugins/maven-gpg-plugin/1.7-SNAPSHOT/maven-gpg-plugin-1.7-SNAPSHOT.pom>
[INFO] Installing <https://builds.apache.org/job/maven-plugins-ITs-m3/ws/maven-gpg-plugin/target/maven-gpg-plugin-1.7-SNAPSHOT.jar>
to <https://builds.apache.org/job/maven-plugins-ITs-m3/ws/maven-gpg-plugin/target/local-repo/org/apache/maven/plugins/maven-gpg-plugin/1.7-SNAPSHOT/maven-gpg-plugin-1.7-SNAPSHOT.jar>
[INFO] 
[INFO] --- maven-invoker-plugin:2.0.0:integration-test (integration-test) @ maven-gpg-plugin
---
[INFO] Building: sign-with-passphase-from-maven-settings/pom.xml
[INFO] run script verify.bsh
[INFO] ..SUCCESS (7.9 s)
[INFO] Building: alternative-secret-keyring/pom.xml
[INFO] run script verify.bsh
[INFO] ..SUCCESS (5.9 s)
[INFO] Building: sign-release/pom.xml
[INFO] run script verify.bsh
[INFO] ..SUCCESS (6.1 s)
[INFO] Building: no-main-artifact/pom.xml
[INFO] run script verify.bsh
[INFO] ..SUCCESS (3.3 s)
[INFO] 
[INFO] --- maven-invoker-plugin:2.0.0:verify (integration-test) @ maven-gpg-plugin ---
[INFO] -------------------------------------------------
[INFO] Build Summary:
[INFO]   Passed: 4, Failed: 0, Errors: 0, Skipped: 0
[INFO] -------------------------------------------------
[INFO] 
[INFO] --- maven-checkstyle-plugin:2.15:check (checkstyle-check) @ maven-gpg-plugin ---
[INFO] There is 1 error reported by Checkstyle 6.1.1 with config/maven_checks.xml ruleset.
[INFO] Ignored 1 error, 0 violation remaining.
[INFO] 
[INFO] --- maven-install-plugin:2.5.2:install (default-install) @ maven-gpg-plugin ---
[INFO] Installing <https://builds.apache.org/job/maven-plugins-ITs-m3/ws/maven-gpg-plugin/target/maven-gpg-plugin-1.7-SNAPSHOT.jar>
to /home/jenkins/.m2/repository/org/apache/maven/plugins/maven-gpg-plugin/1.7-SNAPSHOT/maven-gpg-plugin-1.7-SNAPSHOT.jar
[INFO] Installing <https://builds.apache.org/job/maven-plugins-ITs-m3/ws/maven-gpg-plugin/pom.xml>
to /home/jenkins/.m2/repository/org/apache/maven/plugins/maven-gpg-plugin/1.7-SNAPSHOT/maven-gpg-plugin-1.7-SNAPSHOT.pom
[INFO]                                                                         
[INFO] ------------------------------------------------------------------------
[INFO] Building Apache Maven Plugins Aggregator 1-SNAPSHOT
[INFO] ------------------------------------------------------------------------
[INFO] 
[INFO] --- maven-clean-plugin:2.5:clean (default-clean) @ maven-plugins-aggregator ---
[INFO] 
[INFO] --- maven-enforcer-plugin:1.3.1:enforce (enforce-bytecode-version) @ maven-plugins-aggregator
---
[INFO] 
[INFO] --- maven-enforcer-plugin:1.3.1:enforce (ban-known-bad-maven-versions) @ maven-plugins-aggregator
---
[INFO] 
[INFO] --- maven-remote-resources-plugin:1.5:process (default) @ maven-plugins-aggregator
---
[INFO] 
[INFO] --- maven-site-plugin:3.3:attach-descriptor (attach-descriptor) @ maven-plugins-aggregator
---
[INFO] 
[INFO] --- maven-install-plugin:2.5.1:install (default-install) @ maven-plugins-aggregator
---
[INFO] Installing <https://builds.apache.org/job/maven-plugins-ITs-m3/ws/pom.xml> to
/home/jenkins/.m2/repository/org/apache/maven/plugins/maven-plugins-aggregator/1-SNAPSHOT/maven-plugins-aggregator-1-SNAPSHOT.pom
[INFO] ------------------------------------------------------------------------
[INFO] Reactor Summary:
[INFO] 
[INFO] Apache Maven ACR Plugin ........................... SUCCESS [ 35.862 s]
[INFO] Apache Maven Ant Plugin ........................... SUCCESS [01:39 min]
[INFO] Apache Maven AntRun Plugin ........................ SUCCESS [ 55.572 s]
[INFO] Apache Maven Changelog Plugin ..................... SUCCESS [ 50.212 s]
[INFO] Apache Maven Changes Plugin ....................... SUCCESS [01:01 min]
[INFO] Apache Maven Clean Plugin ......................... SUCCESS [ 28.654 s]
[INFO] Apache Maven Compiler Plugin ...................... FAILURE [  2.085 s]
[INFO] Apache Maven Deploy Plugin ........................ SUCCESS [01:47 min]
[INFO] Apache Maven Documentation Checker Plugin ......... SUCCESS [  7.055 s]
[INFO] Apache Maven EAR Plugin ........................... SUCCESS [05:25 min]
[INFO] Apache Maven EJB Plugin ........................... SUCCESS [ 58.315 s]
[INFO] Apache Maven Help Plugin .......................... SUCCESS [01:06 min]
[INFO] Apache Maven Install Plugin ....................... SUCCESS [01:36 min]
[INFO] Apache Maven Jarsigner Plugin ..................... SUCCESS [01:08 min]
[INFO] Apache Maven Javadoc Plugin ....................... SUCCESS [07:05 min]
[INFO] Apache Maven Linkcheck Plugin ..................... SUCCESS [  5.590 s]
[INFO] Apache Maven Patch Plugin ......................... SUCCESS [ 21.554 s]
[INFO] Apache Maven PDF Plugin ........................... SUCCESS [01:27 min]
[INFO] Apache Maven RAR Plugin ........................... SUCCESS [ 22.617 s]
[INFO] Apache Maven Repository Plugin .................... SUCCESS [01:18 min]
[INFO] Apache Maven Resources Plugin ..................... SUCCESS [01:51 min]
[INFO] Apache Maven Site Plugin .......................... SUCCESS [09:59 min]
[INFO] Apache Maven Source Plugin ........................ SUCCESS [01:21 min]
[INFO] Apache Maven Stage Plugin ......................... SUCCESS [  2.364 s]
[INFO] Apache Maven Toolchains Plugin .................... SUCCESS [ 20.571 s]
[INFO] Apache Maven Verifier Plugin ...................... SUCCESS [ 12.261 s]
[INFO] Apache Maven WAR Plugin ........................... SUCCESS [02:22 min]
[INFO] Apache Maven DOAP Plugin .......................... SUCCESS [ 26.449 s]
[INFO] Apache Maven PMD Plugin ........................... SUCCESS [02:40 min]
[INFO] Apache Maven Invoker Plugin ....................... SUCCESS [08:30 min]
[INFO] Apache Maven JAR Plugin ........................... SUCCESS [02:50 min]
[INFO] Apache Maven Checkstyle Plugin .................... SUCCESS [06:22 min]
[INFO] Apache Maven Project Info Reports Plugin .......... SUCCESS [04:06 min]
[INFO] Apache Maven Remote Resources Plugin .............. SUCCESS [01:39 min]
[INFO] Apache Maven Shade Plugin ......................... SUCCESS [04:55 min]
[INFO] Apache Maven SCM Publish Plugin ................... SUCCESS [ 58.100 s]
[INFO] Apache Maven Assembly Plugin ...................... SUCCESS [20:35 min]
[INFO] Apache Maven Dependency Plugin .................... FAILURE [01:36 min]
[INFO] Apache Maven GPG Plugin ........................... SUCCESS [ 24.305 s]
[INFO] Apache Maven Plugins Aggregator ................... SUCCESS [  0.691 s]
[INFO] ------------------------------------------------------------------------
[INFO] BUILD FAILURE
[INFO] ------------------------------------------------------------------------
[INFO] Total time: 01:39 h
[INFO] Finished at: 2016-05-25T23:23:01+00:00
[INFO] Final Memory: 124M/446M
[INFO] ------------------------------------------------------------------------
[WARNING] The requested profile "apache.snapshots" could not be activated because it does
not exist.
[ERROR] Failed to execute goal org.apache.maven.plugins:maven-enforcer-plugin:1.4.1:enforce
(enforce-bytecode-version) on project maven-compiler-plugin: Some Enforcer rules have failed.
Look above for specific messages explaining why the rule failed. -> [Help 1]
[ERROR] Failed to execute goal org.codehaus.mojo:mrm-maven-plugin:1.0-beta-2:start (default)
on project maven-dependency-plugin: Execution default of goal org.codehaus.mojo:mrm-maven-plugin:1.0-beta-2:start
failed: A required class was missing while executing org.codehaus.mojo:mrm-maven-plugin:1.0-beta-2:start:
org/mortbay/component/LifeCycle
[ERROR] -----------------------------------------------------
[ERROR] realm =    plugin>org.codehaus.mojo:mrm-maven-plugin:1.0-beta-2
[ERROR] strategy = org.codehaus.plexus.classworlds.strategy.SelfFirstStrategy
[ERROR] urls[0] = file:/home/jenkins/.m2/repository/org/codehaus/mojo/mrm-maven-plugin/1.0-beta-2/mrm-maven-plugin-1.0-beta-2.jar
[ERROR] urls[1] = file:/home/jenkins/.m2/repository/org/codehaus/mojo/mrm-api/1.0-beta-2/mrm-api-1.0-beta-2.jar
[ERROR] urls[2] = file:/home/jenkins/.m2/repository/backport-util-concurrent/backport-util-concurrent/3.1/backport-util-concurrent-3.1.jar
[ERROR] urls[3] = file:/home/jenkins/.m2/repository/org/apache/maven/archetype/archetype-common/2.2/archetype-common-2.2.jar
[ERROR] urls[4] = file:/home/jenkins/.m2/repository/org/apache/maven/archetype/archetype-catalog/2.2/archetype-catalog-2.2.jar
[ERROR] urls[5] = file:/home/jenkins/.m2/repository/org/apache/maven/archetype/archetype-descriptor/2.2/archetype-descriptor-2.2.jar
[ERROR] urls[6] = file:/home/jenkins/.m2/repository/org/apache/maven/archetype/archetype-registry/2.2/archetype-registry-2.2.jar
[ERROR] urls[7] = file:/home/jenkins/.m2/repository/net/sourceforge/jchardet/jchardet/1.0/jchardet-1.0.jar
[ERROR] urls[8] = file:/home/jenkins/.m2/repository/org/codehaus/plexus/plexus-component-annotations/1.5.5/plexus-component-annotations-1.5.5.jar
[ERROR] urls[9] = file:/home/jenkins/.m2/repository/dom4j/dom4j/1.6.1/dom4j-1.6.1.jar
[ERROR] urls[10] = file:/home/jenkins/.m2/repository/xml-apis/xml-apis/1.0.b2/xml-apis-1.0.b2.jar
[ERROR] urls[11] = file:/home/jenkins/.m2/repository/jdom/jdom/1.0/jdom-1.0.jar
[ERROR] urls[12] = file:/home/jenkins/.m2/repository/org/apache/maven/shared/maven-invoker/2.0.11/maven-invoker-2.0.11.jar
[ERROR] urls[13] = file:/home/jenkins/.m2/repository/org/codehaus/plexus/plexus-velocity/1.1.8/plexus-velocity-1.1.8.jar
[ERROR] urls[14] = file:/home/jenkins/.m2/repository/commons-collections/commons-collections/3.1/commons-collections-3.1.jar
[ERROR] urls[15] = file:/home/jenkins/.m2/repository/org/apache/velocity/velocity/1.5/velocity-1.5.jar
[ERROR] urls[16] = file:/home/jenkins/.m2/repository/oro/oro/2.0.8/oro-2.0.8.jar
[ERROR] urls[17] = file:/home/jenkins/.m2/repository/org/codehaus/mojo/mrm-servlet/1.0-beta-2/mrm-servlet-1.0-beta-2.jar
[ERROR] urls[18] = file:/home/jenkins/.m2/repository/commons-io/commons-io/2.0.1/commons-io-2.0.1.jar
[ERROR] urls[19] = file:/home/jenkins/.m2/repository/org/mortbay/jetty/jetty/6.1.5/jetty-6.1.5.jar
[ERROR] urls[20] = file:/home/jenkins/.m2/repository/org/mortbay/jetty/jetty-util/6.1.5/jetty-util-6.1.5.jar
[ERROR] urls[21] = file:/home/jenkins/.m2/repository/org/mortbay/jetty/servlet-api-2.5/6.1.5/servlet-api-2.5-6.1.5.jar
[ERROR] urls[22] = file:/home/jenkins/.m2/repository/org/apache/maven/shared/maven-common-artifact-filters/1.2/maven-common-artifact-filters-1.2.jar
[ERROR] urls[23] = file:/home/jenkins/.m2/repository/org/apache/maven/shared/maven-plugin-testing-harness/1.1/maven-plugin-testing-harness-1.1.jar
[ERROR] urls[24] = file:/home/jenkins/.m2/repository/org/slf4j/slf4j-jdk14/1.5.6/slf4j-jdk14-1.5.6.jar
[ERROR] urls[25] = file:/home/jenkins/.m2/repository/org/slf4j/slf4j-api/1.5.6/slf4j-api-1.5.6.jar
[ERROR] urls[26] = file:/home/jenkins/.m2/repository/org/slf4j/jcl-over-slf4j/1.5.6/jcl-over-slf4j-1.5.6.jar
[ERROR] urls[27] = file:/home/jenkins/.m2/repository/org/apache/maven/reporting/maven-reporting-api/2.2.1/maven-reporting-api-2.2.1.jar
[ERROR] urls[28] = file:/home/jenkins/.m2/repository/org/apache/maven/doxia/doxia-sink-api/1.1/doxia-sink-api-1.1.jar
[ERROR] urls[29] = file:/home/jenkins/.m2/repository/org/apache/maven/doxia/doxia-logging-api/1.1/doxia-logging-api-1.1.jar
[ERROR] urls[30] = file:/home/jenkins/.m2/repository/commons-cli/commons-cli/1.2/commons-cli-1.2.jar
[ERROR] urls[31] = file:/home/jenkins/.m2/repository/org/codehaus/plexus/plexus-interactivity-api/1.0-alpha-4/plexus-interactivity-api-1.0-alpha-4.jar
[ERROR] urls[32] = file:/home/jenkins/.m2/repository/org/sonatype/plexus/plexus-sec-dispatcher/1.3/plexus-sec-dispatcher-1.3.jar
[ERROR] urls[33] = file:/home/jenkins/.m2/repository/org/sonatype/plexus/plexus-cipher/1.4/plexus-cipher-1.4.jar
[ERROR] urls[34] = file:/home/jenkins/.m2/repository/org/codehaus/plexus/plexus-archiver/1.0-alpha-7/plexus-archiver-1.0-alpha-7.jar
[ERROR] urls[35] = file:/home/jenkins/.m2/repository/org/codehaus/plexus/plexus-utils/3.0.5/plexus-utils-3.0.5.jar
[ERROR] urls[36] = file:/home/jenkins/.m2/repository/org/codehaus/plexus/plexus-interpolation/1.11/plexus-interpolation-1.11.jar
[ERROR] urls[37] = file:/home/jenkins/.m2/repository/commons-lang/commons-lang/2.6/commons-lang-2.6.jar
[ERROR] Number of foreign imports: 1
[ERROR] import: Entry[import  from realm ClassRealm[maven.api, parent: null]]
[ERROR] 
[ERROR] -----------------------------------------------------: org.mortbay.component.LifeCycle
[ERROR] -> [Help 2]
[ERROR] 
[ERROR] To see the full stack trace of the errors, re-run Maven with the -e switch.
[ERROR] Re-run Maven using the -X switch to enable full debug logging.
[ERROR] 
[ERROR] For more information about the errors and possible solutions, please read the following
articles:
[ERROR] [Help 1] http://cwiki.apache.org/confluence/display/MAVEN/MojoExecutionException
[ERROR] [Help 2] http://cwiki.apache.org/confluence/display/MAVEN/PluginContainerException
[ERROR] 
[ERROR] After correcting the problems, you can resume the build with the command
[ERROR]   mvn <goals> -rf :maven-compiler-plugin
Build step 'Invoke top-level Maven targets' marked build as failure
Deleting 1 temporary files
Recording test results

Mime
View raw message