maven-notifications mailing list archives

Site index · List index
Message view « Date » · « Thread »
Top « Date » · « Thread »
From Apache Jenkins Server <jenk...@builds.apache.org>
Subject Build failed in Jenkins: maven-plugins-ITs-m3-windows #1555
Date Mon, 16 May 2016 02:11:23 GMT
See <https://builds.apache.org/job/maven-plugins-ITs-m3-windows/1555/changes>

Changes:

[khmarbaise] [MRESOURCES-221] Additional practices for Filtering example page
 o Fixed some parts of the binaries-filtering.apt.vm page.
 o Added best practice for filtered/non filtered folders

------------------------------------------
[...truncated 12358 lines...]
[INFO] Installing F:\hudson\hudson-slave\workspace\maven-plugins-ITs-m3-windows\maven-war-plugin\pom.xml
to F:\hudson\hudson-slave\workspace\maven-plugins-ITs-m3-windows\maven-dependency-plugin\target\local-repo\org\apache\maven\plugins\maven-war-plugin\3.0.0-SNAPSHOT\maven-war-plugin-3.0.0-SNAPSHOT.pom
[INFO] Installing F:\hudson\hudson-slave\workspace\maven-plugins-ITs-m3-windows\maven-doap-plugin\pom.xml
to F:\hudson\hudson-slave\workspace\maven-plugins-ITs-m3-windows\maven-dependency-plugin\target\local-repo\org\apache\maven\plugins\maven-doap-plugin\1.3-SNAPSHOT\maven-doap-plugin-1.3-SNAPSHOT.pom
[INFO] Installing F:\hudson\hudson-slave\workspace\maven-plugins-ITs-m3-windows\maven-doap-plugin\target\maven-doap-plugin-1.3-SNAPSHOT.jar
to F:\hudson\hudson-slave\workspace\maven-plugins-ITs-m3-windows\maven-dependency-plugin\target\local-repo\org\apache\maven\plugins\maven-doap-plugin\1.3-SNAPSHOT\maven-doap-plugin-1.3-SNAPSHOT.jar
[INFO] Installing F:\hudson\hudson-slave\workspace\maven-plugins-ITs-m3-windows\maven-doap-plugin\pom.xml
to F:\hudson\hudson-slave\workspace\maven-plugins-ITs-m3-windows\maven-dependency-plugin\target\local-repo\org\apache\maven\plugins\maven-doap-plugin\1.3-SNAPSHOT\maven-doap-plugin-1.3-SNAPSHOT.pom
[INFO] Installing F:\hudson\hudson-slave\workspace\maven-plugins-ITs-m3-windows\maven-pmd-plugin\pom.xml
to F:\hudson\hudson-slave\workspace\maven-plugins-ITs-m3-windows\maven-dependency-plugin\target\local-repo\org\apache\maven\plugins\maven-pmd-plugin\3.7-SNAPSHOT\maven-pmd-plugin-3.7-SNAPSHOT.pom
[INFO] Installing F:\hudson\hudson-slave\workspace\maven-plugins-ITs-m3-windows\maven-pmd-plugin\target\maven-pmd-plugin-3.7-SNAPSHOT.jar
to F:\hudson\hudson-slave\workspace\maven-plugins-ITs-m3-windows\maven-dependency-plugin\target\local-repo\org\apache\maven\plugins\maven-pmd-plugin\3.7-SNAPSHOT\maven-pmd-plugin-3.7-SNAPSHOT.jar
[INFO] Installing F:\hudson\hudson-slave\workspace\maven-plugins-ITs-m3-windows\maven-pmd-plugin\pom.xml
to F:\hudson\hudson-slave\workspace\maven-plugins-ITs-m3-windows\maven-dependency-plugin\target\local-repo\org\apache\maven\plugins\maven-pmd-plugin\3.7-SNAPSHOT\maven-pmd-plugin-3.7-SNAPSHOT.pom
[INFO] Installing F:\hudson\hudson-slave\workspace\maven-plugins-ITs-m3-windows\maven-invoker-plugin\pom.xml
to F:\hudson\hudson-slave\workspace\maven-plugins-ITs-m3-windows\maven-dependency-plugin\target\local-repo\org\apache\maven\plugins\maven-invoker-plugin\2.0.1-SNAPSHOT\maven-invoker-plugin-2.0.1-SNAPSHOT.pom
[INFO] Installing F:\hudson\hudson-slave\workspace\maven-plugins-ITs-m3-windows\maven-invoker-plugin\target\maven-invoker-plugin-2.0.1-SNAPSHOT.jar
to F:\hudson\hudson-slave\workspace\maven-plugins-ITs-m3-windows\maven-dependency-plugin\target\local-repo\org\apache\maven\plugins\maven-invoker-plugin\2.0.1-SNAPSHOT\maven-invoker-plugin-2.0.1-SNAPSHOT.jar
[INFO] Installing F:\hudson\hudson-slave\workspace\maven-plugins-ITs-m3-windows\maven-invoker-plugin\pom.xml
to F:\hudson\hudson-slave\workspace\maven-plugins-ITs-m3-windows\maven-dependency-plugin\target\local-repo\org\apache\maven\plugins\maven-invoker-plugin\2.0.1-SNAPSHOT\maven-invoker-plugin-2.0.1-SNAPSHOT.pom
[INFO] Installing F:\hudson\hudson-slave\workspace\maven-plugins-ITs-m3-windows\maven-jar-plugin\pom.xml
to F:\hudson\hudson-slave\workspace\maven-plugins-ITs-m3-windows\maven-dependency-plugin\target\local-repo\org\apache\maven\plugins\maven-jar-plugin\3.0.1-SNAPSHOT\maven-jar-plugin-3.0.1-SNAPSHOT.pom
[INFO] Installing F:\hudson\hudson-slave\workspace\maven-plugins-ITs-m3-windows\maven-jar-plugin\target\maven-jar-plugin-3.0.1-SNAPSHOT.jar
to F:\hudson\hudson-slave\workspace\maven-plugins-ITs-m3-windows\maven-dependency-plugin\target\local-repo\org\apache\maven\plugins\maven-jar-plugin\3.0.1-SNAPSHOT\maven-jar-plugin-3.0.1-SNAPSHOT.jar
[INFO] Installing F:\hudson\hudson-slave\workspace\maven-plugins-ITs-m3-windows\maven-jar-plugin\pom.xml
to F:\hudson\hudson-slave\workspace\maven-plugins-ITs-m3-windows\maven-dependency-plugin\target\local-repo\org\apache\maven\plugins\maven-jar-plugin\3.0.1-SNAPSHOT\maven-jar-plugin-3.0.1-SNAPSHOT.pom
[INFO] Installing F:\hudson\hudson-slave\workspace\maven-plugins-ITs-m3-windows\maven-checkstyle-plugin\pom.xml
to F:\hudson\hudson-slave\workspace\maven-plugins-ITs-m3-windows\maven-dependency-plugin\target\local-repo\org\apache\maven\plugins\maven-checkstyle-plugin\2.18-SNAPSHOT\maven-checkstyle-plugin-2.18-SNAPSHOT.pom
[INFO] Installing F:\hudson\hudson-slave\workspace\maven-plugins-ITs-m3-windows\maven-checkstyle-plugin\target\maven-checkstyle-plugin-2.18-SNAPSHOT.jar
to F:\hudson\hudson-slave\workspace\maven-plugins-ITs-m3-windows\maven-dependency-plugin\target\local-repo\org\apache\maven\plugins\maven-checkstyle-plugin\2.18-SNAPSHOT\maven-checkstyle-plugin-2.18-SNAPSHOT.jar
[INFO] Installing F:\hudson\hudson-slave\workspace\maven-plugins-ITs-m3-windows\maven-checkstyle-plugin\pom.xml
to F:\hudson\hudson-slave\workspace\maven-plugins-ITs-m3-windows\maven-dependency-plugin\target\local-repo\org\apache\maven\plugins\maven-checkstyle-plugin\2.18-SNAPSHOT\maven-checkstyle-plugin-2.18-SNAPSHOT.pom
[INFO] Installing F:\hudson\hudson-slave\workspace\maven-plugins-ITs-m3-windows\maven-project-info-reports-plugin\pom.xml
to F:\hudson\hudson-slave\workspace\maven-plugins-ITs-m3-windows\maven-dependency-plugin\target\local-repo\org\apache\maven\plugins\maven-project-info-reports-plugin\2.10-SNAPSHOT\maven-project-info-reports-plugin-2.10-SNAPSHOT.pom
[INFO] Installing F:\hudson\hudson-slave\workspace\maven-plugins-ITs-m3-windows\maven-project-info-reports-plugin\target\maven-project-info-reports-plugin-2.10-SNAPSHOT.jar
to F:\hudson\hudson-slave\workspace\maven-plugins-ITs-m3-windows\maven-dependency-plugin\target\local-repo\org\apache\maven\plugins\maven-project-info-reports-plugin\2.10-SNAPSHOT\maven-project-info-reports-plugin-2.10-SNAPSHOT.jar
[INFO] Installing F:\hudson\hudson-slave\workspace\maven-plugins-ITs-m3-windows\maven-remote-resources-plugin\pom.xml
to F:\hudson\hudson-slave\workspace\maven-plugins-ITs-m3-windows\maven-dependency-plugin\target\local-repo\org\apache\maven\plugins\maven-remote-resources-plugin\1.6-SNAPSHOT\maven-remote-resources-plugin-1.6-SNAPSHOT.pom
[INFO] Installing F:\hudson\hudson-slave\workspace\maven-plugins-ITs-m3-windows\maven-remote-resources-plugin\target\maven-remote-resources-plugin-1.6-SNAPSHOT.jar
to F:\hudson\hudson-slave\workspace\maven-plugins-ITs-m3-windows\maven-dependency-plugin\target\local-repo\org\apache\maven\plugins\maven-remote-resources-plugin\1.6-SNAPSHOT\maven-remote-resources-plugin-1.6-SNAPSHOT.jar
[INFO] Installing F:\hudson\hudson-slave\workspace\maven-plugins-ITs-m3-windows\maven-remote-resources-plugin\pom.xml
to F:\hudson\hudson-slave\workspace\maven-plugins-ITs-m3-windows\maven-dependency-plugin\target\local-repo\org\apache\maven\plugins\maven-remote-resources-plugin\1.6-SNAPSHOT\maven-remote-resources-plugin-1.6-SNAPSHOT.pom
[INFO] Installing F:\hudson\hudson-slave\workspace\maven-plugins-ITs-m3-windows\maven-shade-plugin\pom.xml
to F:\hudson\hudson-slave\workspace\maven-plugins-ITs-m3-windows\maven-dependency-plugin\target\local-repo\org\apache\maven\plugins\maven-shade-plugin\3.0.0-SNAPSHOT\maven-shade-plugin-3.0.0-SNAPSHOT.pom
[INFO] Installing F:\hudson\hudson-slave\workspace\maven-plugins-ITs-m3-windows\maven-shade-plugin\target\maven-shade-plugin-3.0.0-SNAPSHOT.jar
to F:\hudson\hudson-slave\workspace\maven-plugins-ITs-m3-windows\maven-dependency-plugin\target\local-repo\org\apache\maven\plugins\maven-shade-plugin\3.0.0-SNAPSHOT\maven-shade-plugin-3.0.0-SNAPSHOT.jar
[INFO] Installing F:\hudson\hudson-slave\workspace\maven-plugins-ITs-m3-windows\maven-shade-plugin\pom.xml
to F:\hudson\hudson-slave\workspace\maven-plugins-ITs-m3-windows\maven-dependency-plugin\target\local-repo\org\apache\maven\plugins\maven-shade-plugin\3.0.0-SNAPSHOT\maven-shade-plugin-3.0.0-SNAPSHOT.pom
[INFO] Installing F:\hudson\hudson-slave\workspace\maven-plugins-ITs-m3-windows\maven-shade-plugin\target\maven-shade-plugin-3.0.0-SNAPSHOT-tests.jar
to F:\hudson\hudson-slave\workspace\maven-plugins-ITs-m3-windows\maven-dependency-plugin\target\local-repo\org\apache\maven\plugins\maven-shade-plugin\3.0.0-SNAPSHOT\maven-shade-plugin-3.0.0-SNAPSHOT-tests.jar
[INFO] Installing F:\hudson\hudson-slave\workspace\maven-plugins-ITs-m3-windows\maven-scm-publish-plugin\pom.xml
to F:\hudson\hudson-slave\workspace\maven-plugins-ITs-m3-windows\maven-dependency-plugin\target\local-repo\org\apache\maven\plugins\maven-scm-publish-plugin\1.2-SNAPSHOT\maven-scm-publish-plugin-1.2-SNAPSHOT.pom
[INFO] Installing F:\hudson\hudson-slave\workspace\maven-plugins-ITs-m3-windows\maven-scm-publish-plugin\target\maven-scm-publish-plugin-1.2-SNAPSHOT.jar
to F:\hudson\hudson-slave\workspace\maven-plugins-ITs-m3-windows\maven-dependency-plugin\target\local-repo\org\apache\maven\plugins\maven-scm-publish-plugin\1.2-SNAPSHOT\maven-scm-publish-plugin-1.2-SNAPSHOT.jar
[INFO] Installing F:\hudson\hudson-slave\workspace\maven-plugins-ITs-m3-windows\maven-scm-publish-plugin\pom.xml
to F:\hudson\hudson-slave\workspace\maven-plugins-ITs-m3-windows\maven-dependency-plugin\target\local-repo\org\apache\maven\plugins\maven-scm-publish-plugin\1.2-SNAPSHOT\maven-scm-publish-plugin-1.2-SNAPSHOT.pom
[INFO] Installing F:\hudson\hudson-slave\workspace\maven-plugins-ITs-m3-windows\maven-assembly-plugin\pom.xml
to F:\hudson\hudson-slave\workspace\maven-plugins-ITs-m3-windows\maven-dependency-plugin\target\local-repo\org\apache\maven\plugins\maven-assembly-plugin\3.0-SNAPSHOT\maven-assembly-plugin-3.0-SNAPSHOT.pom
[INFO] Installing F:\hudson\hudson-slave\workspace\maven-plugins-ITs-m3-windows\maven-assembly-plugin\target\maven-assembly-plugin-3.0-SNAPSHOT.jar
to F:\hudson\hudson-slave\workspace\maven-plugins-ITs-m3-windows\maven-dependency-plugin\target\local-repo\org\apache\maven\plugins\maven-assembly-plugin\3.0-SNAPSHOT\maven-assembly-plugin-3.0-SNAPSHOT.jar
[INFO] Installing F:\hudson\hudson-slave\workspace\maven-plugins-ITs-m3-windows\maven-dependency-plugin\pom.xml
to F:\hudson\hudson-slave\workspace\maven-plugins-ITs-m3-windows\maven-dependency-plugin\target\local-repo\org\apache\maven\plugins\maven-dependency-plugin\3.0-SNAPSHOT\maven-dependency-plugin-3.0-SNAPSHOT.pom
[INFO] Installing F:\hudson\hudson-slave\workspace\maven-plugins-ITs-m3-windows\maven-dependency-plugin\target\maven-dependency-plugin-3.0-SNAPSHOT.jar
to F:\hudson\hudson-slave\workspace\maven-plugins-ITs-m3-windows\maven-dependency-plugin\target\local-repo\org\apache\maven\plugins\maven-dependency-plugin\3.0-SNAPSHOT\maven-dependency-plugin-3.0-SNAPSHOT.jar
[INFO] 
[INFO] --- mrm-maven-plugin:1.0-beta-2:start (default) @ maven-dependency-plugin ---
[INFO] Configuring Mock Repository Manager...
[INFO]   Mock content (source: F:\hudson\hudson-slave\workspace\maven-plugins-ITs-m3-windows\maven-dependency-plugin\src\it\mrm\repository)
[INFO]   Proxy (source: this Maven session)
[INFO] Starting Mock Repository Manager
[INFO] Logging to org.slf4j.impl.SimpleLogger(org.mortbay.log) via org.mortbay.log.Slf4jLog
[INFO] jetty-6.1.5
[INFO] Started SocketConnector@0.0.0.0:62661
[INFO] Mock Repository Manager http://localhost:62661 is started.
[INFO] Setting property 'repository.proxy.url' to 'http://localhost:62661'.
[INFO] 
[INFO] --- maven-invoker-plugin:2.0.0:integration-test (integration-test) @ maven-dependency-plugin
---
[INFO] Building: setup-custom-ear-lifecycle\pom.xml
[INFO] ..SUCCESS (12.8 s)
[INFO] Building: analyze\pom.xml
[INFO] run script verify.bsh
[INFO] ..SUCCESS (7.5 s)
[INFO] Building: analyze-dep-mgt\pom.xml
[INFO] ..SUCCESS (4.7 s)
[INFO] Building: analyze-ignore-dependency\pom.xml
[INFO] ..SUCCESS (6.1 s)
[INFO] Building: analyze-ignore-unused-declared-dependency\pom.xml
[INFO] ..SUCCESS (6.1 s)
[INFO] Building: analyze-ignore-used-undeclared-dependency\pom.xml
[INFO] ..SUCCESS (6.6 s)
[INFO] Building: analyze-multimodule-project\pom.xml
[INFO] ..SUCCESS (6.9 s)
[INFO] Building: analyze-report\pom.xml
[INFO] run script verify.bsh
[INFO] ..SUCCESS (7.0 s)
[INFO] Building: build-classpath\pom.xml
[INFO] run script verify.bsh
[INFO] ..SUCCESS (4.7 s)
[INFO] Building: copy\pom.xml
[INFO] run script verify.bsh
[INFO] ..SUCCESS (4.9 s)
[INFO] Building: copy-and-unpack-with-alternate-local-repo\pom.xml
[INFO] run script verify.bsh
[INFO] ..SUCCESS (8.0 s)
[INFO] Building: copy-cli\pom.xml
[INFO] run script verify.bsh
[INFO] ..SUCCESS (4.6 s)
[INFO] Building: copy-dependencies\pom.xml
[INFO] run script verify.bsh
[INFO] ..SUCCESS (6.0 s)
[INFO] Building: copy-from-reactor\pom.xml
[INFO] run script verify.bsh
[INFO] ..SUCCESS (6.3 s)
[INFO] Building: dependency-properties\pom.xml
[INFO] run script verify.bsh
[INFO] ..SUCCESS (4.8 s)
[INFO] Building: filterunpack\pom.xml
[INFO] run script verify.groovy
[INFO] ..SUCCESS (4.9 s)
[INFO] Building: go-offline\pom.xml
[INFO] ..SUCCESS (7.8 s)
[INFO] Building: list-repositories\pom.xml
[INFO] ..SUCCESS (4.8 s)
[INFO] Building: mdep-439-analyze-java8\pom.xml
[INFO] ..SKIPPED due to JRE version
[INFO] Building: mdep-450-project-with-ancestor\pom.xml
[INFO] run script verify.groovy
[INFO] ..SUCCESS (4.9 s)
[INFO] Building: mdep-450-project-without-ancestor\pom.xml
[INFO] run script verify.groovy
[INFO] ..SUCCESS (4.7 s)
[INFO] Building: mdep-506-dependency-without-version-in-depmgt\pom.xml
[INFO] ..SUCCESS (6.8 s)
[INFO] Building: purge-local-repository\pom.xml
[INFO] run script setup.bsh
[INFO] run script verify.bsh
[INFO] ..SUCCESS (6.1 s)
[INFO] Building: purge-local-repository-non-transitive\pom.xml
[INFO] run script verify.bsh
[INFO] ..SUCCESS (5.2 s)
[INFO] Building: purge-local-repository-reresolve\pom.xml
[INFO] run script verify.bsh
[INFO] ..SUCCESS (5.1 s)
[INFO] Building: purge-local-repository-snapshots-only\pom.xml
[INFO] run script setup.bsh
[INFO] run script verify.bsh
[INFO] ..SUCCESS (5.2 s)
[INFO] Building: purge-local-repository-version-range\pom.xml
[INFO] run script verify.bsh
[INFO] ..SUCCESS (5.7 s)
[INFO] Building: resolve\pom.xml
[INFO] ..SUCCESS (4.9 s)
[INFO] Building: resolve-plugins\pom.xml
[INFO] ..SUCCESS (6.6 s)
[INFO] Building: resolve-plugins-exclude-reactor\pom.xml
[INFO] run script verify.groovy
[INFO] ..SUCCESS (7.5 s)
[INFO] Building: resolve-plugins-with-exclude\pom.xml
[INFO] run script verify.groovy
[INFO] ..SUCCESS (6.5 s)
[INFO] Building: sources\pom.xml
[INFO] ..SUCCESS (5.6 s)
[INFO] Building: tree\pom.xml
[INFO] run script verify.bsh
[INFO] ..SUCCESS (4.9 s)
[INFO] Building: tree-includes\pom.xml
[INFO] run script verify.bsh
[INFO] ..SUCCESS (4.8 s)
[INFO] Building: unpack\pom.xml
[INFO] run script verify.bsh
[INFO] ..SUCCESS (6.3 s)
[INFO] Building: unpack-cli\pom.xml
[INFO] run script verify.bsh
[INFO] ..SUCCESS (5.1 s)
[INFO] Building: unpack-custom-ear\pom.xml
[INFO] run script verify.groovy
[INFO] ..SUCCESS (5.6 s)
[INFO] Building: unpack-dependencies\pom.xml
[INFO] run script verify.groovy
[INFO] ..SUCCESS (7.6 s)
[INFO] 
[INFO] --- mrm-maven-plugin:1.0-beta-2:stop (default) @ maven-dependency-plugin ---
[INFO] Stopping Mock Repository Manager on http://localhost:62661
[INFO] Mock Repository Manager http://localhost:62661 is stopped.
[INFO] 
[INFO] --- maven-invoker-plugin:2.0.0:verify (integration-test) @ maven-dependency-plugin
---
[INFO] -------------------------------------------------
[INFO] Build Summary:
[INFO]   Passed: 37, Failed: 0, Errors: 0, Skipped: 1
[INFO] -------------------------------------------------
[INFO] 
[INFO] --- maven-checkstyle-plugin:2.15:check (checkstyle-check) @ maven-dependency-plugin
---
[INFO] There is 1 error reported by Checkstyle 6.1.1 with config/maven_checks.xml ruleset.
[INFO] Ignored 1 error, 0 violation remaining.
[INFO] 
[INFO] --- maven-install-plugin:2.5.2:install (default-install) @ maven-dependency-plugin
---
[INFO] Installing F:\hudson\hudson-slave\workspace\maven-plugins-ITs-m3-windows\maven-dependency-plugin\target\maven-dependency-plugin-3.0-SNAPSHOT.jar
to C:\.m2\repository\org\apache\maven\plugins\maven-dependency-plugin\3.0-SNAPSHOT\maven-dependency-plugin-3.0-SNAPSHOT.jar
[INFO] Installing F:\hudson\hudson-slave\workspace\maven-plugins-ITs-m3-windows\maven-dependency-plugin\pom.xml
to C:\.m2\repository\org\apache\maven\plugins\maven-dependency-plugin\3.0-SNAPSHOT\maven-dependency-plugin-3.0-SNAPSHOT.pom
[INFO]                                                                         
[INFO] ------------------------------------------------------------------------
[INFO] Building Apache Maven Plugins Aggregator 1-SNAPSHOT
[INFO] ------------------------------------------------------------------------
[INFO] 
[INFO] --- maven-clean-plugin:2.5:clean (default-clean) @ maven-plugins-aggregator ---
[INFO] Deleting <https://builds.apache.org/job/maven-plugins-ITs-m3-windows/ws/target>
[INFO] 
[INFO] --- maven-enforcer-plugin:1.3.1:enforce (enforce-bytecode-version) @ maven-plugins-aggregator
---
[INFO] 
[INFO] --- maven-enforcer-plugin:1.3.1:enforce (ban-known-bad-maven-versions) @ maven-plugins-aggregator
---
[INFO] 
[INFO] --- maven-remote-resources-plugin:1.5:process (default) @ maven-plugins-aggregator
---
[INFO] 
[INFO] --- maven-site-plugin:3.3:attach-descriptor (attach-descriptor) @ maven-plugins-aggregator
---
[INFO] 
[INFO] --- maven-install-plugin:2.5.1:install (default-install) @ maven-plugins-aggregator
---
[INFO] Installing <https://builds.apache.org/job/maven-plugins-ITs-m3-windows/ws/pom.xml>
to C:\.m2\repository\org\apache\maven\plugins\maven-plugins-aggregator\1-SNAPSHOT\maven-plugins-aggregator-1-SNAPSHOT.pom
[INFO] ------------------------------------------------------------------------
[INFO] Reactor Summary:
[INFO] 
[INFO] Apache Maven ACR Plugin ............................ SUCCESS [ 38.380 s]
[INFO] Apache Maven Ant Plugin ............................ SUCCESS [02:04 min]
[INFO] Apache Maven AntRun Plugin ......................... SUCCESS [01:18 min]
[INFO] Apache Maven Changelog Plugin ...................... SUCCESS [01:13 min]
[INFO] Apache Maven Changes Plugin ........................ SUCCESS [01:26 min]
[INFO] Apache Maven Clean Plugin .......................... SUCCESS [ 32.391 s]
[INFO] Apache Maven Compiler Plugin ....................... SUCCESS [03:11 min]
[INFO] Apache Maven Deploy Plugin ......................... FAILURE [02:23 min]
[INFO] Apache Maven Documentation Checker Plugin .......... SUCCESS [  6.795 s]
[INFO] Apache Maven EAR Plugin ............................ SUCCESS [07:23 min]
[INFO] Apache Maven EJB Plugin ............................ SUCCESS [01:00 min]
[INFO] Apache Maven Help Plugin ........................... SUCCESS [01:08 min]
[INFO] Apache Maven Install Plugin ........................ SUCCESS [01:50 min]
[INFO] Apache Maven Jarsigner Plugin ...................... SUCCESS [01:06 min]
[INFO] Apache Maven Javadoc Plugin ........................ SUCCESS [06:00 min]
[INFO] Apache Maven Linkcheck Plugin ...................... SUCCESS [  5.171 s]
[INFO] Apache Maven Patch Plugin .......................... SUCCESS [  6.995 s]
[INFO] Apache Maven PDF Plugin ............................ SUCCESS [ 48.518 s]
[INFO] Apache Maven RAR Plugin ............................ SUCCESS [ 21.444 s]
[INFO] Apache Maven Repository Plugin ..................... SUCCESS [ 58.682 s]
[INFO] Apache Maven Resources Plugin ...................... SUCCESS [01:50 min]
[INFO] Apache Maven Site Plugin ........................... SUCCESS [10:25 min]
[INFO] Apache Maven Source Plugin ......................... SUCCESS [01:30 min]
[INFO] Apache Maven Stage Plugin .......................... SUCCESS [  4.349 s]
[INFO] Apache Maven Toolchains Plugin ..................... SUCCESS [ 30.948 s]
[INFO] Apache Maven Verifier Plugin ....................... SUCCESS [ 16.360 s]
[INFO] Apache Maven WAR Plugin ............................ SUCCESS [02:29 min]
[INFO] Apache Maven DOAP Plugin ........................... SUCCESS [ 27.641 s]
[INFO] Apache Maven PMD Plugin ............................ SUCCESS [03:21 min]
[INFO] Apache Maven Invoker Plugin ........................ SUCCESS [08:16 min]
[INFO] Apache Maven JAR Plugin ............................ SUCCESS [02:26 min]
[INFO] Apache Maven Checkstyle Plugin ..................... SUCCESS [06:14 min]
[INFO] Apache Maven Project Info Reports Plugin ........... FAILURE [07:14 min]
[INFO] Apache Maven Remote Resources Plugin ............... SUCCESS [01:37 min]
[INFO] Apache Maven Shade Plugin .......................... SUCCESS [05:15 min]
[INFO] Apache Maven SCM Publish Plugin .................... SUCCESS [01:38 min]
[INFO] Apache Maven Assembly Plugin ....................... FAILURE [15:55 min]
[INFO] Apache Maven Dependency Plugin ..................... SUCCESS [05:13 min]
[INFO] Apache Maven Plugins Aggregator .................... SUCCESS [  0.694 s]
[INFO] ------------------------------------------------------------------------
[INFO] BUILD FAILURE
[INFO] ------------------------------------------------------------------------
[INFO] Total time: 01:48 h
[INFO] Finished at: 2016-05-16T03:06:25+01:00
[INFO] Final Memory: 163M/593M
[INFO] ------------------------------------------------------------------------
[WARNING] The requested profile "apache.snapshots" could not be activated because it does
not exist.
[ERROR] Failed to execute goal org.apache.maven.plugins:maven-invoker-plugin:2.0.0:verify
(integration-test) on project maven-deploy-plugin: 1 build failed. See console output above
for details. -> [Help 1]
[ERROR] Failed to execute goal org.apache.maven.plugins:maven-invoker-plugin:2.0.0:verify
(integration-test) on project maven-project-info-reports-plugin: 1 build failed. See console
output above for details. -> [Help 1]
[ERROR] Failed to execute goal org.apache.maven.plugins:maven-invoker-plugin:2.0.0:verify
(integration-test) on project maven-assembly-plugin: 1 build failed. See console output above
for details. -> [Help 1]
[ERROR] 
[ERROR] To see the full stack trace of the errors, re-run Maven with the -e switch.
[ERROR] Re-run Maven using the -X switch to enable full debug logging.
[ERROR] 
[ERROR] For more information about the errors and possible solutions, please read the following
articles:
[ERROR] [Help 1] http://cwiki.apache.org/confluence/display/MAVEN/MojoFailureException
[ERROR] 
[ERROR] After correcting the problems, you can resume the build with the command
[ERROR]   mvn <goals> -rf :maven-deploy-plugin
Build step 'Invoke top-level Maven targets' marked build as failure
Deleting 1 temporary files
Recording test results

Mime
View raw message