maven-notifications mailing list archives

Site index · List index
Message view « Date » · « Thread »
Top « Date » · « Thread »
From Apache Jenkins Server <jenk...@builds.apache.org>
Subject Build failed in Jenkins: maven-plugins » Apache Maven DOAP Plugin #5966
Date Wed, 11 May 2016 08:25:39 GMT
See <https://builds.apache.org/job/maven-plugins/org.apache.maven.plugins$maven-doap-plugin/5966/>

------------------------------------------
[...truncated 83 lines...]
	at org.apache.maven.lifecycle.internal.MojoExecutor.execute(MojoExecutor.java:208)
	at org.apache.maven.lifecycle.internal.MojoExecutor.execute(MojoExecutor.java:153)
	at org.apache.maven.lifecycle.internal.MojoExecutor.execute(MojoExecutor.java:145)
	at org.apache.maven.lifecycle.internal.LifecycleModuleBuilder.buildProject(LifecycleModuleBuilder.java:84)
	at org.apache.maven.lifecycle.internal.LifecycleModuleBuilder.buildProject(LifecycleModuleBuilder.java:59)
	at org.apache.maven.lifecycle.internal.LifecycleStarter.singleThreadedBuild(LifecycleStarter.java:183)
	at org.apache.maven.lifecycle.internal.LifecycleStarter.execute(LifecycleStarter.java:161)
	at org.apache.maven.DefaultMaven.doExecute(DefaultMaven.java:317)
	at org.apache.maven.DefaultMaven.execute(DefaultMaven.java:152)
	at org.jvnet.hudson.maven3.launcher.Maven31Launcher.main(Maven31Launcher.java:132)
	at sun.reflect.NativeMethodAccessorImpl.invoke0(Native Method)
	at sun.reflect.NativeMethodAccessorImpl.invoke(NativeMethodAccessorImpl.java:57)
	at sun.reflect.DelegatingMethodAccessorImpl.invoke(DelegatingMethodAccessorImpl.java:43)
	at java.lang.reflect.Method.invoke(Method.java:606)
	at org.codehaus.plexus.classworlds.launcher.Launcher.launchStandard(Launcher.java:330)
	at org.codehaus.plexus.classworlds.launcher.Launcher.launch(Launcher.java:238)
	at jenkins.maven3.agent.Maven31Main.launch(Maven31Main.java:185)
	at sun.reflect.NativeMethodAccessorImpl.invoke0(Native Method)
	at sun.reflect.NativeMethodAccessorImpl.invoke(NativeMethodAccessorImpl.java:57)
	at sun.reflect.DelegatingMethodAccessorImpl.invoke(DelegatingMethodAccessorImpl.java:43)
	at java.lang.reflect.Method.invoke(Method.java:606)
	at hudson.maven.Maven3Builder.call(Maven3Builder.java:136)
	at hudson.maven.Maven3Builder.call(Maven3Builder.java:71)
	at hudson.remoting.UserRequest.perform(UserRequest.java:120)
	at hudson.remoting.UserRequest.perform(UserRequest.java:48)
	at hudson.remoting.Request$2.run(Request.java:326)
	at hudson.remoting.InterceptingExecutorService$1.call(InterceptingExecutorService.java:68)
	at java.util.concurrent.FutureTask.run(FutureTask.java:262)
	at java.util.concurrent.ThreadPoolExecutor.runWorker(ThreadPoolExecutor.java:1145)
	at java.util.concurrent.ThreadPoolExecutor$Worker.run(ThreadPoolExecutor.java:615)
	at java.lang.Thread.run(Thread.java:745)
Caused by: org.codehaus.modello.ModelloException: Exception while generating Java.
	at org.codehaus.modello.plugin.java.JavaModelloGenerator.generate(JavaModelloGenerator.java:86)
	at org.codehaus.modello.core.DefaultModelloCore.generate(DefaultModelloCore.java:376)
	at org.codehaus.modello.maven.AbstractModelloGeneratorMojo.doExecute(AbstractModelloGeneratorMojo.java:230)
	... 33 more
Caused by: java.io.FileNotFoundException: <https://builds.apache.org/job/maven-plugins/org.apache.maven.plugins$maven-doap-plugin/ws/target/generated-sources/modello/org/apache/maven/plugin/doap/options/DoapOptions.java>
(No such file or directory)
	at java.io.FileOutputStream.open(Native Method)
	at java.io.FileOutputStream.<init>(FileOutputStream.java:221)
	at java.io.FileOutputStream.<init>(FileOutputStream.java:171)
	at org.sonatype.plexus.build.incremental.DefaultBuildContext.newFileOutputStream(DefaultBuildContext.java:54)
	at org.codehaus.modello.plugin.java.AbstractJavaModelloGenerator.newJSourceWriter(AbstractJavaModelloGenerator.java:105)
	at org.codehaus.modello.plugin.java.JavaModelloGenerator.generateJava(JavaModelloGenerator.java:125)
	at org.codehaus.modello.plugin.java.JavaModelloGenerator.generate(JavaModelloGenerator.java:82)
	... 35 more
[INFO] Working on model: src/main/mdo/asfextOptions.mdo
[INFO] Generating current version: 1.0.0
[ERROR] <https://builds.apache.org/job/maven-plugins/org.apache.maven.plugins$maven-doap-plugin/ws/src/main/mdo/asfextOptions.mdo>
[1:1]: Error generating: Exception while generating Java.
org.apache.maven.plugin.MojoExecutionException: Error generating: Exception while generating
Java.
	at org.codehaus.modello.maven.AbstractModelloGeneratorMojo.doExecute(AbstractModelloGeneratorMojo.java:263)
	at org.codehaus.modello.maven.AbstractModelloGeneratorMojo.execute(AbstractModelloGeneratorMojo.java:190)
	at org.apache.maven.plugin.DefaultBuildPluginManager.executeMojo(DefaultBuildPluginManager.java:106)
	at org.apache.maven.lifecycle.internal.MojoExecutor.execute(MojoExecutor.java:208)
	at org.apache.maven.lifecycle.internal.MojoExecutor.execute(MojoExecutor.java:153)
	at org.apache.maven.lifecycle.internal.MojoExecutor.execute(MojoExecutor.java:145)
	at org.apache.maven.lifecycle.internal.LifecycleModuleBuilder.buildProject(LifecycleModuleBuilder.java:84)
	at org.apache.maven.lifecycle.internal.LifecycleModuleBuilder.buildProject(LifecycleModuleBuilder.java:59)
	at org.apache.maven.lifecycle.internal.LifecycleStarter.singleThreadedBuild(LifecycleStarter.java:183)
	at org.apache.maven.lifecycle.internal.LifecycleStarter.execute(LifecycleStarter.java:161)
	at org.apache.maven.DefaultMaven.doExecute(DefaultMaven.java:317)
	at org.apache.maven.DefaultMaven.execute(DefaultMaven.java:152)
	at org.jvnet.hudson.maven3.launcher.Maven31Launcher.main(Maven31Launcher.java:132)
	at sun.reflect.NativeMethodAccessorImpl.invoke0(Native Method)
	at sun.reflect.NativeMethodAccessorImpl.invoke(NativeMethodAccessorImpl.java:57)
	at sun.reflect.DelegatingMethodAccessorImpl.invoke(DelegatingMethodAccessorImpl.java:43)
	at java.lang.reflect.Method.invoke(Method.java:606)
	at org.codehaus.plexus.classworlds.launcher.Launcher.launchStandard(Launcher.java:330)
	at org.codehaus.plexus.classworlds.launcher.Launcher.launch(Launcher.java:238)
	at jenkins.maven3.agent.Maven31Main.launch(Maven31Main.java:185)
	at sun.reflect.NativeMethodAccessorImpl.invoke0(Native Method)
	at sun.reflect.NativeMethodAccessorImpl.invoke(NativeMethodAccessorImpl.java:57)
	at sun.reflect.DelegatingMethodAccessorImpl.invoke(DelegatingMethodAccessorImpl.java:43)
	at java.lang.reflect.Method.invoke(Method.java:606)
	at hudson.maven.Maven3Builder.call(Maven3Builder.java:136)
	at hudson.maven.Maven3Builder.call(Maven3Builder.java:71)
	at hudson.remoting.UserRequest.perform(UserRequest.java:120)
	at hudson.remoting.UserRequest.perform(UserRequest.java:48)
	at hudson.remoting.Request$2.run(Request.java:326)
	at hudson.remoting.InterceptingExecutorService$1.call(InterceptingExecutorService.java:68)
	at java.util.concurrent.FutureTask.run(FutureTask.java:262)
	at java.util.concurrent.ThreadPoolExecutor.runWorker(ThreadPoolExecutor.java:1145)
	at java.util.concurrent.ThreadPoolExecutor$Worker.run(ThreadPoolExecutor.java:615)
	at java.lang.Thread.run(Thread.java:745)
Caused by: org.codehaus.modello.ModelloException: Exception while generating Java.
	at org.codehaus.modello.plugin.java.JavaModelloGenerator.generate(JavaModelloGenerator.java:86)
	at org.codehaus.modello.core.DefaultModelloCore.generate(DefaultModelloCore.java:376)
	at org.codehaus.modello.maven.AbstractModelloGeneratorMojo.doExecute(AbstractModelloGeneratorMojo.java:230)
	... 33 more
Caused by: java.io.FileNotFoundException: <https://builds.apache.org/job/maven-plugins/org.apache.maven.plugins$maven-doap-plugin/ws/target/generated-sources/modello/org/apache/maven/plugin/doap/options/ASFExtOptions.java>
(No such file or directory)
	at java.io.FileOutputStream.open(Native Method)
	at java.io.FileOutputStream.<init>(FileOutputStream.java:221)
	at java.io.FileOutputStream.<init>(FileOutputStream.java:171)
	at org.sonatype.plexus.build.incremental.DefaultBuildContext.newFileOutputStream(DefaultBuildContext.java:54)
	at org.codehaus.modello.plugin.java.AbstractJavaModelloGenerator.newJSourceWriter(AbstractJavaModelloGenerator.java:105)
	at org.codehaus.modello.plugin.java.JavaModelloGenerator.generateJava(JavaModelloGenerator.java:125)
	at org.codehaus.modello.plugin.java.JavaModelloGenerator.generate(JavaModelloGenerator.java:82)
	... 35 more
[ERROR] 
org.apache.maven.plugin.MojoExecutionException: Error generating: Exception while generating
Java.
	at org.codehaus.modello.maven.AbstractModelloGeneratorMojo.doExecute(AbstractModelloGeneratorMojo.java:263)
	at org.codehaus.modello.maven.AbstractModelloGeneratorMojo.execute(AbstractModelloGeneratorMojo.java:190)
	at org.apache.maven.plugin.DefaultBuildPluginManager.executeMojo(DefaultBuildPluginManager.java:106)
	at org.apache.maven.lifecycle.internal.MojoExecutor.execute(MojoExecutor.java:208)
	at org.apache.maven.lifecycle.internal.MojoExecutor.execute(MojoExecutor.java:153)
	at org.apache.maven.lifecycle.internal.MojoExecutor.execute(MojoExecutor.java:145)
	at org.apache.maven.lifecycle.internal.LifecycleModuleBuilder.buildProject(LifecycleModuleBuilder.java:84)
	at org.apache.maven.lifecycle.internal.LifecycleModuleBuilder.buildProject(LifecycleModuleBuilder.java:59)
	at org.apache.maven.lifecycle.internal.LifecycleStarter.singleThreadedBuild(LifecycleStarter.java:183)
	at org.apache.maven.lifecycle.internal.LifecycleStarter.execute(LifecycleStarter.java:161)
	at org.apache.maven.DefaultMaven.doExecute(DefaultMaven.java:317)
	at org.apache.maven.DefaultMaven.execute(DefaultMaven.java:152)
	at org.jvnet.hudson.maven3.launcher.Maven31Launcher.main(Maven31Launcher.java:132)
	at sun.reflect.NativeMethodAccessorImpl.invoke0(Native Method)
	at sun.reflect.NativeMethodAccessorImpl.invoke(NativeMethodAccessorImpl.java:57)
	at sun.reflect.DelegatingMethodAccessorImpl.invoke(DelegatingMethodAccessorImpl.java:43)
	at java.lang.reflect.Method.invoke(Method.java:606)
	at org.codehaus.plexus.classworlds.launcher.Launcher.launchStandard(Launcher.java:330)
	at org.codehaus.plexus.classworlds.launcher.Launcher.launch(Launcher.java:238)
	at jenkins.maven3.agent.Maven31Main.launch(Maven31Main.java:185)
	at sun.reflect.NativeMethodAccessorImpl.invoke0(Native Method)
	at sun.reflect.NativeMethodAccessorImpl.invoke(NativeMethodAccessorImpl.java:57)
	at sun.reflect.DelegatingMethodAccessorImpl.invoke(DelegatingMethodAccessorImpl.java:43)
	at java.lang.reflect.Method.invoke(Method.java:606)
	at hudson.maven.Maven3Builder.call(Maven3Builder.java:136)
	at hudson.maven.Maven3Builder.call(Maven3Builder.java:71)
	at hudson.remoting.UserRequest.perform(UserRequest.java:120)
	at hudson.remoting.UserRequest.perform(UserRequest.java:48)
	at hudson.remoting.Request$2.run(Request.java:326)
	at hudson.remoting.InterceptingExecutorService$1.call(InterceptingExecutorService.java:68)
	at java.util.concurrent.FutureTask.run(FutureTask.java:262)
	at java.util.concurrent.ThreadPoolExecutor.runWorker(ThreadPoolExecutor.java:1145)
	at java.util.concurrent.ThreadPoolExecutor$Worker.run(ThreadPoolExecutor.java:615)
	at java.lang.Thread.run(Thread.java:745)
Caused by: org.codehaus.modello.ModelloException: Exception while generating Java.
	at org.codehaus.modello.plugin.java.JavaModelloGenerator.generate(JavaModelloGenerator.java:86)
	at org.codehaus.modello.core.DefaultModelloCore.generate(DefaultModelloCore.java:376)
	at org.codehaus.modello.maven.AbstractModelloGeneratorMojo.doExecute(AbstractModelloGeneratorMojo.java:230)
	... 33 more
Caused by: java.io.FileNotFoundException: <https://builds.apache.org/job/maven-plugins/org.apache.maven.plugins$maven-doap-plugin/ws/target/generated-sources/modello/org/apache/maven/plugin/doap/options/ASFExtOptions.java>
(No such file or directory)
	at java.io.FileOutputStream.open(Native Method)
	at java.io.FileOutputStream.<init>(FileOutputStream.java:221)
	at java.io.FileOutputStream.<init>(FileOutputStream.java:171)
	at org.sonatype.plexus.build.incremental.DefaultBuildContext.newFileOutputStream(DefaultBuildContext.java:54)
	at org.codehaus.modello.plugin.java.AbstractJavaModelloGenerator.newJSourceWriter(AbstractJavaModelloGenerator.java:105)
	at org.codehaus.modello.plugin.java.JavaModelloGenerator.generateJava(JavaModelloGenerator.java:125)
	at org.codehaus.modello.plugin.java.JavaModelloGenerator.generate(JavaModelloGenerator.java:82)
	... 35 more
[INFO] Working on model: src/main/mdo/extOptions.mdo
[INFO] Generating current version: 1.0.0
[ERROR] <https://builds.apache.org/job/maven-plugins/org.apache.maven.plugins$maven-doap-plugin/ws/src/main/mdo/extOptions.mdo>
[1:1]: Error generating: Exception while generating Java.
org.apache.maven.plugin.MojoExecutionException: Error generating: Exception while generating
Java.
	at org.codehaus.modello.maven.AbstractModelloGeneratorMojo.doExecute(AbstractModelloGeneratorMojo.java:263)
	at org.codehaus.modello.maven.AbstractModelloGeneratorMojo.execute(AbstractModelloGeneratorMojo.java:190)
	at org.apache.maven.plugin.DefaultBuildPluginManager.executeMojo(DefaultBuildPluginManager.java:106)
	at org.apache.maven.lifecycle.internal.MojoExecutor.execute(MojoExecutor.java:208)
	at org.apache.maven.lifecycle.internal.MojoExecutor.execute(MojoExecutor.java:153)
	at org.apache.maven.lifecycle.internal.MojoExecutor.execute(MojoExecutor.java:145)
	at org.apache.maven.lifecycle.internal.LifecycleModuleBuilder.buildProject(LifecycleModuleBuilder.java:84)
	at org.apache.maven.lifecycle.internal.LifecycleModuleBuilder.buildProject(LifecycleModuleBuilder.java:59)
	at org.apache.maven.lifecycle.internal.LifecycleStarter.singleThreadedBuild(LifecycleStarter.java:183)
	at org.apache.maven.lifecycle.internal.LifecycleStarter.execute(LifecycleStarter.java:161)
	at org.apache.maven.DefaultMaven.doExecute(DefaultMaven.java:317)
	at org.apache.maven.DefaultMaven.execute(DefaultMaven.java:152)
	at org.jvnet.hudson.maven3.launcher.Maven31Launcher.main(Maven31Launcher.java:132)
	at sun.reflect.NativeMethodAccessorImpl.invoke0(Native Method)
	at sun.reflect.NativeMethodAccessorImpl.invoke(NativeMethodAccessorImpl.java:57)
	at sun.reflect.DelegatingMethodAccessorImpl.invoke(DelegatingMethodAccessorImpl.java:43)
	at java.lang.reflect.Method.invoke(Method.java:606)
	at org.codehaus.plexus.classworlds.launcher.Launcher.launchStandard(Launcher.java:330)
	at org.codehaus.plexus.classworlds.launcher.Launcher.launch(Launcher.java:238)
	at jenkins.maven3.agent.Maven31Main.launch(Maven31Main.java:185)
	at sun.reflect.NativeMethodAccessorImpl.invoke0(Native Method)
	at sun.reflect.NativeMethodAccessorImpl.invoke(NativeMethodAccessorImpl.java:57)
	at sun.reflect.DelegatingMethodAccessorImpl.invoke(DelegatingMethodAccessorImpl.java:43)
	at java.lang.reflect.Method.invoke(Method.java:606)
	at hudson.maven.Maven3Builder.call(Maven3Builder.java:136)
	at hudson.maven.Maven3Builder.call(Maven3Builder.java:71)
	at hudson.remoting.UserRequest.perform(UserRequest.java:120)
	at hudson.remoting.UserRequest.perform(UserRequest.java:48)
	at hudson.remoting.Request$2.run(Request.java:326)
	at hudson.remoting.InterceptingExecutorService$1.call(InterceptingExecutorService.java:68)
	at java.util.concurrent.FutureTask.run(FutureTask.java:262)
	at java.util.concurrent.ThreadPoolExecutor.runWorker(ThreadPoolExecutor.java:1145)
	at java.util.concurrent.ThreadPoolExecutor$Worker.run(ThreadPoolExecutor.java:615)
	at java.lang.Thread.run(Thread.java:745)
Caused by: org.codehaus.modello.ModelloException: Exception while generating Java.
	at org.codehaus.modello.plugin.java.JavaModelloGenerator.generate(JavaModelloGenerator.java:86)
	at org.codehaus.modello.core.DefaultModelloCore.generate(DefaultModelloCore.java:376)
	at org.codehaus.modello.maven.AbstractModelloGeneratorMojo.doExecute(AbstractModelloGeneratorMojo.java:230)
	... 33 more
Caused by: java.io.FileNotFoundException: <https://builds.apache.org/job/maven-plugins/org.apache.maven.plugins$maven-doap-plugin/ws/target/generated-sources/modello/org/apache/maven/plugin/doap/options/ExtOptions.java>
(No such file or directory)
	at java.io.FileOutputStream.open(Native Method)
	at java.io.FileOutputStream.<init>(FileOutputStream.java:221)
	at java.io.FileOutputStream.<init>(FileOutputStream.java:171)
	at org.sonatype.plexus.build.incremental.DefaultBuildContext.newFileOutputStream(DefaultBuildContext.java:54)
	at org.codehaus.modello.plugin.java.AbstractJavaModelloGenerator.newJSourceWriter(AbstractJavaModelloGenerator.java:105)
	at org.codehaus.modello.plugin.java.JavaModelloGenerator.generateJava(JavaModelloGenerator.java:125)
	at org.codehaus.modello.plugin.java.JavaModelloGenerator.generate(JavaModelloGenerator.java:82)
	... 35 more
[ERROR] 
org.apache.maven.plugin.MojoExecutionException: Error generating: Exception while generating
Java.
	at org.codehaus.modello.maven.AbstractModelloGeneratorMojo.doExecute(AbstractModelloGeneratorMojo.java:263)
	at org.codehaus.modello.maven.AbstractModelloGeneratorMojo.execute(AbstractModelloGeneratorMojo.java:190)
	at org.apache.maven.plugin.DefaultBuildPluginManager.executeMojo(DefaultBuildPluginManager.java:106)
	at org.apache.maven.lifecycle.internal.MojoExecutor.execute(MojoExecutor.java:208)
	at org.apache.maven.lifecycle.internal.MojoExecutor.execute(MojoExecutor.java:153)
	at org.apache.maven.lifecycle.internal.MojoExecutor.execute(MojoExecutor.java:145)
	at org.apache.maven.lifecycle.internal.LifecycleModuleBuilder.buildProject(LifecycleModuleBuilder.java:84)
	at org.apache.maven.lifecycle.internal.LifecycleModuleBuilder.buildProject(LifecycleModuleBuilder.java:59)
	at org.apache.maven.lifecycle.internal.LifecycleStarter.singleThreadedBuild(LifecycleStarter.java:183)
	at org.apache.maven.lifecycle.internal.LifecycleStarter.execute(LifecycleStarter.java:161)
	at org.apache.maven.DefaultMaven.doExecute(DefaultMaven.java:317)
	at org.apache.maven.DefaultMaven.execute(DefaultMaven.java:152)
	at org.jvnet.hudson.maven3.launcher.Maven31Launcher.main(Maven31Launcher.java:132)
	at sun.reflect.NativeMethodAccessorImpl.invoke0(Native Method)
	at sun.reflect.NativeMethodAccessorImpl.invoke(NativeMethodAccessorImpl.java:57)
	at sun.reflect.DelegatingMethodAccessorImpl.invoke(DelegatingMethodAccessorImpl.java:43)
	at java.lang.reflect.Method.invoke(Method.java:606)
	at org.codehaus.plexus.classworlds.launcher.Launcher.launchStandard(Launcher.java:330)
	at org.codehaus.plexus.classworlds.launcher.Launcher.launch(Launcher.java:238)
	at jenkins.maven3.agent.Maven31Main.launch(Maven31Main.java:185)
	at sun.reflect.NativeMethodAccessorImpl.invoke0(Native Method)
	at sun.reflect.NativeMethodAccessorImpl.invoke(NativeMethodAccessorImpl.java:57)
	at sun.reflect.DelegatingMethodAccessorImpl.invoke(DelegatingMethodAccessorImpl.java:43)
	at java.lang.reflect.Method.invoke(Method.java:606)
	at hudson.maven.Maven3Builder.call(Maven3Builder.java:136)
	at hudson.maven.Maven3Builder.call(Maven3Builder.java:71)
	at hudson.remoting.UserRequest.perform(UserRequest.java:120)
	at hudson.remoting.UserRequest.perform(UserRequest.java:48)
	at hudson.remoting.Request$2.run(Request.java:326)
	at hudson.remoting.InterceptingExecutorService$1.call(InterceptingExecutorService.java:68)
	at java.util.concurrent.FutureTask.run(FutureTask.java:262)
	at java.util.concurrent.ThreadPoolExecutor.runWorker(ThreadPoolExecutor.java:1145)
	at java.util.concurrent.ThreadPoolExecutor$Worker.run(ThreadPoolExecutor.java:615)
	at java.lang.Thread.run(Thread.java:745)
Caused by: org.codehaus.modello.ModelloException: Exception while generating Java.
	at org.codehaus.modello.plugin.java.JavaModelloGenerator.generate(JavaModelloGenerator.java:86)
	at org.codehaus.modello.core.DefaultModelloCore.generate(DefaultModelloCore.java:376)
	at org.codehaus.modello.maven.AbstractModelloGeneratorMojo.doExecute(AbstractModelloGeneratorMojo.java:230)
	... 33 more
Caused by: java.io.FileNotFoundException: <https://builds.apache.org/job/maven-plugins/org.apache.maven.plugins$maven-doap-plugin/ws/target/generated-sources/modello/org/apache/maven/plugin/doap/options/ExtOptions.java>
(No such file or directory)
	at java.io.FileOutputStream.open(Native Method)
	at java.io.FileOutputStream.<init>(FileOutputStream.java:221)
	at java.io.FileOutputStream.<init>(FileOutputStream.java:171)
	at org.sonatype.plexus.build.incremental.DefaultBuildContext.newFileOutputStream(DefaultBuildContext.java:54)
	at org.codehaus.modello.plugin.java.AbstractJavaModelloGenerator.newJSourceWriter(AbstractJavaModelloGenerator.java:105)
	at org.codehaus.modello.plugin.java.JavaModelloGenerator.generateJava(JavaModelloGenerator.java:125)
	at org.codehaus.modello.plugin.java.JavaModelloGenerator.generate(JavaModelloGenerator.java:82)
	... 35 more

Mime
View raw message