maven-notifications mailing list archives

Site index · List index
Message view « Date » · « Thread »
Top « Date » · « Thread »
From Apache Jenkins Server <jenk...@builds.apache.org>
Subject Build failed in Jenkins: maven-plugins-ITs-m3 #2371
Date Thu, 05 May 2016 22:09:49 GMT
See <https://builds.apache.org/job/maven-plugins-ITs-m3/2371/changes>

Changes:

[khmarbaise] [MRESOURCES-99] ${project.baseUri} and ${maven.build.timestamp} are not expanded
by resource filtering
 o Support maven.build.timestamp and project.baseUri
   which can be used during filtering of resources
   as in model.
   o Added MavenBuildTimestamp which is duplicated from
     maven-model-builder.
   o Those properties have been added as supplemental
     properties which solves the issue.

------------------------------------------
[...truncated 3507 lines...]
[INFO] Some input files use or override a deprecated API.
[INFO] Recompile with -Xlint:deprecation for details.
[INFO] <https://builds.apache.org/job/maven-plugins-ITs-m3/ws/maven-dependency-plugin/src/test/java/org/apache/maven/plugins/dependency/testUtils/stubs/DependencyProjectStub.java>
uses unchecked or unsafe operations.
[INFO] Recompile with -Xlint:unchecked for details.
[INFO] 
[INFO] --- maven-surefire-plugin:2.18.1:test (default-test) @ maven-dependency-plugin ---
[INFO] Surefire report directory: <https://builds.apache.org/job/maven-plugins-ITs-m3/ws/maven-dependency-plugin/target/surefire-reports>

-------------------------------------------------------
 T E S T S
-------------------------------------------------------
Error occurred during initialization of VM
java.lang.OutOfMemoryError: unable to create new native thread
	at java.lang.Thread.start0(Native Method)
	at java.lang.Thread.start(Thread.java:640)
	at java.lang.ref.Finalizer.<clinit>(Finalizer.java:188)

Results :

Tests run: 0, Failures: 0, Errors: 0, Skipped: 0

[INFO]                                                                         
[INFO] ------------------------------------------------------------------------
[INFO] Building Apache Maven GPG Plugin 1.7-SNAPSHOT
[INFO] ------------------------------------------------------------------------
[INFO] 
[INFO] --- maven-clean-plugin:2.5:clean (default-clean) @ maven-gpg-plugin ---
[INFO] 
[INFO] --- maven-enforcer-plugin:1.3.1:enforce (enforce-bytecode-version) @ maven-gpg-plugin
---
[INFO] 
[INFO] --- maven-enforcer-plugin:1.3.1:enforce (ban-known-bad-maven-versions) @ maven-gpg-plugin
---
[INFO] 
[INFO] --- maven-enforcer-plugin:1.3.1:enforce (ensure-no-container-api) @ maven-gpg-plugin
---
[INFO] 
[INFO] --- apache-rat-plugin:0.11:check (rat-check) @ maven-gpg-plugin ---
[INFO] 51 implicit excludes (use -debug for more details).
[INFO] Exclude: src/test/resources/gnupg/*
[INFO] Exclude: DEPENDENCIES
[INFO] 66 resources included (use -debug for more details)
[INFO] Rat check: Summary of files. Unapproved: 0 unknown: 0 generated: 0 approved: 54 licence.
[INFO] 
[INFO] --- maven-plugin-plugin:3.4:helpmojo (generate-helpmojo) @ maven-gpg-plugin ---
[INFO] Using 'UTF-8' encoding to read mojo metadata.
[INFO] Mojo extractor with id: java-annotations found 0 mojo descriptors.
[INFO] Mojo extractor with id: java-javadoc found 0 mojo descriptors.
[INFO] 
[INFO] --- maven-remote-resources-plugin:1.5:process (default) @ maven-gpg-plugin ---
[INFO] 
[INFO] --- maven-resources-plugin:2.7:resources (default-resources) @ maven-gpg-plugin ---
[INFO] Using 'UTF-8' encoding to copy filtered resources.
[INFO] Copying 1 resource
[INFO] Copying 3 resources
[INFO] 
[INFO] --- maven-compiler-plugin:3.2:compile (default-compile) @ maven-gpg-plugin ---
[INFO] Changes detected - recompiling the module!
[INFO] Compiling 9 source files to <https://builds.apache.org/job/maven-plugins-ITs-m3/ws/maven-gpg-plugin/target/classes>
[INFO] Some input files use unchecked or unsafe operations.
[INFO] Recompile with -Xlint:unchecked for details.
[INFO] 
[INFO] --- maven-plugin-plugin:3.4:descriptor (default-descriptor) @ maven-gpg-plugin ---
[INFO] Using 'UTF-8' encoding to read mojo metadata.
[INFO] Mojo extractor with id: java-annotations found 3 mojo descriptors.
[INFO] Mojo extractor with id: java-javadoc found 0 mojo descriptors.
[INFO] 
[INFO] --- maven-resources-plugin:2.7:testResources (default-testResources) @ maven-gpg-plugin
---
[INFO] Using 'UTF-8' encoding to copy filtered resources.
[INFO] Copying 8 resources
[INFO] Copying 3 resources
[INFO] 
[INFO] --- maven-compiler-plugin:3.2:testCompile (default-testCompile) @ maven-gpg-plugin
---
[INFO] No sources to compile
[INFO] 
[INFO] --- maven-surefire-plugin:2.18.1:test (default-test) @ maven-gpg-plugin ---
[INFO] 
[INFO] --- maven-jar-plugin:2.5:jar (default-jar) @ maven-gpg-plugin ---
[INFO] Building jar: <https://builds.apache.org/job/maven-plugins-ITs-m3/ws/maven-gpg-plugin/target/maven-gpg-plugin-1.7-SNAPSHOT.jar>
[INFO] 
[INFO] --- maven-plugin-plugin:3.4:addPluginArtifactMetadata (default-addPluginArtifactMetadata)
@ maven-gpg-plugin ---
[INFO] 
[INFO] --- maven-invoker-plugin:2.0.0:install (integration-test) @ maven-gpg-plugin ---
[INFO] Installing <https://builds.apache.org/job/maven-plugins-ITs-m3/ws/maven-acr-plugin/pom.xml>
to <https://builds.apache.org/job/maven-plugins-ITs-m3/ws/maven-gpg-plugin/target/local-repo/org/apache/maven/plugins/maven-acr-plugin/3.0.1-SNAPSHOT/maven-acr-plugin-3.0.1-SNAPSHOT.pom>
[INFO] Installing <https://builds.apache.org/job/maven-plugins-ITs-m3/ws/maven-acr-plugin/target/maven-acr-plugin-3.0.1-SNAPSHOT.jar>
to <https://builds.apache.org/job/maven-plugins-ITs-m3/ws/maven-gpg-plugin/target/local-repo/org/apache/maven/plugins/maven-acr-plugin/3.0.1-SNAPSHOT/maven-acr-plugin-3.0.1-SNAPSHOT.jar>
[INFO] Installing <https://builds.apache.org/job/maven-plugins-ITs-m3/ws/maven-ant-plugin/pom.xml>
to <https://builds.apache.org/job/maven-plugins-ITs-m3/ws/maven-gpg-plugin/target/local-repo/org/apache/maven/plugins/maven-ant-plugin/2.5-SNAPSHOT/maven-ant-plugin-2.5-SNAPSHOT.pom>
[INFO]                                                                         
[INFO] ------------------------------------------------------------------------
[INFO] Building Apache Maven Plugins Aggregator 1-SNAPSHOT
[INFO] ------------------------------------------------------------------------
[INFO] 
[INFO] --- maven-clean-plugin:2.5:clean (default-clean) @ maven-plugins-aggregator ---
[INFO] 
[INFO] --- maven-enforcer-plugin:1.3.1:enforce (enforce-bytecode-version) @ maven-plugins-aggregator
---
[INFO] 
[INFO] --- maven-enforcer-plugin:1.3.1:enforce (ban-known-bad-maven-versions) @ maven-plugins-aggregator
---
[INFO] 
[INFO] --- maven-remote-resources-plugin:1.5:process (default) @ maven-plugins-aggregator
---
[INFO] 
[INFO] --- maven-site-plugin:3.3:attach-descriptor (attach-descriptor) @ maven-plugins-aggregator
---
[INFO] 
[INFO] --- maven-install-plugin:2.5.1:install (default-install) @ maven-plugins-aggregator
---
[INFO] Installing <https://builds.apache.org/job/maven-plugins-ITs-m3/ws/pom.xml> to
/home/jenkins/.m2/repository/org/apache/maven/plugins/maven-plugins-aggregator/1-SNAPSHOT/maven-plugins-aggregator-1-SNAPSHOT.pom
[INFO] ------------------------------------------------------------------------
[INFO] Reactor Summary:
[INFO] 
[INFO] Apache Maven ACR Plugin ........................... FAILURE [01:07 min]
[INFO] Apache Maven Ant Plugin ........................... FAILURE [ 11.496 s]
[INFO] Apache Maven AntRun Plugin ........................ FAILURE [  4.268 s]
[INFO] Apache Maven Changelog Plugin ..................... FAILURE [  9.556 s]
[INFO] Apache Maven Changes Plugin ....................... FAILURE [ 21.356 s]
[INFO] Apache Maven Clean Plugin ......................... FAILURE [  3.188 s]
[INFO] Apache Maven Compiler Plugin ...................... FAILURE [ 19.334 s]
[INFO] Apache Maven Deploy Plugin ........................ FAILURE [  5.089 s]
[INFO] Apache Maven Documentation Checker Plugin ......... FAILURE [  3.630 s]
[INFO] Apache Maven EAR Plugin ........................... FAILURE [  6.487 s]
[INFO] Apache Maven EJB Plugin ........................... FAILURE [  3.865 s]
[INFO] Apache Maven Help Plugin .......................... FAILURE [  5.822 s]
[INFO] Apache Maven Install Plugin ....................... FAILURE [  3.866 s]
[INFO] Apache Maven Jarsigner Plugin ..................... FAILURE [  3.497 s]
[INFO] Apache Maven Javadoc Plugin ....................... FAILURE [ 21.080 s]
[INFO] Apache Maven Linkcheck Plugin ..................... FAILURE [  6.969 s]
[INFO] Apache Maven Patch Plugin ......................... FAILURE [  1.133 s]
[INFO] Apache Maven PDF Plugin ........................... FAILURE [ 11.584 s]
[INFO] Apache Maven RAR Plugin ........................... FAILURE [  3.417 s]
[INFO] Apache Maven Repository Plugin .................... FAILURE [  3.498 s]
[INFO] Apache Maven Resources Plugin ..................... FAILURE [ 18.081 s]
[INFO] Apache Maven Site Plugin .......................... FAILURE [ 19.544 s]
[INFO] Apache Maven Source Plugin ........................ FAILURE [  3.460 s]
[INFO] Apache Maven Stage Plugin ......................... FAILURE [  3.964 s]
[INFO] Apache Maven Toolchains Plugin .................... FAILURE [  3.242 s]
[INFO] Apache Maven Verifier Plugin ...................... FAILURE [  1.465 s]
[INFO] Apache Maven WAR Plugin ........................... FAILURE [  6.038 s]
[INFO] Apache Maven DOAP Plugin .......................... FAILURE [ 11.218 s]
[INFO] Apache Maven PMD Plugin ........................... FAILURE [ 16.126 s]
[INFO] Apache Maven Invoker Plugin ....................... FAILURE [ 13.505 s]
[INFO] Apache Maven JAR Plugin ........................... FAILURE [  3.431 s]
[INFO] Apache Maven Project Info Reports Plugin .......... FAILURE [  5.161 s]
[INFO] Apache Maven Remote Resources Plugin .............. FAILURE [  4.195 s]
[INFO] Apache Maven Shade Plugin ......................... FAILURE [  5.602 s]
[INFO] Apache Maven SCM Publish Plugin ................... FAILURE [  8.071 s]
[INFO] Apache Maven Assembly Plugin ...................... FAILURE [ 21.573 s]
[INFO] Apache Maven Dependency Plugin .................... FAILURE [  8.255 s]
[INFO] Apache Maven GPG Plugin ........................... FAILURE [  1.934 s]
[INFO] Apache Maven Plugins Aggregator ................... SUCCESS [  1.563 s]
[INFO] ------------------------------------------------------------------------
[INFO] BUILD FAILURE
[INFO] ------------------------------------------------------------------------
[INFO] Total time: 06:15 min
[INFO] Finished at: 2016-05-05T22:09:53+00:00
[INFO] Final Memory: 81M/353M
[INFO] ------------------------------------------------------------------------
[WARNING] The requested profile "apache.snapshots" could not be activated because it does
not exist.
[ERROR] Failed to execute goal org.apache.maven.plugins:maven-invoker-plugin:2.0.0:verify
(integration-test) on project maven-acr-plugin: 2 builds failed. See console output above
for details. -> [Help 1]
[ERROR] Failed to execute goal org.apache.maven.plugins:maven-surefire-plugin:2.18.1:test
(default-test) on project maven-ant-plugin: Execution default-test of goal org.apache.maven.plugins:maven-surefire-plugin:2.18.1:test
failed: The forked VM terminated without properly saying goodbye. VM crash or System.exit
called?
[ERROR] Command was /bin/sh -c cd <https://builds.apache.org/job/maven-plugins-ITs-m3/ws/maven-ant-plugin>
&& /home/jenkins/tools/java/jdk1.6.0_45-32/jre/bin/java -jar <https://builds.apache.org/job/maven-plugins-ITs-m3/ws/maven-ant-plugin/target/surefire/surefirebooter3812330285794756244.jar>
<https://builds.apache.org/job/maven-plugins-ITs-m3/ws/maven-ant-plugin/target/surefire/surefire2924095041555885211tmp>
<https://builds.apache.org/job/maven-plugins-ITs-m3/ws/maven-ant-plugin/target/surefire/surefire_0738775704364135898tmp>
[ERROR] -> [Help 2]
[ERROR] Failed to execute goal org.apache.maven.plugins:maven-invoker-plugin:2.0.0:install
(integration-test) on project maven-antrun-plugin: Failed to install project dependencies:
MavenProject: org.apache.maven.plugins:maven-antrun-plugin:1.9-SNAPSHOT @ <https://builds.apache.org/job/maven-plugins-ITs-m3/ws/maven-antrun-plugin/pom.xml>:
Failed to install project artifacts: MavenProject: org.apache.maven.plugins:maven-ant-plugin:2.5-SNAPSHOT
@ <https://builds.apache.org/job/maven-plugins-ITs-m3/ws/maven-ant-plugin/pom.xml>:
Failed to install artifact: org.apache.maven.plugins:maven-ant-plugin:maven-plugin:2.5-SNAPSHOT:
Artifact is not fully assembled: <https://builds.apache.org/job/maven-plugins-ITs-m3/ws/maven-ant-plugin/target/classes>
-> [Help 3]
[ERROR] Failed to execute goal org.apache.maven.plugins:maven-surefire-plugin:2.18.1:test
(default-test) on project maven-changelog-plugin: Execution default-test of goal org.apache.maven.plugins:maven-surefire-plugin:2.18.1:test
failed: The forked VM terminated without properly saying goodbye. VM crash or System.exit
called?
[ERROR] Command was /bin/sh -c cd <https://builds.apache.org/job/maven-plugins-ITs-m3/ws/maven-changelog-plugin>
&& /home/jenkins/tools/java/jdk1.6.0_45-32/jre/bin/java -jar <https://builds.apache.org/job/maven-plugins-ITs-m3/ws/maven-changelog-plugin/target/surefire/surefirebooter1059356224239114150.jar>
<https://builds.apache.org/job/maven-plugins-ITs-m3/ws/maven-changelog-plugin/target/surefire/surefire5012070436636976881tmp>
<https://builds.apache.org/job/maven-plugins-ITs-m3/ws/maven-changelog-plugin/target/surefire/surefire_12429981648252232152tmp>
[ERROR] -> [Help 2]
[ERROR] Failed to execute goal org.apache.maven.plugins:maven-surefire-plugin:2.18.1:test
(default-test) on project maven-changes-plugin: Execution default-test of goal org.apache.maven.plugins:maven-surefire-plugin:2.18.1:test
failed: The forked VM terminated without properly saying goodbye. VM crash or System.exit
called?
[ERROR] Command was /bin/sh -c cd <https://builds.apache.org/job/maven-plugins-ITs-m3/ws/maven-changes-plugin>
&& /home/jenkins/tools/java/jdk1.6.0_45-32/jre/bin/java -jar <https://builds.apache.org/job/maven-plugins-ITs-m3/ws/maven-changes-plugin/target/surefire/surefirebooter8157510977111950265.jar>
<https://builds.apache.org/job/maven-plugins-ITs-m3/ws/maven-changes-plugin/target/surefire/surefire7362216231735209082tmp>
<https://builds.apache.org/job/maven-plugins-ITs-m3/ws/maven-changes-plugin/target/surefire/surefire_2859726028907844088tmp>
[ERROR] -> [Help 2]
[ERROR] Failed to execute goal org.apache.maven.plugins:maven-surefire-plugin:2.18.1:test
(default-test) on project maven-clean-plugin: Execution default-test of goal org.apache.maven.plugins:maven-surefire-plugin:2.18.1:test
failed: The forked VM terminated without properly saying goodbye. VM crash or System.exit
called?
[ERROR] Command was /bin/sh -c cd <https://builds.apache.org/job/maven-plugins-ITs-m3/ws/maven-clean-plugin>
&& /home/jenkins/tools/java/jdk1.6.0_45-32/jre/bin/java -jar <https://builds.apache.org/job/maven-plugins-ITs-m3/ws/maven-clean-plugin/target/surefire/surefirebooter7174489721169605968.jar>
<https://builds.apache.org/job/maven-plugins-ITs-m3/ws/maven-clean-plugin/target/surefire/surefire1306484799265872175tmp>
<https://builds.apache.org/job/maven-plugins-ITs-m3/ws/maven-clean-plugin/target/surefire/surefire_31818895877384096130tmp>
[ERROR] -> [Help 2]
[ERROR] Failed to execute goal org.apache.maven.plugins:maven-surefire-plugin:2.18.1:test
(default-test) on project maven-compiler-plugin: Execution default-test of goal org.apache.maven.plugins:maven-surefire-plugin:2.18.1:test
failed: The forked VM terminated without properly saying goodbye. VM crash or System.exit
called?
[ERROR] Command was /bin/sh -c cd <https://builds.apache.org/job/maven-plugins-ITs-m3/ws/maven-compiler-plugin>
&& /home/jenkins/tools/java/jdk1.6.0_45-32/jre/bin/java -jar <https://builds.apache.org/job/maven-plugins-ITs-m3/ws/maven-compiler-plugin/target/surefire/surefirebooter7361706147500837873.jar>
<https://builds.apache.org/job/maven-plugins-ITs-m3/ws/maven-compiler-plugin/target/surefire/surefire5395361634208149159tmp>
<https://builds.apache.org/job/maven-plugins-ITs-m3/ws/maven-compiler-plugin/target/surefire/surefire_41271060332363847200tmp>
[ERROR] -> [Help 2]
[ERROR] Failed to execute goal org.apache.maven.plugins:maven-surefire-plugin:2.18.1:test
(default-test) on project maven-deploy-plugin: Execution default-test of goal org.apache.maven.plugins:maven-surefire-plugin:2.18.1:test
failed: The forked VM terminated without properly saying goodbye. VM crash or System.exit
called?
[ERROR] Command was /bin/sh -c cd <https://builds.apache.org/job/maven-plugins-ITs-m3/ws/maven-deploy-plugin>
&& /home/jenkins/tools/java/jdk1.6.0_45-32/jre/bin/java -jar <https://builds.apache.org/job/maven-plugins-ITs-m3/ws/maven-deploy-plugin/target/surefire/surefirebooter8282951736082088723.jar>
<https://builds.apache.org/job/maven-plugins-ITs-m3/ws/maven-deploy-plugin/target/surefire/surefire4963390929042988864tmp>
<https://builds.apache.org/job/maven-plugins-ITs-m3/ws/maven-deploy-plugin/target/surefire/surefire_57913245926941573651tmp>
[ERROR] -> [Help 2]
[ERROR] Failed to execute goal org.apache.maven.plugins:maven-invoker-plugin:2.0.0:install
(integration-test) on project maven-docck-plugin: Failed to install project dependencies:
MavenProject: org.apache.maven.plugins:maven-docck-plugin:1.2-SNAPSHOT @ <https://builds.apache.org/job/maven-plugins-ITs-m3/ws/maven-docck-plugin/pom.xml>:
Failed to install project artifacts: MavenProject: org.apache.maven.plugins:maven-ant-plugin:2.5-SNAPSHOT
@ <https://builds.apache.org/job/maven-plugins-ITs-m3/ws/maven-ant-plugin/pom.xml>:
Failed to install artifact: org.apache.maven.plugins:maven-ant-plugin:maven-plugin:2.5-SNAPSHOT:
Artifact is not fully assembled: <https://builds.apache.org/job/maven-plugins-ITs-m3/ws/maven-ant-plugin/target/classes>
-> [Help 3]
[ERROR] Failed to execute goal org.apache.maven.plugins:maven-surefire-plugin:2.18.1:test
(default-test) on project maven-ear-plugin: Execution default-test of goal org.apache.maven.plugins:maven-surefire-plugin:2.18.1:test
failed: The forked VM terminated without properly saying goodbye. VM crash or System.exit
called?
[ERROR] Command was /bin/sh -c cd <https://builds.apache.org/job/maven-plugins-ITs-m3/ws/maven-ear-plugin>
&& /home/jenkins/tools/java/jdk1.6.0_45-32/jre/bin/java -jar <https://builds.apache.org/job/maven-plugins-ITs-m3/ws/maven-ear-plugin/target/surefire/surefirebooter8304085393310751622.jar>
<https://builds.apache.org/job/maven-plugins-ITs-m3/ws/maven-ear-plugin/target/surefire/surefire7878649301650589261tmp>
<https://builds.apache.org/job/maven-plugins-ITs-m3/ws/maven-ear-plugin/target/surefire/surefire_68868626601225722102tmp>
[ERROR] -> [Help 2]
[ERROR] Failed to execute goal org.apache.maven.plugins:maven-surefire-plugin:2.18.1:test
(default-test) on project maven-ejb-plugin: Execution default-test of goal org.apache.maven.plugins:maven-surefire-plugin:2.18.1:test
failed: The forked VM terminated without properly saying goodbye. VM crash or System.exit
called?
[ERROR] Command was /bin/sh -c cd <https://builds.apache.org/job/maven-plugins-ITs-m3/ws/maven-ejb-plugin>
&& /home/jenkins/tools/java/jdk1.6.0_45-32/jre/bin/java -jar <https://builds.apache.org/job/maven-plugins-ITs-m3/ws/maven-ejb-plugin/target/surefire/surefirebooter553240717767661.jar>
<https://builds.apache.org/job/maven-plugins-ITs-m3/ws/maven-ejb-plugin/target/surefire/surefire5258438389890793138tmp>
<https://builds.apache.org/job/maven-plugins-ITs-m3/ws/maven-ejb-plugin/target/surefire/surefire_76685933886678845987tmp>
[ERROR] -> [Help 2]
[ERROR] Failed to execute goal org.apache.maven.plugins:maven-surefire-plugin:2.18.1:test
(default-test) on project maven-help-plugin: Execution default-test of goal org.apache.maven.plugins:maven-surefire-plugin:2.18.1:test
failed: The forked VM terminated without properly saying goodbye. VM crash or System.exit
called?
[ERROR] Command was /bin/sh -c cd <https://builds.apache.org/job/maven-plugins-ITs-m3/ws/maven-help-plugin>
&& /home/jenkins/tools/java/jdk1.6.0_45-32/jre/bin/java -jar <https://builds.apache.org/job/maven-plugins-ITs-m3/ws/maven-help-plugin/target/surefire/surefirebooter6665601058518790230.jar>
<https://builds.apache.org/job/maven-plugins-ITs-m3/ws/maven-help-plugin/target/surefire/surefire980320120961577157tmp>
<https://builds.apache.org/job/maven-plugins-ITs-m3/ws/maven-help-plugin/target/surefire/surefire_84917757194794731362tmp>
[ERROR] -> [Help 2]
[ERROR] Failed to execute goal org.apache.maven.plugins:maven-surefire-plugin:2.18.1:test
(default-test) on project maven-install-plugin: Execution default-test of goal org.apache.maven.plugins:maven-surefire-plugin:2.18.1:test
failed: The forked VM terminated without properly saying goodbye. VM crash or System.exit
called?
[ERROR] Command was /bin/sh -c cd <https://builds.apache.org/job/maven-plugins-ITs-m3/ws/maven-install-plugin>
&& /home/jenkins/tools/java/jdk1.6.0_45-32/jre/bin/java -jar <https://builds.apache.org/job/maven-plugins-ITs-m3/ws/maven-install-plugin/target/surefire/surefirebooter1106067844106867103.jar>
<https://builds.apache.org/job/maven-plugins-ITs-m3/ws/maven-install-plugin/target/surefire/surefire478391771490249755tmp>
<https://builds.apache.org/job/maven-plugins-ITs-m3/ws/maven-install-plugin/target/surefire/surefire_91425453855544772423tmp>
[ERROR] -> [Help 2]
[ERROR] Failed to execute goal org.apache.maven.plugins:maven-invoker-plugin:2.0.0:install
(integration-test) on project maven-jarsigner-plugin: Failed to install project dependencies:
MavenProject: org.apache.maven.plugins:maven-jarsigner-plugin:1.5-SNAPSHOT @ <https://builds.apache.org/job/maven-plugins-ITs-m3/ws/maven-jarsigner-plugin/pom.xml>:
Failed to install project artifacts: MavenProject: org.apache.maven.plugins:maven-ant-plugin:2.5-SNAPSHOT
@ <https://builds.apache.org/job/maven-plugins-ITs-m3/ws/maven-ant-plugin/pom.xml>:
Failed to install artifact: org.apache.maven.plugins:maven-ant-plugin:maven-plugin:2.5-SNAPSHOT:
Artifact is not fully assembled: <https://builds.apache.org/job/maven-plugins-ITs-m3/ws/maven-ant-plugin/target/classes>
-> [Help 3]
[ERROR] Failed to execute goal org.apache.maven.plugins:maven-surefire-plugin:2.18.1:test
(default-test) on project maven-javadoc-plugin: Execution default-test of goal org.apache.maven.plugins:maven-surefire-plugin:2.18.1:test
failed: The forked VM terminated without properly saying goodbye. VM crash or System.exit
called?
[ERROR] Command was /bin/sh -c cd <https://builds.apache.org/job/maven-plugins-ITs-m3/ws/maven-javadoc-plugin>
&& /home/jenkins/tools/java/jdk1.6.0_45-32/jre/bin/java -jar <https://builds.apache.org/job/maven-plugins-ITs-m3/ws/maven-javadoc-plugin/target/surefire/surefirebooter9185480099535302243.jar>
<https://builds.apache.org/job/maven-plugins-ITs-m3/ws/maven-javadoc-plugin/target/surefire/surefire233007826066917338tmp>
<https://builds.apache.org/job/maven-plugins-ITs-m3/ws/maven-javadoc-plugin/target/surefire/surefire_102468575960985154263tmp>
[ERROR] -> [Help 2]
[ERROR] Failed to execute goal org.apache.maven.plugins:maven-invoker-plugin:2.0.0:install
(integration-test) on project maven-linkcheck-plugin: Failed to install project dependencies:
MavenProject: org.apache.maven.plugins:maven-linkcheck-plugin:1.3-SNAPSHOT @ <https://builds.apache.org/job/maven-plugins-ITs-m3/ws/maven-linkcheck-plugin/pom.xml>:
Failed to install project artifacts: MavenProject: org.apache.maven.plugins:maven-ant-plugin:2.5-SNAPSHOT
@ <https://builds.apache.org/job/maven-plugins-ITs-m3/ws/maven-ant-plugin/pom.xml>:
Failed to install artifact: org.apache.maven.plugins:maven-ant-plugin:maven-plugin:2.5-SNAPSHOT:
Artifact is not fully assembled: <https://builds.apache.org/job/maven-plugins-ITs-m3/ws/maven-ant-plugin/target/classes>
-> [Help 3]
[ERROR] Failed to execute goal org.apache.maven.plugins:maven-invoker-plugin:2.0.0:install
(integration-test) on project maven-patch-plugin: Failed to install project dependencies:
MavenProject: org.apache.maven.plugins:maven-patch-plugin:1.3-SNAPSHOT @ <https://builds.apache.org/job/maven-plugins-ITs-m3/ws/maven-patch-plugin/pom.xml>:
Failed to install project artifacts: MavenProject: org.apache.maven.plugins:maven-ant-plugin:2.5-SNAPSHOT
@ <https://builds.apache.org/job/maven-plugins-ITs-m3/ws/maven-ant-plugin/pom.xml>:
Failed to install artifact: org.apache.maven.plugins:maven-ant-plugin:maven-plugin:2.5-SNAPSHOT:
Artifact is not fully assembled: <https://builds.apache.org/job/maven-plugins-ITs-m3/ws/maven-ant-plugin/target/classes>
-> [Help 3]
[ERROR] Failed to execute goal org.apache.maven.plugins:maven-surefire-plugin:2.18.1:test
(default-test) on project maven-pdf-plugin: Execution default-test of goal org.apache.maven.plugins:maven-surefire-plugin:2.18.1:test
failed: The forked VM terminated without properly saying goodbye. VM crash or System.exit
called?
[ERROR] Command was /bin/sh -c cd <https://builds.apache.org/job/maven-plugins-ITs-m3/ws/maven-pdf-plugin>
&& /home/jenkins/tools/java/jdk1.6.0_45-32/jre/bin/java -jar <https://builds.apache.org/job/maven-plugins-ITs-m3/ws/maven-pdf-plugin/target/surefire/surefirebooter2187018668988471565.jar>
<https://builds.apache.org/job/maven-plugins-ITs-m3/ws/maven-pdf-plugin/target/surefire/surefire1933219417080088186tmp>
<https://builds.apache.org/job/maven-plugins-ITs-m3/ws/maven-pdf-plugin/target/surefire/surefire_112694730736141157576tmp>
[ERROR] -> [Help 2]
[ERROR] Failed to execute goal org.apache.maven.plugins:maven-surefire-plugin:2.18.1:test
(default-test) on project maven-rar-plugin: Execution default-test of goal org.apache.maven.plugins:maven-surefire-plugin:2.18.1:test
failed: The forked VM terminated without properly saying goodbye. VM crash or System.exit
called?
[ERROR] Command was /bin/sh -c cd <https://builds.apache.org/job/maven-plugins-ITs-m3/ws/maven-rar-plugin>
&& /home/jenkins/tools/java/jdk1.6.0_45-32/jre/bin/java -jar <https://builds.apache.org/job/maven-plugins-ITs-m3/ws/maven-rar-plugin/target/surefire/surefirebooter3937611695528816438.jar>
<https://builds.apache.org/job/maven-plugins-ITs-m3/ws/maven-rar-plugin/target/surefire/surefire4262784380404509761tmp>
<https://builds.apache.org/job/maven-plugins-ITs-m3/ws/maven-rar-plugin/target/surefire/surefire_12559283459149142328tmp>
[ERROR] -> [Help 2]
[ERROR] Failed to execute goal org.apache.maven.plugins:maven-surefire-plugin:2.18.1:test
(default-test) on project maven-repository-plugin: Execution default-test of goal org.apache.maven.plugins:maven-surefire-plugin:2.18.1:test
failed: The forked VM terminated without properly saying goodbye. VM crash or System.exit
called?
[ERROR] Command was /bin/sh -c cd <https://builds.apache.org/job/maven-plugins-ITs-m3/ws/maven-repository-plugin>
&& /home/jenkins/tools/java/jdk1.6.0_45-32/jre/bin/java -jar <https://builds.apache.org/job/maven-plugins-ITs-m3/ws/maven-repository-plugin/target/surefire/surefirebooter7068639636022688040.jar>
<https://builds.apache.org/job/maven-plugins-ITs-m3/ws/maven-repository-plugin/target/surefire/surefire6322364495674918842tmp>
<https://builds.apache.org/job/maven-plugins-ITs-m3/ws/maven-repository-plugin/target/surefire/surefire_138400727523537163065tmp>
[ERROR] -> [Help 2]
[ERROR] Failed to execute goal org.apache.maven.plugins:maven-invoker-plugin:2.0.0:install
(integration-test) on project maven-resources-plugin: Failed to install project dependencies:
MavenProject: org.apache.maven.plugins:maven-resources-plugin:2.8-SNAPSHOT @ <https://builds.apache.org/job/maven-plugins-ITs-m3/ws/maven-resources-plugin/pom.xml>:
Failed to install project artifacts: MavenProject: org.apache.maven.plugins:maven-ant-plugin:2.5-SNAPSHOT
@ <https://builds.apache.org/job/maven-plugins-ITs-m3/ws/maven-ant-plugin/pom.xml>:
Failed to install artifact: org.apache.maven.plugins:maven-ant-plugin:maven-plugin:2.5-SNAPSHOT:
Artifact is not fully assembled: <https://builds.apache.org/job/maven-plugins-ITs-m3/ws/maven-ant-plugin/target/classes>
-> [Help 3]
[ERROR] Failed to execute goal org.apache.maven.plugins:maven-surefire-plugin:2.18.1:test
(default-test) on project maven-site-plugin: Error occurred in starting fork, check output
in log -> [Help 1]
[ERROR] Failed to execute goal org.apache.maven.plugins:maven-surefire-plugin:2.18.1:test
(default-test) on project maven-source-plugin: Execution default-test of goal org.apache.maven.plugins:maven-surefire-plugin:2.18.1:test
failed: The forked VM terminated without properly saying goodbye. VM crash or System.exit
called?
[ERROR] Command was /bin/sh -c cd <https://builds.apache.org/job/maven-plugins-ITs-m3/ws/maven-source-plugin>
&& /home/jenkins/tools/java/jdk1.6.0_45-32/jre/bin/java -jar <https://builds.apache.org/job/maven-plugins-ITs-m3/ws/maven-source-plugin/target/surefire/surefirebooter8846478809028310016.jar>
<https://builds.apache.org/job/maven-plugins-ITs-m3/ws/maven-source-plugin/target/surefire/surefire5512211471664180334tmp>
<https://builds.apache.org/job/maven-plugins-ITs-m3/ws/maven-source-plugin/target/surefire/surefire_161835344710090148567tmp>
[ERROR] -> [Help 2]
[ERROR] Failed to execute goal org.apache.maven.plugins:maven-invoker-plugin:2.0.0:install
(integration-test) on project maven-stage-plugin: Failed to install project dependencies:
MavenProject: org.apache.maven.plugins:maven-stage-plugin:1.1-SNAPSHOT @ <https://builds.apache.org/job/maven-plugins-ITs-m3/ws/maven-stage-plugin/pom.xml>:
Failed to install project artifacts: MavenProject: org.apache.maven.plugins:maven-ant-plugin:2.5-SNAPSHOT
@ <https://builds.apache.org/job/maven-plugins-ITs-m3/ws/maven-ant-plugin/pom.xml>:
Failed to install artifact: org.apache.maven.plugins:maven-ant-plugin:maven-plugin:2.5-SNAPSHOT:
Artifact is not fully assembled: <https://builds.apache.org/job/maven-plugins-ITs-m3/ws/maven-ant-plugin/target/classes>
-> [Help 3]
[ERROR] Failed to execute goal org.apache.maven.plugins:maven-invoker-plugin:2.0.0:install
(integration-test) on project maven-toolchains-plugin: Failed to install project dependencies:
MavenProject: org.apache.maven.plugins:maven-toolchains-plugin:1.2-SNAPSHOT @ <https://builds.apache.org/job/maven-plugins-ITs-m3/ws/maven-toolchains-plugin/pom.xml>:
Failed to install project artifacts: MavenProject: org.apache.maven.plugins:maven-ant-plugin:2.5-SNAPSHOT
@ <https://builds.apache.org/job/maven-plugins-ITs-m3/ws/maven-ant-plugin/pom.xml>:
Failed to install artifact: org.apache.maven.plugins:maven-ant-plugin:maven-plugin:2.5-SNAPSHOT:
Artifact is not fully assembled: <https://builds.apache.org/job/maven-plugins-ITs-m3/ws/maven-ant-plugin/target/classes>
-> [Help 3]
[ERROR] Failed to execute goal org.apache.maven.plugins:maven-surefire-plugin:2.18.1:test
(default-test) on project maven-verifier-plugin: Execution default-test of goal org.apache.maven.plugins:maven-surefire-plugin:2.18.1:test
failed: The forked VM terminated without properly saying goodbye. VM crash or System.exit
called?
[ERROR] Command was /bin/sh -c cd <https://builds.apache.org/job/maven-plugins-ITs-m3/ws/maven-verifier-plugin>
&& /home/jenkins/tools/java/jdk1.6.0_45-32/jre/bin/java -jar <https://builds.apache.org/job/maven-plugins-ITs-m3/ws/maven-verifier-plugin/target/surefire/surefirebooter1075263285540487889.jar>
<https://builds.apache.org/job/maven-plugins-ITs-m3/ws/maven-verifier-plugin/target/surefire/surefire6012613206726351479tmp>
<https://builds.apache.org/job/maven-plugins-ITs-m3/ws/maven-verifier-plugin/target/surefire/surefire_173218259536458398786tmp>
[ERROR] -> [Help 2]
[ERROR] Failed to execute goal org.apache.maven.plugins:maven-surefire-plugin:2.18.1:test
(default-test) on project maven-war-plugin: Execution default-test of goal org.apache.maven.plugins:maven-surefire-plugin:2.18.1:test
failed: The forked VM terminated without properly saying goodbye. VM crash or System.exit
called?
[ERROR] Command was /bin/sh -c cd <https://builds.apache.org/job/maven-plugins-ITs-m3/ws/maven-war-plugin>
&& /home/jenkins/tools/java/jdk1.6.0_45-32/jre/bin/java -jar <https://builds.apache.org/job/maven-plugins-ITs-m3/ws/maven-war-plugin/target/surefire/surefirebooter3021700428094015017.jar>
<https://builds.apache.org/job/maven-plugins-ITs-m3/ws/maven-war-plugin/target/surefire/surefire3249216795441712496tmp>
<https://builds.apache.org/job/maven-plugins-ITs-m3/ws/maven-war-plugin/target/surefire/surefire_184330801845054220010tmp>
[ERROR] -> [Help 2]
[ERROR] Failed to execute goal org.apache.maven.plugins:maven-invoker-plugin:2.0.0:install
(integration-test) on project maven-doap-plugin: Failed to install project dependencies: MavenProject:
org.apache.maven.plugins:maven-doap-plugin:1.3-SNAPSHOT @ <https://builds.apache.org/job/maven-plugins-ITs-m3/ws/maven-doap-plugin/pom.xml>:
Failed to install project artifacts: MavenProject: org.apache.maven.plugins:maven-ant-plugin:2.5-SNAPSHOT
@ <https://builds.apache.org/job/maven-plugins-ITs-m3/ws/maven-ant-plugin/pom.xml>:
Failed to install artifact: org.apache.maven.plugins:maven-ant-plugin:maven-plugin:2.5-SNAPSHOT:
Artifact is not fully assembled: <https://builds.apache.org/job/maven-plugins-ITs-m3/ws/maven-ant-plugin/target/classes>
-> [Help 3]
[ERROR] Failed to execute goal org.apache.maven.plugins:maven-surefire-plugin:2.18.1:test
(default-test) on project maven-pmd-plugin: Execution default-test of goal org.apache.maven.plugins:maven-surefire-plugin:2.18.1:test
failed: The forked VM terminated without properly saying goodbye. VM crash or System.exit
called?
[ERROR] Command was /bin/sh -c cd <https://builds.apache.org/job/maven-plugins-ITs-m3/ws/maven-pmd-plugin>
&& /home/jenkins/tools/java/jdk1.6.0_45-32/jre/bin/java -jar <https://builds.apache.org/job/maven-plugins-ITs-m3/ws/maven-pmd-plugin/target/surefire/surefirebooter4577777149909689215.jar>
<https://builds.apache.org/job/maven-plugins-ITs-m3/ws/maven-pmd-plugin/target/surefire/surefire305223359484599979tmp>
<https://builds.apache.org/job/maven-plugins-ITs-m3/ws/maven-pmd-plugin/target/surefire/surefire_203823005782105704704tmp>
[ERROR] -> [Help 2]
[ERROR] Failed to execute goal org.apache.maven.plugins:maven-surefire-plugin:2.18.1:test
(default-test) on project maven-invoker-plugin: Execution default-test of goal org.apache.maven.plugins:maven-surefire-plugin:2.18.1:test
failed: The forked VM terminated without properly saying goodbye. VM crash or System.exit
called?
[ERROR] Command was /bin/sh -c cd <https://builds.apache.org/job/maven-plugins-ITs-m3/ws/maven-invoker-plugin>
&& /home/jenkins/tools/java/jdk1.6.0_45-32/jre/bin/java -jar <https://builds.apache.org/job/maven-plugins-ITs-m3/ws/maven-invoker-plugin/target/surefire/surefirebooter6916361082593651040.jar>
<https://builds.apache.org/job/maven-plugins-ITs-m3/ws/maven-invoker-plugin/target/surefire/surefire5126284064658329700tmp>
<https://builds.apache.org/job/maven-plugins-ITs-m3/ws/maven-invoker-plugin/target/surefire/surefire_211170402697012484280tmp>
[ERROR] -> [Help 2]
[ERROR] Failed to execute goal org.apache.maven.plugins:maven-surefire-plugin:2.18.1:test
(default-test) on project maven-jar-plugin: Execution default-test of goal org.apache.maven.plugins:maven-surefire-plugin:2.18.1:test
failed: The forked VM terminated without properly saying goodbye. VM crash or System.exit
called?
[ERROR] Command was /bin/sh -c cd <https://builds.apache.org/job/maven-plugins-ITs-m3/ws/maven-jar-plugin>
&& /home/jenkins/tools/java/jdk1.6.0_45-32/jre/bin/java -jar <https://builds.apache.org/job/maven-plugins-ITs-m3/ws/maven-jar-plugin/target/surefire/surefirebooter3448569853977560153.jar>
<https://builds.apache.org/job/maven-plugins-ITs-m3/ws/maven-jar-plugin/target/surefire/surefire328350450954381638tmp>
<https://builds.apache.org/job/maven-plugins-ITs-m3/ws/maven-jar-plugin/target/surefire/surefire_227976937895596355093tmp>
[ERROR] -> [Help 2]
[ERROR] Failed to execute goal org.codehaus.mojo:keytool-maven-plugin:1.0:genkey (init) on
project maven-project-info-reports-plugin: Result of /bin/sh -c 'cd <https://builds.apache.org/job/maven-plugins-ITs-m3/ws/maven-project-info-reports-plugin>
&& /home/jenkins/tools/java/jdk1.6.0_45-32/jre/../bin/keytool -genkey -dname "cn=jetty,
ou=jetty, L=Unknown, ST=Unknown, o=Apache, c=Unknown" -alias apache -keypass apache -keystore
<https://builds.apache.org/job/maven-plugins-ITs-m3/ws/maven-project-info-reports-plugin/target/jetty.jks>
-storepass apache -validity 365 -keyalg RSA' execution is: '1': . -> [Help 3]
[ERROR] Failed to execute goal org.apache.maven.plugins:maven-surefire-plugin:2.18.1:test
(default-test) on project maven-remote-resources-plugin: Execution default-test of goal org.apache.maven.plugins:maven-surefire-plugin:2.18.1:test
failed: The forked VM terminated without properly saying goodbye. VM crash or System.exit
called?
[ERROR] Command was /bin/sh -c cd <https://builds.apache.org/job/maven-plugins-ITs-m3/ws/maven-remote-resources-plugin>
&& /home/jenkins/tools/java/jdk1.6.0_45-32/jre/bin/java -jar <https://builds.apache.org/job/maven-plugins-ITs-m3/ws/maven-remote-resources-plugin/target/surefire/surefirebooter2570325281759340502.jar>
<https://builds.apache.org/job/maven-plugins-ITs-m3/ws/maven-remote-resources-plugin/target/surefire/surefire5353123630569497989tmp>
<https://builds.apache.org/job/maven-plugins-ITs-m3/ws/maven-remote-resources-plugin/target/surefire/surefire_234627214228954386520tmp>
[ERROR] -> [Help 2]
[ERROR] Failed to execute goal org.apache.maven.plugins:maven-surefire-plugin:2.18.1:test
(default-test) on project maven-shade-plugin: Execution default-test of goal org.apache.maven.plugins:maven-surefire-plugin:2.18.1:test
failed: The forked VM terminated without properly saying goodbye. VM crash or System.exit
called?
[ERROR] Command was /bin/sh -c cd <https://builds.apache.org/job/maven-plugins-ITs-m3/ws/maven-shade-plugin>
&& /home/jenkins/tools/java/jdk1.6.0_45-32/jre/bin/java -jar <https://builds.apache.org/job/maven-plugins-ITs-m3/ws/maven-shade-plugin/target/surefire/surefirebooter7666507070101668751.jar>
<https://builds.apache.org/job/maven-plugins-ITs-m3/ws/maven-shade-plugin/target/surefire/surefire2984485203106943095tmp>
<https://builds.apache.org/job/maven-plugins-ITs-m3/ws/maven-shade-plugin/target/surefire/surefire_24204546549870747059tmp>
[ERROR] -> [Help 2]
[ERROR] Failed to execute goal org.apache.maven.plugins:maven-invoker-plugin:2.0.0:install
(integration-test) on project maven-scm-publish-plugin: Failed to install project dependencies:
MavenProject: org.apache.maven.plugins:maven-scm-publish-plugin:1.2-SNAPSHOT @ <https://builds.apache.org/job/maven-plugins-ITs-m3/ws/maven-scm-publish-plugin/pom.xml>:
Failed to install project artifacts: MavenProject: org.apache.maven.plugins:maven-ant-plugin:2.5-SNAPSHOT
@ <https://builds.apache.org/job/maven-plugins-ITs-m3/ws/maven-ant-plugin/pom.xml>:
Failed to install artifact: org.apache.maven.plugins:maven-ant-plugin:maven-plugin:2.5-SNAPSHOT:
Artifact is not fully assembled: <https://builds.apache.org/job/maven-plugins-ITs-m3/ws/maven-ant-plugin/target/classes>
-> [Help 3]
[ERROR] Failed to execute goal org.apache.maven.plugins:maven-surefire-plugin:2.18.1:test
(default-test) on project maven-assembly-plugin: Execution default-test of goal org.apache.maven.plugins:maven-surefire-plugin:2.18.1:test
failed: The forked VM terminated without properly saying goodbye. VM crash or System.exit
called?
[ERROR] Command was /bin/sh -c cd <https://builds.apache.org/job/maven-plugins-ITs-m3/ws/maven-assembly-plugin>
&& /home/jenkins/tools/java/jdk1.6.0_45-32/jre/bin/java -jar <https://builds.apache.org/job/maven-plugins-ITs-m3/ws/maven-assembly-plugin/target/surefire/surefirebooter521497402616342046.jar>
<https://builds.apache.org/job/maven-plugins-ITs-m3/ws/maven-assembly-plugin/target/surefire/surefire8828931235757983394tmp>
<https://builds.apache.org/job/maven-plugins-ITs-m3/ws/maven-assembly-plugin/target/surefire/surefire_03828024224965221366tmp>
[ERROR] -> [Help 2]
[ERROR] Failed to execute goal org.apache.maven.plugins:maven-surefire-plugin:2.18.1:test
(default-test) on project maven-dependency-plugin: Execution default-test of goal org.apache.maven.plugins:maven-surefire-plugin:2.18.1:test
failed: The forked VM terminated without properly saying goodbye. VM crash or System.exit
called?
[ERROR] Command was /bin/sh -c cd <https://builds.apache.org/job/maven-plugins-ITs-m3/ws/maven-dependency-plugin>
&& /home/jenkins/tools/java/jdk1.6.0_45-32/jre/bin/java -Xmx384m -jar <https://builds.apache.org/job/maven-plugins-ITs-m3/ws/maven-dependency-plugin/target/surefire/surefirebooter1228312962155928396.jar>
<https://builds.apache.org/job/maven-plugins-ITs-m3/ws/maven-dependency-plugin/target/surefire/surefire8105156329605872223tmp>
<https://builds.apache.org/job/maven-plugins-ITs-m3/ws/maven-dependency-plugin/target/surefire/surefire_259049834577490608839tmp>
[ERROR] -> [Help 2]
[ERROR] Failed to execute goal org.apache.maven.plugins:maven-invoker-plugin:2.0.0:install
(integration-test) on project maven-gpg-plugin: Failed to install project dependencies: MavenProject:
org.apache.maven.plugins:maven-gpg-plugin:1.7-SNAPSHOT @ <https://builds.apache.org/job/maven-plugins-ITs-m3/ws/maven-gpg-plugin/pom.xml>:
Failed to install project artifacts: MavenProject: org.apache.maven.plugins:maven-ant-plugin:2.5-SNAPSHOT
@ <https://builds.apache.org/job/maven-plugins-ITs-m3/ws/maven-ant-plugin/pom.xml>:
Failed to install artifact: org.apache.maven.plugins:maven-ant-plugin:maven-plugin:2.5-SNAPSHOT:
Artifact is not fully assembled: <https://builds.apache.org/job/maven-plugins-ITs-m3/ws/maven-ant-plugin/target/classes>
-> [Help 3]
[ERROR] 
[ERROR] To see the full stack trace of the errors, re-run Maven with the -e switch.
[ERROR] Re-run Maven using the -X switch to enable full debug logging.
[ERROR] 
[ERROR] For more information about the errors and possible solutions, please read the following
articles:
[ERROR] [Help 1] http://cwiki.apache.org/confluence/display/MAVEN/MojoFailureException
[ERROR] [Help 2] http://cwiki.apache.org/confluence/display/MAVEN/PluginExecutionException
[ERROR] [Help 3] http://cwiki.apache.org/confluence/display/MAVEN/MojoExecutionException
Build step 'Invoke top-level Maven targets' marked build as failure
Deleting 1 temporary files
Recording test results
ERROR: Step ?Publish JUnit test result report? failed: No test report files were found. Configuration
error?


Mime
View raw message