maven-notifications mailing list archives

Site index · List index
Message view « Date » · « Thread »
Top « Date » · « Thread »
From Apache Jenkins Server <jenk...@builds.apache.org>
Subject Build failed in Jenkins: maven-plugins-ITs-m3 #2367
Date Wed, 04 May 2016 20:42:52 GMT
See <https://builds.apache.org/job/maven-plugins-ITs-m3/2367/changes>

Changes:

[khmarbaise] [MRAR-57] Upgrade maven-archiver to 3.0.2

------------------------------------------
[...truncated 7224 lines...]
[INFO] Installing <https://builds.apache.org/job/maven-plugins-ITs-m3/ws/maven-ant-plugin/pom.xml> to <https://builds.apache.org/job/maven-plugins-ITs-m3/ws/maven-dependency-plugin/target/local-repo/org/apache/maven/plugins/maven-ant-plugin/2.5-SNAPSHOT/maven-ant-plugin-2.5-SNAPSHOT.pom>
[INFO] Installing <https://builds.apache.org/job/maven-plugins-ITs-m3/ws/maven-antrun-plugin/pom.xml> to <https://builds.apache.org/job/maven-plugins-ITs-m3/ws/maven-dependency-plugin/target/local-repo/org/apache/maven/plugins/maven-antrun-plugin/1.9-SNAPSHOT/maven-antrun-plugin-1.9-SNAPSHOT.pom>
[INFO] Installing <https://builds.apache.org/job/maven-plugins-ITs-m3/ws/maven-antrun-plugin/target/maven-antrun-plugin-1.9-SNAPSHOT.jar> to <https://builds.apache.org/job/maven-plugins-ITs-m3/ws/maven-dependency-plugin/target/local-repo/org/apache/maven/plugins/maven-antrun-plugin/1.9-SNAPSHOT/maven-antrun-plugin-1.9-SNAPSHOT.jar>
[INFO] Installing <https://builds.apache.org/job/maven-plugins-ITs-m3/ws/maven-antrun-plugin/pom.xml> to <https://builds.apache.org/job/maven-plugins-ITs-m3/ws/maven-dependency-plugin/target/local-repo/org/apache/maven/plugins/maven-antrun-plugin/1.9-SNAPSHOT/maven-antrun-plugin-1.9-SNAPSHOT.pom>
[INFO] Installing <https://builds.apache.org/job/maven-plugins-ITs-m3/ws/maven-changelog-plugin/pom.xml> to <https://builds.apache.org/job/maven-plugins-ITs-m3/ws/maven-dependency-plugin/target/local-repo/org/apache/maven/plugins/maven-changelog-plugin/2.4-SNAPSHOT/maven-changelog-plugin-2.4-SNAPSHOT.pom>
[INFO] Installing <https://builds.apache.org/job/maven-plugins-ITs-m3/ws/maven-changelog-plugin/target/maven-changelog-plugin-2.4-SNAPSHOT.jar> to <https://builds.apache.org/job/maven-plugins-ITs-m3/ws/maven-dependency-plugin/target/local-repo/org/apache/maven/plugins/maven-changelog-plugin/2.4-SNAPSHOT/maven-changelog-plugin-2.4-SNAPSHOT.jar>
[INFO] Installing <https://builds.apache.org/job/maven-plugins-ITs-m3/ws/maven-changelog-plugin/pom.xml> to <https://builds.apache.org/job/maven-plugins-ITs-m3/ws/maven-dependency-plugin/target/local-repo/org/apache/maven/plugins/maven-changelog-plugin/2.4-SNAPSHOT/maven-changelog-plugin-2.4-SNAPSHOT.pom>
[INFO] Installing <https://builds.apache.org/job/maven-plugins-ITs-m3/ws/maven-changes-plugin/pom.xml> to <https://builds.apache.org/job/maven-plugins-ITs-m3/ws/maven-dependency-plugin/target/local-repo/org/apache/maven/plugins/maven-changes-plugin/2.13-SNAPSHOT/maven-changes-plugin-2.13-SNAPSHOT.pom>
[INFO] Installing <https://builds.apache.org/job/maven-plugins-ITs-m3/ws/maven-changes-plugin/target/maven-changes-plugin-2.13-SNAPSHOT.jar> to <https://builds.apache.org/job/maven-plugins-ITs-m3/ws/maven-dependency-plugin/target/local-repo/org/apache/maven/plugins/maven-changes-plugin/2.13-SNAPSHOT/maven-changes-plugin-2.13-SNAPSHOT.jar>
[INFO] Installing <https://builds.apache.org/job/maven-plugins-ITs-m3/ws/maven-changes-plugin/pom.xml> to <https://builds.apache.org/job/maven-plugins-ITs-m3/ws/maven-dependency-plugin/target/local-repo/org/apache/maven/plugins/maven-changes-plugin/2.13-SNAPSHOT/maven-changes-plugin-2.13-SNAPSHOT.pom>
[INFO] Installing <https://builds.apache.org/job/maven-plugins-ITs-m3/ws/maven-clean-plugin/pom.xml> to <https://builds.apache.org/job/maven-plugins-ITs-m3/ws/maven-dependency-plugin/target/local-repo/org/apache/maven/plugins/maven-clean-plugin/3.0.1-SNAPSHOT/maven-clean-plugin-3.0.1-SNAPSHOT.pom>
[INFO] Installing <https://builds.apache.org/job/maven-plugins-ITs-m3/ws/maven-clean-plugin/target/maven-clean-plugin-3.0.1-SNAPSHOT.jar> to <https://builds.apache.org/job/maven-plugins-ITs-m3/ws/maven-dependency-plugin/target/local-repo/org/apache/maven/plugins/maven-clean-plugin/3.0.1-SNAPSHOT/maven-clean-plugin-3.0.1-SNAPSHOT.jar>
[INFO] Installing <https://builds.apache.org/job/maven-plugins-ITs-m3/ws/maven-clean-plugin/pom.xml> to <https://builds.apache.org/job/maven-plugins-ITs-m3/ws/maven-dependency-plugin/target/local-repo/org/apache/maven/plugins/maven-clean-plugin/3.0.1-SNAPSHOT/maven-clean-plugin-3.0.1-SNAPSHOT.pom>
[INFO] Installing <https://builds.apache.org/job/maven-plugins-ITs-m3/ws/maven-compiler-plugin/pom.xml> to <https://builds.apache.org/job/maven-plugins-ITs-m3/ws/maven-dependency-plugin/target/local-repo/org/apache/maven/plugins/maven-compiler-plugin/3.6-SNAPSHOT/maven-compiler-plugin-3.6-SNAPSHOT.pom>
[INFO] Installing <https://builds.apache.org/job/maven-plugins-ITs-m3/ws/maven-compiler-plugin/target/maven-compiler-plugin-3.6-SNAPSHOT.jar> to <https://builds.apache.org/job/maven-plugins-ITs-m3/ws/maven-dependency-plugin/target/local-repo/org/apache/maven/plugins/maven-compiler-plugin/3.6-SNAPSHOT/maven-compiler-plugin-3.6-SNAPSHOT.jar>
[INFO] Installing <https://builds.apache.org/job/maven-plugins-ITs-m3/ws/maven-compiler-plugin/pom.xml> to <https://builds.apache.org/job/maven-plugins-ITs-m3/ws/maven-dependency-plugin/target/local-repo/org/apache/maven/plugins/maven-compiler-plugin/3.6-SNAPSHOT/maven-compiler-plugin-3.6-SNAPSHOT.pom>
[INFO] Installing <https://builds.apache.org/job/maven-plugins-ITs-m3/ws/maven-deploy-plugin/pom.xml> to <https://builds.apache.org/job/maven-plugins-ITs-m3/ws/maven-dependency-plugin/target/local-repo/org/apache/maven/plugins/maven-deploy-plugin/3.0-SNAPSHOT/maven-deploy-plugin-3.0-SNAPSHOT.pom>
[INFO] Installing <https://builds.apache.org/job/maven-plugins-ITs-m3/ws/maven-deploy-plugin/target/maven-deploy-plugin-3.0-SNAPSHOT.jar> to <https://builds.apache.org/job/maven-plugins-ITs-m3/ws/maven-dependency-plugin/target/local-repo/org/apache/maven/plugins/maven-deploy-plugin/3.0-SNAPSHOT/maven-deploy-plugin-3.0-SNAPSHOT.jar>
[INFO] Installing <https://builds.apache.org/job/maven-plugins-ITs-m3/ws/maven-deploy-plugin/pom.xml> to <https://builds.apache.org/job/maven-plugins-ITs-m3/ws/maven-dependency-plugin/target/local-repo/org/apache/maven/plugins/maven-deploy-plugin/3.0-SNAPSHOT/maven-deploy-plugin-3.0-SNAPSHOT.pom>
[INFO] Installing <https://builds.apache.org/job/maven-plugins-ITs-m3/ws/maven-docck-plugin/pom.xml> to <https://builds.apache.org/job/maven-plugins-ITs-m3/ws/maven-dependency-plugin/target/local-repo/org/apache/maven/plugins/maven-docck-plugin/1.2-SNAPSHOT/maven-docck-plugin-1.2-SNAPSHOT.pom>
[INFO] Installing <https://builds.apache.org/job/maven-plugins-ITs-m3/ws/maven-docck-plugin/target/maven-docck-plugin-1.2-SNAPSHOT.jar> to <https://builds.apache.org/job/maven-plugins-ITs-m3/ws/maven-dependency-plugin/target/local-repo/org/apache/maven/plugins/maven-docck-plugin/1.2-SNAPSHOT/maven-docck-plugin-1.2-SNAPSHOT.jar>
[INFO] Installing <https://builds.apache.org/job/maven-plugins-ITs-m3/ws/maven-docck-plugin/pom.xml> to <https://builds.apache.org/job/maven-plugins-ITs-m3/ws/maven-dependency-plugin/target/local-repo/org/apache/maven/plugins/maven-docck-plugin/1.2-SNAPSHOT/maven-docck-plugin-1.2-SNAPSHOT.pom>
[INFO] Installing <https://builds.apache.org/job/maven-plugins-ITs-m3/ws/maven-ear-plugin/pom.xml> to <https://builds.apache.org/job/maven-plugins-ITs-m3/ws/maven-dependency-plugin/target/local-repo/org/apache/maven/plugins/maven-ear-plugin/2.10.2-SNAPSHOT/maven-ear-plugin-2.10.2-SNAPSHOT.pom>
[INFO] Installing <https://builds.apache.org/job/maven-plugins-ITs-m3/ws/maven-ear-plugin/target/maven-ear-plugin-2.10.2-SNAPSHOT.jar> to <https://builds.apache.org/job/maven-plugins-ITs-m3/ws/maven-dependency-plugin/target/local-repo/org/apache/maven/plugins/maven-ear-plugin/2.10.2-SNAPSHOT/maven-ear-plugin-2.10.2-SNAPSHOT.jar>
[INFO] Installing <https://builds.apache.org/job/maven-plugins-ITs-m3/ws/maven-ear-plugin/pom.xml> to <https://builds.apache.org/job/maven-plugins-ITs-m3/ws/maven-dependency-plugin/target/local-repo/org/apache/maven/plugins/maven-ear-plugin/2.10.2-SNAPSHOT/maven-ear-plugin-2.10.2-SNAPSHOT.pom>
[INFO] Installing <https://builds.apache.org/job/maven-plugins-ITs-m3/ws/maven-ejb-plugin/pom.xml> to <https://builds.apache.org/job/maven-plugins-ITs-m3/ws/maven-dependency-plugin/target/local-repo/org/apache/maven/plugins/maven-ejb-plugin/2.5.2-SNAPSHOT/maven-ejb-plugin-2.5.2-SNAPSHOT.pom>
[INFO] Installing <https://builds.apache.org/job/maven-plugins-ITs-m3/ws/maven-ejb-plugin/target/maven-ejb-plugin-2.5.2-SNAPSHOT.jar> to <https://builds.apache.org/job/maven-plugins-ITs-m3/ws/maven-dependency-plugin/target/local-repo/org/apache/maven/plugins/maven-ejb-plugin/2.5.2-SNAPSHOT/maven-ejb-plugin-2.5.2-SNAPSHOT.jar>
[INFO] Installing <https://builds.apache.org/job/maven-plugins-ITs-m3/ws/maven-ejb-plugin/pom.xml> to <https://builds.apache.org/job/maven-plugins-ITs-m3/ws/maven-dependency-plugin/target/local-repo/org/apache/maven/plugins/maven-ejb-plugin/2.5.2-SNAPSHOT/maven-ejb-plugin-2.5.2-SNAPSHOT.pom>
[INFO] Installing <https://builds.apache.org/job/maven-plugins-ITs-m3/ws/maven-help-plugin/pom.xml> to <https://builds.apache.org/job/maven-plugins-ITs-m3/ws/maven-dependency-plugin/target/local-repo/org/apache/maven/plugins/maven-help-plugin/2.2.1-SNAPSHOT/maven-help-plugin-2.2.1-SNAPSHOT.pom>
[INFO] Installing <https://builds.apache.org/job/maven-plugins-ITs-m3/ws/maven-help-plugin/target/maven-help-plugin-2.2.1-SNAPSHOT.jar> to <https://builds.apache.org/job/maven-plugins-ITs-m3/ws/maven-dependency-plugin/target/local-repo/org/apache/maven/plugins/maven-help-plugin/2.2.1-SNAPSHOT/maven-help-plugin-2.2.1-SNAPSHOT.jar>
[INFO] Installing <https://builds.apache.org/job/maven-plugins-ITs-m3/ws/maven-help-plugin/pom.xml> to <https://builds.apache.org/job/maven-plugins-ITs-m3/ws/maven-dependency-plugin/target/local-repo/org/apache/maven/plugins/maven-help-plugin/2.2.1-SNAPSHOT/maven-help-plugin-2.2.1-SNAPSHOT.pom>
[INFO] Installing <https://builds.apache.org/job/maven-plugins-ITs-m3/ws/maven-install-plugin/pom.xml> to <https://builds.apache.org/job/maven-plugins-ITs-m3/ws/maven-dependency-plugin/target/local-repo/org/apache/maven/plugins/maven-install-plugin/3.0-SNAPSHOT/maven-install-plugin-3.0-SNAPSHOT.pom>
[INFO] Installing <https://builds.apache.org/job/maven-plugins-ITs-m3/ws/maven-install-plugin/target/maven-install-plugin-3.0-SNAPSHOT.jar> to <https://builds.apache.org/job/maven-plugins-ITs-m3/ws/maven-dependency-plugin/target/local-repo/org/apache/maven/plugins/maven-install-plugin/3.0-SNAPSHOT/maven-install-plugin-3.0-SNAPSHOT.jar>
[INFO] Installing <https://builds.apache.org/job/maven-plugins-ITs-m3/ws/maven-install-plugin/pom.xml> to <https://builds.apache.org/job/maven-plugins-ITs-m3/ws/maven-dependency-plugin/target/local-repo/org/apache/maven/plugins/maven-install-plugin/3.0-SNAPSHOT/maven-install-plugin-3.0-SNAPSHOT.pom>
[INFO] Installing <https://builds.apache.org/job/maven-plugins-ITs-m3/ws/maven-jarsigner-plugin/pom.xml> to <https://builds.apache.org/job/maven-plugins-ITs-m3/ws/maven-dependency-plugin/target/local-repo/org/apache/maven/plugins/maven-jarsigner-plugin/1.5-SNAPSHOT/maven-jarsigner-plugin-1.5-SNAPSHOT.pom>
[INFO] Installing <https://builds.apache.org/job/maven-plugins-ITs-m3/ws/maven-jarsigner-plugin/target/maven-jarsigner-plugin-1.5-SNAPSHOT.jar> to <https://builds.apache.org/job/maven-plugins-ITs-m3/ws/maven-dependency-plugin/target/local-repo/org/apache/maven/plugins/maven-jarsigner-plugin/1.5-SNAPSHOT/maven-jarsigner-plugin-1.5-SNAPSHOT.jar>
[INFO] Installing <https://builds.apache.org/job/maven-plugins-ITs-m3/ws/maven-jarsigner-plugin/pom.xml> to <https://builds.apache.org/job/maven-plugins-ITs-m3/ws/maven-dependency-plugin/target/local-repo/org/apache/maven/plugins/maven-jarsigner-plugin/1.5-SNAPSHOT/maven-jarsigner-plugin-1.5-SNAPSHOT.pom>
[INFO] Installing <https://builds.apache.org/job/maven-plugins-ITs-m3/ws/maven-javadoc-plugin/pom.xml> to <https://builds.apache.org/job/maven-plugins-ITs-m3/ws/maven-dependency-plugin/target/local-repo/org/apache/maven/plugins/maven-javadoc-plugin/2.10.4-SNAPSHOT/maven-javadoc-plugin-2.10.4-SNAPSHOT.pom>
[INFO]                                                                         
[INFO] ------------------------------------------------------------------------
[INFO] Building Apache Maven GPG Plugin 1.7-SNAPSHOT
[INFO] ------------------------------------------------------------------------
[INFO] 
[INFO] --- maven-clean-plugin:2.5:clean (default-clean) @ maven-gpg-plugin ---
[INFO] Deleting <https://builds.apache.org/job/maven-plugins-ITs-m3/ws/maven-gpg-plugin/target>
[INFO] 
[INFO] --- maven-enforcer-plugin:1.3.1:enforce (enforce-bytecode-version) @ maven-gpg-plugin ---
[INFO] 
[INFO] --- maven-enforcer-plugin:1.3.1:enforce (ban-known-bad-maven-versions) @ maven-gpg-plugin ---
[INFO] 
[INFO] --- maven-enforcer-plugin:1.3.1:enforce (ensure-no-container-api) @ maven-gpg-plugin ---
[INFO] 
[INFO] --- apache-rat-plugin:0.11:check (rat-check) @ maven-gpg-plugin ---
[INFO] 51 implicit excludes (use -debug for more details).
[INFO] Exclude: src/test/resources/gnupg/*
[INFO] Exclude: DEPENDENCIES
[INFO] 66 resources included (use -debug for more details)
[INFO] Rat check: Summary of files. Unapproved: 0 unknown: 0 generated: 0 approved: 54 licence.
[INFO] 
[INFO] --- maven-plugin-plugin:3.4:helpmojo (generate-helpmojo) @ maven-gpg-plugin ---
[INFO] Using 'UTF-8' encoding to read mojo metadata.
[INFO] Mojo extractor with id: java-annotations found 0 mojo descriptors.
[INFO] Mojo extractor with id: java-javadoc found 0 mojo descriptors.
[INFO] 
[INFO] --- maven-remote-resources-plugin:1.5:process (default) @ maven-gpg-plugin ---
[INFO] 
[INFO] --- maven-resources-plugin:2.7:resources (default-resources) @ maven-gpg-plugin ---
[INFO] Using 'UTF-8' encoding to copy filtered resources.
[INFO] Copying 1 resource
[INFO] Copying 3 resources
[INFO] 
[INFO] --- maven-compiler-plugin:3.2:compile (default-compile) @ maven-gpg-plugin ---
[INFO] Changes detected - recompiling the module!
[INFO] Compiling 9 source files to <https://builds.apache.org/job/maven-plugins-ITs-m3/ws/maven-gpg-plugin/target/classes>
[INFO] Some input files use unchecked or unsafe operations.
[INFO] Recompile with -Xlint:unchecked for details.
[INFO] 
[INFO] --- maven-plugin-plugin:3.4:descriptor (default-descriptor) @ maven-gpg-plugin ---
[INFO] Using 'UTF-8' encoding to read mojo metadata.
[INFO] Mojo extractor with id: java-annotations found 3 mojo descriptors.
[INFO] Mojo extractor with id: java-javadoc found 0 mojo descriptors.
[INFO] 
[INFO] --- maven-resources-plugin:2.7:testResources (default-testResources) @ maven-gpg-plugin ---
[INFO] Using 'UTF-8' encoding to copy filtered resources.
[INFO] Copying 8 resources
[INFO] Copying 3 resources
[INFO] 
[INFO] --- maven-compiler-plugin:3.2:testCompile (default-testCompile) @ maven-gpg-plugin ---
[INFO] No sources to compile
[INFO] 
[INFO] --- maven-surefire-plugin:2.18.1:test (default-test) @ maven-gpg-plugin ---
[INFO] 
[INFO] --- maven-jar-plugin:2.5:jar (default-jar) @ maven-gpg-plugin ---
[INFO] Building jar: <https://builds.apache.org/job/maven-plugins-ITs-m3/ws/maven-gpg-plugin/target/maven-gpg-plugin-1.7-SNAPSHOT.jar>
[INFO] 
[INFO] --- maven-plugin-plugin:3.4:addPluginArtifactMetadata (default-addPluginArtifactMetadata) @ maven-gpg-plugin ---
[INFO] 
[INFO] --- maven-invoker-plugin:2.0.0:install (integration-test) @ maven-gpg-plugin ---
[INFO] Installing <https://builds.apache.org/job/maven-plugins-ITs-m3/ws/maven-acr-plugin/pom.xml> to <https://builds.apache.org/job/maven-plugins-ITs-m3/ws/maven-gpg-plugin/target/local-repo/org/apache/maven/plugins/maven-acr-plugin/3.0.1-SNAPSHOT/maven-acr-plugin-3.0.1-SNAPSHOT.pom>
[INFO] Installing <https://builds.apache.org/job/maven-plugins-ITs-m3/ws/maven-acr-plugin/target/maven-acr-plugin-3.0.1-SNAPSHOT.jar> to <https://builds.apache.org/job/maven-plugins-ITs-m3/ws/maven-gpg-plugin/target/local-repo/org/apache/maven/plugins/maven-acr-plugin/3.0.1-SNAPSHOT/maven-acr-plugin-3.0.1-SNAPSHOT.jar>
[INFO] Installing <https://builds.apache.org/job/maven-plugins-ITs-m3/ws/maven-acr-plugin/pom.xml> to <https://builds.apache.org/job/maven-plugins-ITs-m3/ws/maven-gpg-plugin/target/local-repo/org/apache/maven/plugins/maven-acr-plugin/3.0.1-SNAPSHOT/maven-acr-plugin-3.0.1-SNAPSHOT.pom>
[INFO] Installing <https://builds.apache.org/job/maven-plugins-ITs-m3/ws/maven-ant-plugin/pom.xml> to <https://builds.apache.org/job/maven-plugins-ITs-m3/ws/maven-gpg-plugin/target/local-repo/org/apache/maven/plugins/maven-ant-plugin/2.5-SNAPSHOT/maven-ant-plugin-2.5-SNAPSHOT.pom>
[INFO] Installing <https://builds.apache.org/job/maven-plugins-ITs-m3/ws/maven-ant-plugin/target/maven-ant-plugin-2.5-SNAPSHOT.jar> to <https://builds.apache.org/job/maven-plugins-ITs-m3/ws/maven-gpg-plugin/target/local-repo/org/apache/maven/plugins/maven-ant-plugin/2.5-SNAPSHOT/maven-ant-plugin-2.5-SNAPSHOT.jar>
[INFO] Installing <https://builds.apache.org/job/maven-plugins-ITs-m3/ws/maven-ant-plugin/pom.xml> to <https://builds.apache.org/job/maven-plugins-ITs-m3/ws/maven-gpg-plugin/target/local-repo/org/apache/maven/plugins/maven-ant-plugin/2.5-SNAPSHOT/maven-ant-plugin-2.5-SNAPSHOT.pom>
[INFO] Installing <https://builds.apache.org/job/maven-plugins-ITs-m3/ws/maven-antrun-plugin/pom.xml> to <https://builds.apache.org/job/maven-plugins-ITs-m3/ws/maven-gpg-plugin/target/local-repo/org/apache/maven/plugins/maven-antrun-plugin/1.9-SNAPSHOT/maven-antrun-plugin-1.9-SNAPSHOT.pom>
[INFO] Installing <https://builds.apache.org/job/maven-plugins-ITs-m3/ws/maven-antrun-plugin/target/maven-antrun-plugin-1.9-SNAPSHOT.jar> to <https://builds.apache.org/job/maven-plugins-ITs-m3/ws/maven-gpg-plugin/target/local-repo/org/apache/maven/plugins/maven-antrun-plugin/1.9-SNAPSHOT/maven-antrun-plugin-1.9-SNAPSHOT.jar>
[INFO] Installing <https://builds.apache.org/job/maven-plugins-ITs-m3/ws/maven-antrun-plugin/pom.xml> to <https://builds.apache.org/job/maven-plugins-ITs-m3/ws/maven-gpg-plugin/target/local-repo/org/apache/maven/plugins/maven-antrun-plugin/1.9-SNAPSHOT/maven-antrun-plugin-1.9-SNAPSHOT.pom>
[INFO] Installing <https://builds.apache.org/job/maven-plugins-ITs-m3/ws/maven-changelog-plugin/pom.xml> to <https://builds.apache.org/job/maven-plugins-ITs-m3/ws/maven-gpg-plugin/target/local-repo/org/apache/maven/plugins/maven-changelog-plugin/2.4-SNAPSHOT/maven-changelog-plugin-2.4-SNAPSHOT.pom>
[INFO] Installing <https://builds.apache.org/job/maven-plugins-ITs-m3/ws/maven-changelog-plugin/target/maven-changelog-plugin-2.4-SNAPSHOT.jar> to <https://builds.apache.org/job/maven-plugins-ITs-m3/ws/maven-gpg-plugin/target/local-repo/org/apache/maven/plugins/maven-changelog-plugin/2.4-SNAPSHOT/maven-changelog-plugin-2.4-SNAPSHOT.jar>
[INFO] Installing <https://builds.apache.org/job/maven-plugins-ITs-m3/ws/maven-changelog-plugin/pom.xml> to <https://builds.apache.org/job/maven-plugins-ITs-m3/ws/maven-gpg-plugin/target/local-repo/org/apache/maven/plugins/maven-changelog-plugin/2.4-SNAPSHOT/maven-changelog-plugin-2.4-SNAPSHOT.pom>
[INFO] Installing <https://builds.apache.org/job/maven-plugins-ITs-m3/ws/maven-changes-plugin/pom.xml> to <https://builds.apache.org/job/maven-plugins-ITs-m3/ws/maven-gpg-plugin/target/local-repo/org/apache/maven/plugins/maven-changes-plugin/2.13-SNAPSHOT/maven-changes-plugin-2.13-SNAPSHOT.pom>
[INFO] Installing <https://builds.apache.org/job/maven-plugins-ITs-m3/ws/maven-changes-plugin/target/maven-changes-plugin-2.13-SNAPSHOT.jar> to <https://builds.apache.org/job/maven-plugins-ITs-m3/ws/maven-gpg-plugin/target/local-repo/org/apache/maven/plugins/maven-changes-plugin/2.13-SNAPSHOT/maven-changes-plugin-2.13-SNAPSHOT.jar>
[INFO] Installing <https://builds.apache.org/job/maven-plugins-ITs-m3/ws/maven-changes-plugin/pom.xml> to <https://builds.apache.org/job/maven-plugins-ITs-m3/ws/maven-gpg-plugin/target/local-repo/org/apache/maven/plugins/maven-changes-plugin/2.13-SNAPSHOT/maven-changes-plugin-2.13-SNAPSHOT.pom>
[INFO] Installing <https://builds.apache.org/job/maven-plugins-ITs-m3/ws/maven-clean-plugin/pom.xml> to <https://builds.apache.org/job/maven-plugins-ITs-m3/ws/maven-gpg-plugin/target/local-repo/org/apache/maven/plugins/maven-clean-plugin/3.0.1-SNAPSHOT/maven-clean-plugin-3.0.1-SNAPSHOT.pom>
[INFO] Installing <https://builds.apache.org/job/maven-plugins-ITs-m3/ws/maven-clean-plugin/target/maven-clean-plugin-3.0.1-SNAPSHOT.jar> to <https://builds.apache.org/job/maven-plugins-ITs-m3/ws/maven-gpg-plugin/target/local-repo/org/apache/maven/plugins/maven-clean-plugin/3.0.1-SNAPSHOT/maven-clean-plugin-3.0.1-SNAPSHOT.jar>
[INFO] Installing <https://builds.apache.org/job/maven-plugins-ITs-m3/ws/maven-clean-plugin/pom.xml> to <https://builds.apache.org/job/maven-plugins-ITs-m3/ws/maven-gpg-plugin/target/local-repo/org/apache/maven/plugins/maven-clean-plugin/3.0.1-SNAPSHOT/maven-clean-plugin-3.0.1-SNAPSHOT.pom>
[INFO] Installing <https://builds.apache.org/job/maven-plugins-ITs-m3/ws/maven-compiler-plugin/pom.xml> to <https://builds.apache.org/job/maven-plugins-ITs-m3/ws/maven-gpg-plugin/target/local-repo/org/apache/maven/plugins/maven-compiler-plugin/3.6-SNAPSHOT/maven-compiler-plugin-3.6-SNAPSHOT.pom>
[INFO] Installing <https://builds.apache.org/job/maven-plugins-ITs-m3/ws/maven-compiler-plugin/target/maven-compiler-plugin-3.6-SNAPSHOT.jar> to <https://builds.apache.org/job/maven-plugins-ITs-m3/ws/maven-gpg-plugin/target/local-repo/org/apache/maven/plugins/maven-compiler-plugin/3.6-SNAPSHOT/maven-compiler-plugin-3.6-SNAPSHOT.jar>
[INFO] Installing <https://builds.apache.org/job/maven-plugins-ITs-m3/ws/maven-compiler-plugin/pom.xml> to <https://builds.apache.org/job/maven-plugins-ITs-m3/ws/maven-gpg-plugin/target/local-repo/org/apache/maven/plugins/maven-compiler-plugin/3.6-SNAPSHOT/maven-compiler-plugin-3.6-SNAPSHOT.pom>
[INFO] Installing <https://builds.apache.org/job/maven-plugins-ITs-m3/ws/maven-deploy-plugin/pom.xml> to <https://builds.apache.org/job/maven-plugins-ITs-m3/ws/maven-gpg-plugin/target/local-repo/org/apache/maven/plugins/maven-deploy-plugin/3.0-SNAPSHOT/maven-deploy-plugin-3.0-SNAPSHOT.pom>
[INFO] Installing <https://builds.apache.org/job/maven-plugins-ITs-m3/ws/maven-deploy-plugin/target/maven-deploy-plugin-3.0-SNAPSHOT.jar> to <https://builds.apache.org/job/maven-plugins-ITs-m3/ws/maven-gpg-plugin/target/local-repo/org/apache/maven/plugins/maven-deploy-plugin/3.0-SNAPSHOT/maven-deploy-plugin-3.0-SNAPSHOT.jar>
[INFO] Installing <https://builds.apache.org/job/maven-plugins-ITs-m3/ws/maven-deploy-plugin/pom.xml> to <https://builds.apache.org/job/maven-plugins-ITs-m3/ws/maven-gpg-plugin/target/local-repo/org/apache/maven/plugins/maven-deploy-plugin/3.0-SNAPSHOT/maven-deploy-plugin-3.0-SNAPSHOT.pom>
[INFO] Installing <https://builds.apache.org/job/maven-plugins-ITs-m3/ws/maven-docck-plugin/pom.xml> to <https://builds.apache.org/job/maven-plugins-ITs-m3/ws/maven-gpg-plugin/target/local-repo/org/apache/maven/plugins/maven-docck-plugin/1.2-SNAPSHOT/maven-docck-plugin-1.2-SNAPSHOT.pom>
[INFO] Installing <https://builds.apache.org/job/maven-plugins-ITs-m3/ws/maven-docck-plugin/target/maven-docck-plugin-1.2-SNAPSHOT.jar> to <https://builds.apache.org/job/maven-plugins-ITs-m3/ws/maven-gpg-plugin/target/local-repo/org/apache/maven/plugins/maven-docck-plugin/1.2-SNAPSHOT/maven-docck-plugin-1.2-SNAPSHOT.jar>
[INFO] Installing <https://builds.apache.org/job/maven-plugins-ITs-m3/ws/maven-docck-plugin/pom.xml> to <https://builds.apache.org/job/maven-plugins-ITs-m3/ws/maven-gpg-plugin/target/local-repo/org/apache/maven/plugins/maven-docck-plugin/1.2-SNAPSHOT/maven-docck-plugin-1.2-SNAPSHOT.pom>
[INFO] Installing <https://builds.apache.org/job/maven-plugins-ITs-m3/ws/maven-ear-plugin/pom.xml> to <https://builds.apache.org/job/maven-plugins-ITs-m3/ws/maven-gpg-plugin/target/local-repo/org/apache/maven/plugins/maven-ear-plugin/2.10.2-SNAPSHOT/maven-ear-plugin-2.10.2-SNAPSHOT.pom>
[INFO] Installing <https://builds.apache.org/job/maven-plugins-ITs-m3/ws/maven-ear-plugin/target/maven-ear-plugin-2.10.2-SNAPSHOT.jar> to <https://builds.apache.org/job/maven-plugins-ITs-m3/ws/maven-gpg-plugin/target/local-repo/org/apache/maven/plugins/maven-ear-plugin/2.10.2-SNAPSHOT/maven-ear-plugin-2.10.2-SNAPSHOT.jar>
[INFO] Installing <https://builds.apache.org/job/maven-plugins-ITs-m3/ws/maven-ear-plugin/pom.xml> to <https://builds.apache.org/job/maven-plugins-ITs-m3/ws/maven-gpg-plugin/target/local-repo/org/apache/maven/plugins/maven-ear-plugin/2.10.2-SNAPSHOT/maven-ear-plugin-2.10.2-SNAPSHOT.pom>
[INFO] Installing <https://builds.apache.org/job/maven-plugins-ITs-m3/ws/maven-ejb-plugin/pom.xml> to <https://builds.apache.org/job/maven-plugins-ITs-m3/ws/maven-gpg-plugin/target/local-repo/org/apache/maven/plugins/maven-ejb-plugin/2.5.2-SNAPSHOT/maven-ejb-plugin-2.5.2-SNAPSHOT.pom>
[INFO] Installing <https://builds.apache.org/job/maven-plugins-ITs-m3/ws/maven-ejb-plugin/target/maven-ejb-plugin-2.5.2-SNAPSHOT.jar> to <https://builds.apache.org/job/maven-plugins-ITs-m3/ws/maven-gpg-plugin/target/local-repo/org/apache/maven/plugins/maven-ejb-plugin/2.5.2-SNAPSHOT/maven-ejb-plugin-2.5.2-SNAPSHOT.jar>
[INFO] Installing <https://builds.apache.org/job/maven-plugins-ITs-m3/ws/maven-ejb-plugin/pom.xml> to <https://builds.apache.org/job/maven-plugins-ITs-m3/ws/maven-gpg-plugin/target/local-repo/org/apache/maven/plugins/maven-ejb-plugin/2.5.2-SNAPSHOT/maven-ejb-plugin-2.5.2-SNAPSHOT.pom>
[INFO] Installing <https://builds.apache.org/job/maven-plugins-ITs-m3/ws/maven-help-plugin/pom.xml> to <https://builds.apache.org/job/maven-plugins-ITs-m3/ws/maven-gpg-plugin/target/local-repo/org/apache/maven/plugins/maven-help-plugin/2.2.1-SNAPSHOT/maven-help-plugin-2.2.1-SNAPSHOT.pom>
[INFO] Installing <https://builds.apache.org/job/maven-plugins-ITs-m3/ws/maven-help-plugin/target/maven-help-plugin-2.2.1-SNAPSHOT.jar> to <https://builds.apache.org/job/maven-plugins-ITs-m3/ws/maven-gpg-plugin/target/local-repo/org/apache/maven/plugins/maven-help-plugin/2.2.1-SNAPSHOT/maven-help-plugin-2.2.1-SNAPSHOT.jar>
[INFO] Installing <https://builds.apache.org/job/maven-plugins-ITs-m3/ws/maven-help-plugin/pom.xml> to <https://builds.apache.org/job/maven-plugins-ITs-m3/ws/maven-gpg-plugin/target/local-repo/org/apache/maven/plugins/maven-help-plugin/2.2.1-SNAPSHOT/maven-help-plugin-2.2.1-SNAPSHOT.pom>
[INFO] Installing <https://builds.apache.org/job/maven-plugins-ITs-m3/ws/maven-install-plugin/pom.xml> to <https://builds.apache.org/job/maven-plugins-ITs-m3/ws/maven-gpg-plugin/target/local-repo/org/apache/maven/plugins/maven-install-plugin/3.0-SNAPSHOT/maven-install-plugin-3.0-SNAPSHOT.pom>
[INFO] Installing <https://builds.apache.org/job/maven-plugins-ITs-m3/ws/maven-install-plugin/target/maven-install-plugin-3.0-SNAPSHOT.jar> to <https://builds.apache.org/job/maven-plugins-ITs-m3/ws/maven-gpg-plugin/target/local-repo/org/apache/maven/plugins/maven-install-plugin/3.0-SNAPSHOT/maven-install-plugin-3.0-SNAPSHOT.jar>
[INFO] Installing <https://builds.apache.org/job/maven-plugins-ITs-m3/ws/maven-install-plugin/pom.xml> to <https://builds.apache.org/job/maven-plugins-ITs-m3/ws/maven-gpg-plugin/target/local-repo/org/apache/maven/plugins/maven-install-plugin/3.0-SNAPSHOT/maven-install-plugin-3.0-SNAPSHOT.pom>
[INFO] Installing <https://builds.apache.org/job/maven-plugins-ITs-m3/ws/maven-jarsigner-plugin/pom.xml> to <https://builds.apache.org/job/maven-plugins-ITs-m3/ws/maven-gpg-plugin/target/local-repo/org/apache/maven/plugins/maven-jarsigner-plugin/1.5-SNAPSHOT/maven-jarsigner-plugin-1.5-SNAPSHOT.pom>
[INFO] Installing <https://builds.apache.org/job/maven-plugins-ITs-m3/ws/maven-jarsigner-plugin/target/maven-jarsigner-plugin-1.5-SNAPSHOT.jar> to <https://builds.apache.org/job/maven-plugins-ITs-m3/ws/maven-gpg-plugin/target/local-repo/org/apache/maven/plugins/maven-jarsigner-plugin/1.5-SNAPSHOT/maven-jarsigner-plugin-1.5-SNAPSHOT.jar>
[INFO] Installing <https://builds.apache.org/job/maven-plugins-ITs-m3/ws/maven-jarsigner-plugin/pom.xml> to <https://builds.apache.org/job/maven-plugins-ITs-m3/ws/maven-gpg-plugin/target/local-repo/org/apache/maven/plugins/maven-jarsigner-plugin/1.5-SNAPSHOT/maven-jarsigner-plugin-1.5-SNAPSHOT.pom>
[INFO] Installing <https://builds.apache.org/job/maven-plugins-ITs-m3/ws/maven-javadoc-plugin/pom.xml> to <https://builds.apache.org/job/maven-plugins-ITs-m3/ws/maven-gpg-plugin/target/local-repo/org/apache/maven/plugins/maven-javadoc-plugin/2.10.4-SNAPSHOT/maven-javadoc-plugin-2.10.4-SNAPSHOT.pom>
[INFO]                                                                         
[INFO] ------------------------------------------------------------------------
[INFO] Building Apache Maven Plugins Aggregator 1-SNAPSHOT
[INFO] ------------------------------------------------------------------------
[INFO] 
[INFO] --- maven-clean-plugin:2.5:clean (default-clean) @ maven-plugins-aggregator ---
[INFO] Deleting <https://builds.apache.org/job/maven-plugins-ITs-m3/ws/target>
[INFO] 
[INFO] --- maven-enforcer-plugin:1.3.1:enforce (enforce-bytecode-version) @ maven-plugins-aggregator ---
[INFO] 
[INFO] --- maven-enforcer-plugin:1.3.1:enforce (ban-known-bad-maven-versions) @ maven-plugins-aggregator ---
[INFO] 
[INFO] --- maven-remote-resources-plugin:1.5:process (default) @ maven-plugins-aggregator ---
[INFO] 
[INFO] --- maven-site-plugin:3.3:attach-descriptor (attach-descriptor) @ maven-plugins-aggregator ---
[INFO] 
[INFO] --- maven-install-plugin:2.5.1:install (default-install) @ maven-plugins-aggregator ---
[INFO] Installing <https://builds.apache.org/job/maven-plugins-ITs-m3/ws/pom.xml> to /home/jenkins/.m2/repository/org/apache/maven/plugins/maven-plugins-aggregator/1-SNAPSHOT/maven-plugins-aggregator-1-SNAPSHOT.pom
[INFO] ------------------------------------------------------------------------
[INFO] Reactor Summary:
[INFO] 
[INFO] Apache Maven ACR Plugin ........................... SUCCESS [ 31.893 s]
[INFO] Apache Maven Ant Plugin ........................... SUCCESS [01:21 min]
[INFO] Apache Maven AntRun Plugin ........................ SUCCESS [ 55.498 s]
[INFO] Apache Maven Changelog Plugin ..................... SUCCESS [ 48.375 s]
[INFO] Apache Maven Changes Plugin ....................... SUCCESS [01:00 min]
[INFO] Apache Maven Clean Plugin ......................... SUCCESS [ 24.571 s]
[INFO] Apache Maven Compiler Plugin ...................... SUCCESS [02:15 min]
[INFO] Apache Maven Deploy Plugin ........................ SUCCESS [01:50 min]
[INFO] Apache Maven Documentation Checker Plugin ......... SUCCESS [  5.785 s]
[INFO] Apache Maven EAR Plugin ........................... SUCCESS [05:37 min]
[INFO] Apache Maven EJB Plugin ........................... SUCCESS [ 44.369 s]
[INFO] Apache Maven Help Plugin .......................... SUCCESS [ 49.284 s]
[INFO] Apache Maven Install Plugin ....................... SUCCESS [01:19 min]
[INFO] Apache Maven Jarsigner Plugin ..................... SUCCESS [ 39.552 s]
[INFO] Apache Maven Javadoc Plugin ....................... FAILURE [01:36 min]
[INFO] Apache Maven Linkcheck Plugin ..................... FAILURE [  2.764 s]
[INFO] Apache Maven Patch Plugin ......................... FAILURE [  0.607 s]
[INFO] Apache Maven PDF Plugin ........................... FAILURE [ 12.837 s]
[INFO] Apache Maven RAR Plugin ........................... FAILURE [  4.144 s]
[INFO] Apache Maven Repository Plugin .................... FAILURE [  4.593 s]
[INFO] Apache Maven Resources Plugin ..................... FAILURE [  6.878 s]
[INFO] Apache Maven Site Plugin .......................... FAILURE [ 12.446 s]
[INFO] Apache Maven Source Plugin ........................ FAILURE [  5.964 s]
[INFO] Apache Maven Stage Plugin ......................... FAILURE [  1.981 s]
[INFO] Apache Maven Toolchains Plugin .................... FAILURE [  1.617 s]
[INFO] Apache Maven Verifier Plugin ...................... FAILURE [  1.208 s]
[INFO] Apache Maven WAR Plugin ........................... FAILURE [ 15.114 s]
[INFO] Apache Maven DOAP Plugin .......................... FAILURE [  5.444 s]
[INFO] Apache Maven PMD Plugin ........................... FAILURE [ 19.491 s]
[INFO] Apache Maven Invoker Plugin ....................... FAILURE [  8.965 s]
[INFO] Apache Maven JAR Plugin ........................... FAILURE [  3.212 s]
[INFO] Apache Maven Project Info Reports Plugin .......... FAILURE [ 18.089 s]
[INFO] Apache Maven Remote Resources Plugin .............. FAILURE [  5.333 s]
[INFO] Apache Maven Shade Plugin ......................... FAILURE [  7.034 s]
[INFO] Apache Maven SCM Publish Plugin ................... FAILURE [  4.326 s]
[INFO] Apache Maven Assembly Plugin ...................... FAILURE [ 18.556 s]
[INFO] Apache Maven Dependency Plugin .................... FAILURE [01:08 min]
[INFO] Apache Maven GPG Plugin ........................... FAILURE [  1.076 s]
[INFO] Apache Maven Plugins Aggregator ................... SUCCESS [  0.606 s]
[INFO] ------------------------------------------------------------------------
[INFO] BUILD FAILURE
[INFO] ------------------------------------------------------------------------
[INFO] Total time: 23:52 min
[INFO] Finished at: 2016-05-04T20:42:53+00:00
[INFO] Final Memory: 89M/359M
[INFO] ------------------------------------------------------------------------
[WARNING] The requested profile "apache.snapshots" could not be activated because it does not exist.
[ERROR] Failed to execute goal org.apache.maven.plugins:maven-surefire-plugin:2.18.1:test (default-test) on project maven-javadoc-plugin: There are test failures.
[ERROR] 
[ERROR] Please refer to <https://builds.apache.org/job/maven-plugins-ITs-m3/ws/maven-javadoc-plugin/target/surefire-reports> for the individual test results.
[ERROR] -> [Help 1]
[ERROR] Failed to execute goal org.apache.maven.plugins:maven-invoker-plugin:2.0.0:install (integration-test) on project maven-linkcheck-plugin: Failed to install project dependencies: MavenProject: org.apache.maven.plugins:maven-linkcheck-plugin:1.3-SNAPSHOT @ <https://builds.apache.org/job/maven-plugins-ITs-m3/ws/maven-linkcheck-plugin/pom.xml>: Failed to install project artifacts: MavenProject: org.apache.maven.plugins:maven-javadoc-plugin:2.10.4-SNAPSHOT @ <https://builds.apache.org/job/maven-plugins-ITs-m3/ws/maven-javadoc-plugin/pom.xml>: Failed to install artifact: org.apache.maven.plugins:maven-javadoc-plugin:maven-plugin:2.10.4-SNAPSHOT: Artifact is not fully assembled: <https://builds.apache.org/job/maven-plugins-ITs-m3/ws/maven-javadoc-plugin/target/classes> -> [Help 2]
[ERROR] Failed to execute goal org.apache.maven.plugins:maven-invoker-plugin:2.0.0:install (integration-test) on project maven-patch-plugin: Failed to install project dependencies: MavenProject: org.apache.maven.plugins:maven-patch-plugin:1.3-SNAPSHOT @ <https://builds.apache.org/job/maven-plugins-ITs-m3/ws/maven-patch-plugin/pom.xml>: Failed to install project artifacts: MavenProject: org.apache.maven.plugins:maven-javadoc-plugin:2.10.4-SNAPSHOT @ <https://builds.apache.org/job/maven-plugins-ITs-m3/ws/maven-javadoc-plugin/pom.xml>: Failed to install artifact: org.apache.maven.plugins:maven-javadoc-plugin:maven-plugin:2.10.4-SNAPSHOT: Artifact is not fully assembled: <https://builds.apache.org/job/maven-plugins-ITs-m3/ws/maven-javadoc-plugin/target/classes> -> [Help 2]
[ERROR] Failed to execute goal org.apache.maven.plugins:maven-invoker-plugin:2.0.0:install (integration-test) on project maven-pdf-plugin: Failed to install project dependencies: MavenProject: org.apache.maven.plugins:maven-pdf-plugin:1.4-SNAPSHOT @ <https://builds.apache.org/job/maven-plugins-ITs-m3/ws/maven-pdf-plugin/pom.xml>: Failed to install project artifacts: MavenProject: org.apache.maven.plugins:maven-javadoc-plugin:2.10.4-SNAPSHOT @ <https://builds.apache.org/job/maven-plugins-ITs-m3/ws/maven-javadoc-plugin/pom.xml>: Failed to install artifact: org.apache.maven.plugins:maven-javadoc-plugin:maven-plugin:2.10.4-SNAPSHOT: Artifact is not fully assembled: <https://builds.apache.org/job/maven-plugins-ITs-m3/ws/maven-javadoc-plugin/target/classes> -> [Help 2]
[ERROR] Failed to execute goal org.apache.maven.plugins:maven-invoker-plugin:2.0.0:install (integration-test) on project maven-rar-plugin: Failed to install project dependencies: MavenProject: org.apache.maven.plugins:maven-rar-plugin:3.0.0-SNAPSHOT @ <https://builds.apache.org/job/maven-plugins-ITs-m3/ws/maven-rar-plugin/pom.xml>: Failed to install project artifacts: MavenProject: org.apache.maven.plugins:maven-javadoc-plugin:2.10.4-SNAPSHOT @ <https://builds.apache.org/job/maven-plugins-ITs-m3/ws/maven-javadoc-plugin/pom.xml>: Failed to install artifact: org.apache.maven.plugins:maven-javadoc-plugin:maven-plugin:2.10.4-SNAPSHOT: Artifact is not fully assembled: <https://builds.apache.org/job/maven-plugins-ITs-m3/ws/maven-javadoc-plugin/target/classes> -> [Help 2]
[ERROR] Failed to execute goal org.apache.maven.plugins:maven-invoker-plugin:2.0.0:install (integration-test) on project maven-repository-plugin: Failed to install project dependencies: MavenProject: org.apache.maven.plugins:maven-repository-plugin:2.5-SNAPSHOT @ <https://builds.apache.org/job/maven-plugins-ITs-m3/ws/maven-repository-plugin/pom.xml>: Failed to install project artifacts: MavenProject: org.apache.maven.plugins:maven-javadoc-plugin:2.10.4-SNAPSHOT @ <https://builds.apache.org/job/maven-plugins-ITs-m3/ws/maven-javadoc-plugin/pom.xml>: Failed to install artifact: org.apache.maven.plugins:maven-javadoc-plugin:maven-plugin:2.10.4-SNAPSHOT: Artifact is not fully assembled: <https://builds.apache.org/job/maven-plugins-ITs-m3/ws/maven-javadoc-plugin/target/classes> -> [Help 2]
[ERROR] Failed to execute goal org.apache.maven.plugins:maven-invoker-plugin:2.0.0:install (integration-test) on project maven-resources-plugin: Failed to install project dependencies: MavenProject: org.apache.maven.plugins:maven-resources-plugin:2.8-SNAPSHOT @ <https://builds.apache.org/job/maven-plugins-ITs-m3/ws/maven-resources-plugin/pom.xml>: Failed to install project artifacts: MavenProject: org.apache.maven.plugins:maven-javadoc-plugin:2.10.4-SNAPSHOT @ <https://builds.apache.org/job/maven-plugins-ITs-m3/ws/maven-javadoc-plugin/pom.xml>: Failed to install artifact: org.apache.maven.plugins:maven-javadoc-plugin:maven-plugin:2.10.4-SNAPSHOT: Artifact is not fully assembled: <https://builds.apache.org/job/maven-plugins-ITs-m3/ws/maven-javadoc-plugin/target/classes> -> [Help 2]
[ERROR] Failed to execute goal org.apache.maven.plugins:maven-invoker-plugin:2.0.0:install (integration-test) on project maven-site-plugin: Failed to install project dependencies: MavenProject: org.apache.maven.plugins:maven-site-plugin:3.6-SNAPSHOT @ <https://builds.apache.org/job/maven-plugins-ITs-m3/ws/maven-site-plugin/dependency-reduced-pom.xml>: Failed to install project artifacts: MavenProject: org.apache.maven.plugins:maven-javadoc-plugin:2.10.4-SNAPSHOT @ <https://builds.apache.org/job/maven-plugins-ITs-m3/ws/maven-javadoc-plugin/pom.xml>: Failed to install artifact: org.apache.maven.plugins:maven-javadoc-plugin:maven-plugin:2.10.4-SNAPSHOT: Artifact is not fully assembled: <https://builds.apache.org/job/maven-plugins-ITs-m3/ws/maven-javadoc-plugin/target/classes> -> [Help 2]
[ERROR] Failed to execute goal org.apache.maven.plugins:maven-invoker-plugin:2.0.0:install (integration-test) on project maven-source-plugin: Failed to install project dependencies: MavenProject: org.apache.maven.plugins:maven-source-plugin:3.0.1-SNAPSHOT @ <https://builds.apache.org/job/maven-plugins-ITs-m3/ws/maven-source-plugin/pom.xml>: Failed to install project artifacts: MavenProject: org.apache.maven.plugins:maven-javadoc-plugin:2.10.4-SNAPSHOT @ <https://builds.apache.org/job/maven-plugins-ITs-m3/ws/maven-javadoc-plugin/pom.xml>: Failed to install artifact: org.apache.maven.plugins:maven-javadoc-plugin:maven-plugin:2.10.4-SNAPSHOT: Artifact is not fully assembled: <https://builds.apache.org/job/maven-plugins-ITs-m3/ws/maven-javadoc-plugin/target/classes> -> [Help 2]
[ERROR] Failed to execute goal org.apache.maven.plugins:maven-invoker-plugin:2.0.0:install (integration-test) on project maven-stage-plugin: Failed to install project dependencies: MavenProject: org.apache.maven.plugins:maven-stage-plugin:1.1-SNAPSHOT @ <https://builds.apache.org/job/maven-plugins-ITs-m3/ws/maven-stage-plugin/pom.xml>: Failed to install project artifacts: MavenProject: org.apache.maven.plugins:maven-javadoc-plugin:2.10.4-SNAPSHOT @ <https://builds.apache.org/job/maven-plugins-ITs-m3/ws/maven-javadoc-plugin/pom.xml>: Failed to install artifact: org.apache.maven.plugins:maven-javadoc-plugin:maven-plugin:2.10.4-SNAPSHOT: Artifact is not fully assembled: <https://builds.apache.org/job/maven-plugins-ITs-m3/ws/maven-javadoc-plugin/target/classes> -> [Help 2]
[ERROR] Failed to execute goal org.apache.maven.plugins:maven-invoker-plugin:2.0.0:install (integration-test) on project maven-toolchains-plugin: Failed to install project dependencies: MavenProject: org.apache.maven.plugins:maven-toolchains-plugin:1.2-SNAPSHOT @ <https://builds.apache.org/job/maven-plugins-ITs-m3/ws/maven-toolchains-plugin/pom.xml>: Failed to install project artifacts: MavenProject: org.apache.maven.plugins:maven-javadoc-plugin:2.10.4-SNAPSHOT @ <https://builds.apache.org/job/maven-plugins-ITs-m3/ws/maven-javadoc-plugin/pom.xml>: Failed to install artifact: org.apache.maven.plugins:maven-javadoc-plugin:maven-plugin:2.10.4-SNAPSHOT: Artifact is not fully assembled: <https://builds.apache.org/job/maven-plugins-ITs-m3/ws/maven-javadoc-plugin/target/classes> -> [Help 2]
[ERROR] Failed to execute goal org.apache.maven.plugins:maven-invoker-plugin:2.0.0:install (integration-test) on project maven-verifier-plugin: Failed to install project dependencies: MavenProject: org.apache.maven.plugins:maven-verifier-plugin:3.0.0-SNAPSHOT @ <https://builds.apache.org/job/maven-plugins-ITs-m3/ws/maven-verifier-plugin/pom.xml>: Failed to install project artifacts: MavenProject: org.apache.maven.plugins:maven-javadoc-plugin:2.10.4-SNAPSHOT @ <https://builds.apache.org/job/maven-plugins-ITs-m3/ws/maven-javadoc-plugin/pom.xml>: Failed to install artifact: org.apache.maven.plugins:maven-javadoc-plugin:maven-plugin:2.10.4-SNAPSHOT: Artifact is not fully assembled: <https://builds.apache.org/job/maven-plugins-ITs-m3/ws/maven-javadoc-plugin/target/classes> -> [Help 2]
[ERROR] Failed to execute goal org.apache.maven.plugins:maven-invoker-plugin:2.0.0:install (integration-test) on project maven-war-plugin: Failed to install project dependencies: MavenProject: org.apache.maven.plugins:maven-war-plugin:3.0.0-SNAPSHOT @ <https://builds.apache.org/job/maven-plugins-ITs-m3/ws/maven-war-plugin/pom.xml>: Failed to install project artifacts: MavenProject: org.apache.maven.plugins:maven-javadoc-plugin:2.10.4-SNAPSHOT @ <https://builds.apache.org/job/maven-plugins-ITs-m3/ws/maven-javadoc-plugin/pom.xml>: Failed to install artifact: org.apache.maven.plugins:maven-javadoc-plugin:maven-plugin:2.10.4-SNAPSHOT: Artifact is not fully assembled: <https://builds.apache.org/job/maven-plugins-ITs-m3/ws/maven-javadoc-plugin/target/classes> -> [Help 2]
[ERROR] Failed to execute goal org.apache.maven.plugins:maven-invoker-plugin:2.0.0:install (integration-test) on project maven-doap-plugin: Failed to install project dependencies: MavenProject: org.apache.maven.plugins:maven-doap-plugin:1.3-SNAPSHOT @ <https://builds.apache.org/job/maven-plugins-ITs-m3/ws/maven-doap-plugin/pom.xml>: Failed to install project artifacts: MavenProject: org.apache.maven.plugins:maven-javadoc-plugin:2.10.4-SNAPSHOT @ <https://builds.apache.org/job/maven-plugins-ITs-m3/ws/maven-javadoc-plugin/pom.xml>: Failed to install artifact: org.apache.maven.plugins:maven-javadoc-plugin:maven-plugin:2.10.4-SNAPSHOT: Artifact is not fully assembled: <https://builds.apache.org/job/maven-plugins-ITs-m3/ws/maven-javadoc-plugin/target/classes> -> [Help 2]
[ERROR] Failed to execute goal org.apache.maven.plugins:maven-invoker-plugin:2.0.0:install (integration-test) on project maven-pmd-plugin: Failed to install project dependencies: MavenProject: org.apache.maven.plugins:maven-pmd-plugin:3.7-SNAPSHOT @ <https://builds.apache.org/job/maven-plugins-ITs-m3/ws/maven-pmd-plugin/pom.xml>: Failed to install project artifacts: MavenProject: org.apache.maven.plugins:maven-javadoc-plugin:2.10.4-SNAPSHOT @ <https://builds.apache.org/job/maven-plugins-ITs-m3/ws/maven-javadoc-plugin/pom.xml>: Failed to install artifact: org.apache.maven.plugins:maven-javadoc-plugin:maven-plugin:2.10.4-SNAPSHOT: Artifact is not fully assembled: <https://builds.apache.org/job/maven-plugins-ITs-m3/ws/maven-javadoc-plugin/target/classes> -> [Help 2]
[ERROR] Failed to execute goal org.apache.maven.plugins:maven-invoker-plugin:2.0.0:install (integration-test) on project maven-invoker-plugin: Failed to install project dependencies: MavenProject: org.apache.maven.plugins:maven-invoker-plugin:2.0.1-SNAPSHOT @ <https://builds.apache.org/job/maven-plugins-ITs-m3/ws/maven-invoker-plugin/pom.xml>: Failed to install project artifacts: MavenProject: org.apache.maven.plugins:maven-javadoc-plugin:2.10.4-SNAPSHOT @ <https://builds.apache.org/job/maven-plugins-ITs-m3/ws/maven-javadoc-plugin/pom.xml>: Failed to install artifact: org.apache.maven.plugins:maven-javadoc-plugin:maven-plugin:2.10.4-SNAPSHOT: Artifact is not fully assembled: <https://builds.apache.org/job/maven-plugins-ITs-m3/ws/maven-javadoc-plugin/target/classes> -> [Help 2]
[ERROR] Failed to execute goal org.apache.maven.plugins:maven-invoker-plugin:2.0.0:install (integration-test) on project maven-jar-plugin: Failed to install project dependencies: MavenProject: org.apache.maven.plugins:maven-jar-plugin:3.0.1-SNAPSHOT @ <https://builds.apache.org/job/maven-plugins-ITs-m3/ws/maven-jar-plugin/pom.xml>: Failed to install project artifacts: MavenProject: org.apache.maven.plugins:maven-javadoc-plugin:2.10.4-SNAPSHOT @ <https://builds.apache.org/job/maven-plugins-ITs-m3/ws/maven-javadoc-plugin/pom.xml>: Failed to install artifact: org.apache.maven.plugins:maven-javadoc-plugin:maven-plugin:2.10.4-SNAPSHOT: Artifact is not fully assembled: <https://builds.apache.org/job/maven-plugins-ITs-m3/ws/maven-javadoc-plugin/target/classes> -> [Help 2]
[ERROR] Failed to execute goal org.apache.maven.plugins:maven-invoker-plugin:2.0.0:install (integration-test) on project maven-project-info-reports-plugin: Failed to install project dependencies: MavenProject: org.apache.maven.plugins:maven-project-info-reports-plugin:2.10-SNAPSHOT @ <https://builds.apache.org/job/maven-plugins-ITs-m3/ws/maven-project-info-reports-plugin/pom.xml>: Failed to install project artifacts: MavenProject: org.apache.maven.plugins:maven-javadoc-plugin:2.10.4-SNAPSHOT @ <https://builds.apache.org/job/maven-plugins-ITs-m3/ws/maven-javadoc-plugin/pom.xml>: Failed to install artifact: org.apache.maven.plugins:maven-javadoc-plugin:maven-plugin:2.10.4-SNAPSHOT: Artifact is not fully assembled: <https://builds.apache.org/job/maven-plugins-ITs-m3/ws/maven-javadoc-plugin/target/classes> -> [Help 2]
[ERROR] Failed to execute goal org.apache.maven.plugins:maven-invoker-plugin:2.0.0:install (integration-test) on project maven-remote-resources-plugin: Failed to install project dependencies: MavenProject: org.apache.maven.plugins:maven-remote-resources-plugin:1.6-SNAPSHOT @ <https://builds.apache.org/job/maven-plugins-ITs-m3/ws/maven-remote-resources-plugin/pom.xml>: Failed to install project artifacts: MavenProject: org.apache.maven.plugins:maven-javadoc-plugin:2.10.4-SNAPSHOT @ <https://builds.apache.org/job/maven-plugins-ITs-m3/ws/maven-javadoc-plugin/pom.xml>: Failed to install artifact: org.apache.maven.plugins:maven-javadoc-plugin:maven-plugin:2.10.4-SNAPSHOT: Artifact is not fully assembled: <https://builds.apache.org/job/maven-plugins-ITs-m3/ws/maven-javadoc-plugin/target/classes> -> [Help 2]
[ERROR] Failed to execute goal org.apache.maven.plugins:maven-invoker-plugin:2.0.0:install (integration-test) on project maven-shade-plugin: Failed to install project dependencies: MavenProject: org.apache.maven.plugins:maven-shade-plugin:3.0-SNAPSHOT @ <https://builds.apache.org/job/maven-plugins-ITs-m3/ws/maven-shade-plugin/pom.xml>: Failed to install project artifacts: MavenProject: org.apache.maven.plugins:maven-javadoc-plugin:2.10.4-SNAPSHOT @ <https://builds.apache.org/job/maven-plugins-ITs-m3/ws/maven-javadoc-plugin/pom.xml>: Failed to install artifact: org.apache.maven.plugins:maven-javadoc-plugin:maven-plugin:2.10.4-SNAPSHOT: Artifact is not fully assembled: <https://builds.apache.org/job/maven-plugins-ITs-m3/ws/maven-javadoc-plugin/target/classes> -> [Help 2]
[ERROR] Failed to execute goal org.apache.maven.plugins:maven-invoker-plugin:2.0.0:install (integration-test) on project maven-scm-publish-plugin: Failed to install project dependencies: MavenProject: org.apache.maven.plugins:maven-scm-publish-plugin:1.2-SNAPSHOT @ <https://builds.apache.org/job/maven-plugins-ITs-m3/ws/maven-scm-publish-plugin/pom.xml>: Failed to install project artifacts: MavenProject: org.apache.maven.plugins:maven-javadoc-plugin:2.10.4-SNAPSHOT @ <https://builds.apache.org/job/maven-plugins-ITs-m3/ws/maven-javadoc-plugin/pom.xml>: Failed to install artifact: org.apache.maven.plugins:maven-javadoc-plugin:maven-plugin:2.10.4-SNAPSHOT: Artifact is not fully assembled: <https://builds.apache.org/job/maven-plugins-ITs-m3/ws/maven-javadoc-plugin/target/classes> -> [Help 2]
[ERROR] Failed to execute goal org.apache.maven.plugins:maven-invoker-plugin:2.0.0:install (integration-test) on project maven-assembly-plugin: Failed to install project dependencies: MavenProject: org.apache.maven.plugins:maven-assembly-plugin:3.0-SNAPSHOT @ <https://builds.apache.org/job/maven-plugins-ITs-m3/ws/maven-assembly-plugin/pom.xml>: Failed to install project artifacts: MavenProject: org.apache.maven.plugins:maven-javadoc-plugin:2.10.4-SNAPSHOT @ <https://builds.apache.org/job/maven-plugins-ITs-m3/ws/maven-javadoc-plugin/pom.xml>: Failed to install artifact: org.apache.maven.plugins:maven-javadoc-plugin:maven-plugin:2.10.4-SNAPSHOT: Artifact is not fully assembled: <https://builds.apache.org/job/maven-plugins-ITs-m3/ws/maven-javadoc-plugin/target/classes> -> [Help 2]
[ERROR] Failed to execute goal org.apache.maven.plugins:maven-invoker-plugin:2.0.0:install (integration-test) on project maven-dependency-plugin: Failed to install project dependencies: MavenProject: org.apache.maven.plugins:maven-dependency-plugin:3.0-SNAPSHOT @ <https://builds.apache.org/job/maven-plugins-ITs-m3/ws/maven-dependency-plugin/pom.xml>: Failed to install project artifacts: MavenProject: org.apache.maven.plugins:maven-javadoc-plugin:2.10.4-SNAPSHOT @ <https://builds.apache.org/job/maven-plugins-ITs-m3/ws/maven-javadoc-plugin/pom.xml>: Failed to install artifact: org.apache.maven.plugins:maven-javadoc-plugin:maven-plugin:2.10.4-SNAPSHOT: Artifact is not fully assembled: <https://builds.apache.org/job/maven-plugins-ITs-m3/ws/maven-javadoc-plugin/target/classes> -> [Help 2]
[ERROR] Failed to execute goal org.apache.maven.plugins:maven-invoker-plugin:2.0.0:install (integration-test) on project maven-gpg-plugin: Failed to install project dependencies: MavenProject: org.apache.maven.plugins:maven-gpg-plugin:1.7-SNAPSHOT @ <https://builds.apache.org/job/maven-plugins-ITs-m3/ws/maven-gpg-plugin/pom.xml>: Failed to install project artifacts: MavenProject: org.apache.maven.plugins:maven-javadoc-plugin:2.10.4-SNAPSHOT @ <https://builds.apache.org/job/maven-plugins-ITs-m3/ws/maven-javadoc-plugin/pom.xml>: Failed to install artifact: org.apache.maven.plugins:maven-javadoc-plugin:maven-plugin:2.10.4-SNAPSHOT: Artifact is not fully assembled: <https://builds.apache.org/job/maven-plugins-ITs-m3/ws/maven-javadoc-plugin/target/classes> -> [Help 2]
[ERROR] 
[ERROR] To see the full stack trace of the errors, re-run Maven with the -e switch.
[ERROR] Re-run Maven using the -X switch to enable full debug logging.
[ERROR] 
[ERROR] For more information about the errors and possible solutions, please read the following articles:
[ERROR] [Help 1] http://cwiki.apache.org/confluence/display/MAVEN/MojoFailureException
[ERROR] [Help 2] http://cwiki.apache.org/confluence/display/MAVEN/MojoExecutionException
[ERROR] 
[ERROR] After correcting the problems, you can resume the build with the command
[ERROR]   mvn <goals> -rf :maven-javadoc-plugin
Build step 'Invoke top-level Maven targets' marked build as failure
Deleting 1 temporary files
Recording test results

Mime
View raw message