maven-notifications mailing list archives

Site index · List index
Message view « Date » · « Thread »
Top « Date » · « Thread »
From Apache Jenkins Server <jenk...@builds.apache.org>
Subject Build failed in Jenkins: maven-plugins-ITs-m3-windows #1562
Date Tue, 24 May 2016 23:26:25 GMT
See <https://builds.apache.org/job/maven-plugins-ITs-m3-windows/1562/changes>

Changes:

[khmarbaise] [MSCMPUB-21] Upgrade maven-scm to 1.9.4

------------------------------------------
[...truncated 12447 lines...]
[INFO] 
[INFO] --- maven-invoker-plugin:2.0.0:integration-test (integration-test) @ maven-dependency-plugin
---
[INFO] Building: setup-custom-ear-lifecycle\pom.xml
[INFO] ..SUCCESS (12.4 s)
[INFO] Building: analyze\pom.xml
[INFO] snapshot org.apache.maven.plugins:maven-dependency-plugin:3.0-SNAPSHOT: checking for
updates from apache.snapshots
[INFO] artifact org.apache.maven.plugins.maven-dependency-plugin:3.0-SNAPSHOT: checking for
updates from central
[INFO] ..FAILED (3.8 s)
[INFO]   The build exited with code 1. See F:\hudson\hudson-slave\workspace\maven-plugins-ITs-m3-windows\maven-dependency-plugin\target\it\analyze\build.log
for details.
[INFO] Building: analyze-dep-mgt\pom.xml
[INFO] ..FAILED (3.5 s)
[INFO]   The build exited with code 1. See F:\hudson\hudson-slave\workspace\maven-plugins-ITs-m3-windows\maven-dependency-plugin\target\it\analyze-dep-mgt\build.log
for details.
[INFO] Building: analyze-ignore-dependency\pom.xml
[INFO] ..FAILED (3.4 s)
[INFO]   The build exited with code 1. See F:\hudson\hudson-slave\workspace\maven-plugins-ITs-m3-windows\maven-dependency-plugin\target\it\analyze-ignore-dependency\build.log
for details.
[INFO] Building: analyze-ignore-unused-declared-dependency\pom.xml
[INFO] ..FAILED (3.1 s)
[INFO]   The build exited with code 1. See F:\hudson\hudson-slave\workspace\maven-plugins-ITs-m3-windows\maven-dependency-plugin\target\it\analyze-ignore-unused-declared-dependency\build.log
for details.
[INFO] Building: analyze-ignore-used-undeclared-dependency\pom.xml
[INFO] ..FAILED (3.0 s)
[INFO]   The build exited with code 1. See F:\hudson\hudson-slave\workspace\maven-plugins-ITs-m3-windows\maven-dependency-plugin\target\it\analyze-ignore-used-undeclared-dependency\build.log
for details.
[INFO] Building: analyze-multimodule-project\pom.xml
[INFO] ..FAILED (3.2 s)
[INFO]   The build exited with code 1. See F:\hudson\hudson-slave\workspace\maven-plugins-ITs-m3-windows\maven-dependency-plugin\target\it\analyze-multimodule-project\build.log
for details.
[INFO] Building: analyze-report\pom.xml
[INFO] ..FAILED (3.0 s)
[INFO]   The build exited with code 1. See F:\hudson\hudson-slave\workspace\maven-plugins-ITs-m3-windows\maven-dependency-plugin\target\it\analyze-report\build.log
for details.
[INFO] Building: build-classpath\pom.xml
[INFO] ..FAILED (3.0 s)
[INFO]   The build exited with code 1. See F:\hudson\hudson-slave\workspace\maven-plugins-ITs-m3-windows\maven-dependency-plugin\target\it\build-classpath\build.log
for details.
[INFO] Building: copy\pom.xml
[INFO] ..FAILED (3.2 s)
[INFO]   The build exited with code 1. See F:\hudson\hudson-slave\workspace\maven-plugins-ITs-m3-windows\maven-dependency-plugin\target\it\copy\build.log
for details.
[INFO] Building: copy-and-unpack-with-alternate-local-repo\pom.xml
[INFO] ..FAILED (3.3 s)
[INFO]   The build exited with code 1. See F:\hudson\hudson-slave\workspace\maven-plugins-ITs-m3-windows\maven-dependency-plugin\target\it\copy-and-unpack-with-alternate-local-repo\build.log
for details.
[INFO] Building: copy-cli\pom.xml
[INFO] ..FAILED (3.3 s)
[INFO]   The build exited with code 1. See F:\hudson\hudson-slave\workspace\maven-plugins-ITs-m3-windows\maven-dependency-plugin\target\it\copy-cli\build.log
for details.
[INFO] Building: copy-dependencies\pom.xml
[INFO] ..FAILED (3.7 s)
[INFO]   The build exited with code 1. See F:\hudson\hudson-slave\workspace\maven-plugins-ITs-m3-windows\maven-dependency-plugin\target\it\copy-dependencies\build.log
for details.
[INFO] Building: copy-from-reactor\pom.xml
[INFO] ..FAILED (7.1 s)
[INFO]   The build exited with code 1. See F:\hudson\hudson-slave\workspace\maven-plugins-ITs-m3-windows\maven-dependency-plugin\target\it\copy-from-reactor\build.log
for details.
[INFO] Building: dependency-properties\pom.xml
[INFO] ..FAILED (3.3 s)
[INFO]   The build exited with code 1. See F:\hudson\hudson-slave\workspace\maven-plugins-ITs-m3-windows\maven-dependency-plugin\target\it\dependency-properties\build.log
for details.
[INFO] Building: filterunpack\pom.xml
[INFO] ..FAILED (3.3 s)
[INFO]   The build exited with code 1. See F:\hudson\hudson-slave\workspace\maven-plugins-ITs-m3-windows\maven-dependency-plugin\target\it\filterunpack\build.log
for details.
[INFO] Building: go-offline\pom.xml
[INFO] ..FAILED (3.1 s)
[INFO]   The build exited with code 1. See F:\hudson\hudson-slave\workspace\maven-plugins-ITs-m3-windows\maven-dependency-plugin\target\it\go-offline\build.log
for details.
[INFO] Building: list-repositories\pom.xml
[INFO] ..FAILED (3.2 s)
[INFO]   The build exited with code 1. See F:\hudson\hudson-slave\workspace\maven-plugins-ITs-m3-windows\maven-dependency-plugin\target\it\list-repositories\build.log
for details.
[INFO] Building: mdep-439-analyze-java8\pom.xml
[INFO] ..SKIPPED due to JRE version
[INFO] Building: mdep-450-project-with-ancestor\pom.xml
[INFO] ..FAILED (3.2 s)
[INFO]   The build exited with code 1. See F:\hudson\hudson-slave\workspace\maven-plugins-ITs-m3-windows\maven-dependency-plugin\target\it\mdep-450-project-with-ancestor\build.log
for details.
[INFO] Building: mdep-450-project-without-ancestor\pom.xml
[INFO] ..FAILED (3.3 s)
[INFO]   The build exited with code 1. See F:\hudson\hudson-slave\workspace\maven-plugins-ITs-m3-windows\maven-dependency-plugin\target\it\mdep-450-project-without-ancestor\build.log
for details.
[INFO] Building: mdep-506-dependency-without-version-in-depmgt\pom.xml
[INFO] ..FAILED (3.7 s)
[INFO]   The build exited with code 1. See F:\hudson\hudson-slave\workspace\maven-plugins-ITs-m3-windows\maven-dependency-plugin\target\it\mdep-506-dependency-without-version-in-depmgt\build.log
for details.
[INFO] Building: purge-local-repository\pom.xml
[INFO] run script setup.bsh
[INFO] ..FAILED (3.4 s)
[INFO]   The build exited with code 1. See F:\hudson\hudson-slave\workspace\maven-plugins-ITs-m3-windows\maven-dependency-plugin\target\it\purge-local-repository\build.log
for details.
[INFO] Building: purge-local-repository-non-transitive\pom.xml
[INFO] ..FAILED (3.2 s)
[INFO]   The build exited with code 1. See F:\hudson\hudson-slave\workspace\maven-plugins-ITs-m3-windows\maven-dependency-plugin\target\it\purge-local-repository-non-transitive\build.log
for details.
[INFO] Building: purge-local-repository-reresolve\pom.xml
[INFO] ..FAILED (3.1 s)
[INFO]   The build exited with code 1. See F:\hudson\hudson-slave\workspace\maven-plugins-ITs-m3-windows\maven-dependency-plugin\target\it\purge-local-repository-reresolve\build.log
for details.
[INFO] Building: purge-local-repository-snapshots-only\pom.xml
[INFO] run script setup.bsh
[INFO] ..FAILED (3.1 s)
[INFO]   The build exited with code 1. See F:\hudson\hudson-slave\workspace\maven-plugins-ITs-m3-windows\maven-dependency-plugin\target\it\purge-local-repository-snapshots-only\build.log
for details.
[INFO] Building: purge-local-repository-version-range\pom.xml
[INFO] ..FAILED (3.3 s)
[INFO]   The build exited with code 1. See F:\hudson\hudson-slave\workspace\maven-plugins-ITs-m3-windows\maven-dependency-plugin\target\it\purge-local-repository-version-range\build.log
for details.
[INFO] Building: resolve\pom.xml
[INFO] ..FAILED (3.1 s)
[INFO]   The build exited with code 1. See F:\hudson\hudson-slave\workspace\maven-plugins-ITs-m3-windows\maven-dependency-plugin\target\it\resolve\build.log
for details.
[INFO] Building: resolve-plugins\pom.xml
[INFO] ..FAILED (3.3 s)
[INFO]   The build exited with code 1. See F:\hudson\hudson-slave\workspace\maven-plugins-ITs-m3-windows\maven-dependency-plugin\target\it\resolve-plugins\build.log
for details.
[INFO] Building: resolve-plugins-exclude-reactor\pom.xml
[INFO] ..FAILED (3.2 s)
[INFO]   The build exited with code 1. See F:\hudson\hudson-slave\workspace\maven-plugins-ITs-m3-windows\maven-dependency-plugin\target\it\resolve-plugins-exclude-reactor\build.log
for details.
[INFO] Building: resolve-plugins-with-exclude\pom.xml
[INFO] ..FAILED (3.3 s)
[INFO]   The build exited with code 1. See F:\hudson\hudson-slave\workspace\maven-plugins-ITs-m3-windows\maven-dependency-plugin\target\it\resolve-plugins-with-exclude\build.log
for details.
[INFO] Building: sources\pom.xml
[INFO] ..FAILED (3.2 s)
[INFO]   The build exited with code 1. See F:\hudson\hudson-slave\workspace\maven-plugins-ITs-m3-windows\maven-dependency-plugin\target\it\sources\build.log
for details.
[INFO] Building: tree\pom.xml
[INFO] ..FAILED (3.2 s)
[INFO]   The build exited with code 1. See F:\hudson\hudson-slave\workspace\maven-plugins-ITs-m3-windows\maven-dependency-plugin\target\it\tree\build.log
for details.
[INFO] Building: tree-includes\pom.xml
[INFO] ..FAILED (3.1 s)
[INFO]   The build exited with code 1. See F:\hudson\hudson-slave\workspace\maven-plugins-ITs-m3-windows\maven-dependency-plugin\target\it\tree-includes\build.log
for details.
[INFO] Building: unpack\pom.xml
[INFO] ..FAILED (3.0 s)
[INFO]   The build exited with code 1. See F:\hudson\hudson-slave\workspace\maven-plugins-ITs-m3-windows\maven-dependency-plugin\target\it\unpack\build.log
for details.
[INFO] Building: unpack-cli\pom.xml
[INFO] ..FAILED (3.1 s)
[INFO]   The build exited with code 1. See F:\hudson\hudson-slave\workspace\maven-plugins-ITs-m3-windows\maven-dependency-plugin\target\it\unpack-cli\build.log
for details.
[INFO] Building: unpack-custom-ear\pom.xml
[INFO] ..FAILED (3.9 s)
[INFO]   The build exited with code 1. See F:\hudson\hudson-slave\workspace\maven-plugins-ITs-m3-windows\maven-dependency-plugin\target\it\unpack-custom-ear\build.log
for details.
[INFO] Building: unpack-dependencies\pom.xml
[INFO] ..FAILED (3.1 s)
[INFO]   The build exited with code 1. See F:\hudson\hudson-slave\workspace\maven-plugins-ITs-m3-windows\maven-dependency-plugin\target\it\unpack-dependencies\build.log
for details.
[INFO] 
[INFO] --- mrm-maven-plugin:1.0-beta-2:stop (default) @ maven-dependency-plugin ---
[INFO] Stopping Mock Repository Manager on http://localhost:58442
[INFO] Mock Repository Manager http://localhost:58442 is stopped.
[INFO] 
[INFO] --- maven-invoker-plugin:2.0.0:verify (integration-test) @ maven-dependency-plugin
---
[INFO] -------------------------------------------------
[INFO] Build Summary:
[INFO]   Passed: 1, Failed: 36, Errors: 0, Skipped: 1
[INFO] -------------------------------------------------
[ERROR] The following builds failed:
[ERROR] *  analyze-dep-mgt\pom.xml
[ERROR] *  analyze-ignore-dependency\pom.xml
[ERROR] *  analyze-ignore-unused-declared-dependency\pom.xml
[ERROR] *  analyze-ignore-used-undeclared-dependency\pom.xml
[ERROR] *  analyze-multimodule-project\pom.xml
[ERROR] *  analyze-report\pom.xml
[ERROR] *  analyze\pom.xml
[ERROR] *  build-classpath\pom.xml
[ERROR] *  copy-and-unpack-with-alternate-local-repo\pom.xml
[ERROR] *  copy-cli\pom.xml
[ERROR] *  copy-dependencies\pom.xml
[ERROR] *  copy-from-reactor\pom.xml
[ERROR] *  copy\pom.xml
[ERROR] *  dependency-properties\pom.xml
[ERROR] *  filterunpack\pom.xml
[ERROR] *  go-offline\pom.xml
[ERROR] *  list-repositories\pom.xml
[ERROR] *  mdep-450-project-with-ancestor\pom.xml
[ERROR] *  mdep-450-project-without-ancestor\pom.xml
[ERROR] *  mdep-506-dependency-without-version-in-depmgt\pom.xml
[ERROR] *  purge-local-repository-non-transitive\pom.xml
[ERROR] *  purge-local-repository-reresolve\pom.xml
[ERROR] *  purge-local-repository-snapshots-only\pom.xml
[ERROR] *  purge-local-repository-version-range\pom.xml
[ERROR] *  purge-local-repository\pom.xml
[ERROR] *  resolve-plugins-exclude-reactor\pom.xml
[ERROR] *  resolve-plugins-with-exclude\pom.xml
[ERROR] *  resolve-plugins\pom.xml
[ERROR] *  resolve\pom.xml
[ERROR] *  sources\pom.xml
[ERROR] *  tree-includes\pom.xml
[ERROR] *  tree\pom.xml
[ERROR] *  unpack-cli\pom.xml
[ERROR] *  unpack-custom-ear\pom.xml
[ERROR] *  unpack-dependencies\pom.xml
[ERROR] *  unpack\pom.xml
[INFO] -------------------------------------------------
[INFO]                                                                         
[INFO] ------------------------------------------------------------------------
[INFO] Building Apache Maven Plugins Aggregator 1-SNAPSHOT
[INFO] ------------------------------------------------------------------------
[INFO] 
[INFO] --- maven-clean-plugin:2.5:clean (default-clean) @ maven-plugins-aggregator ---
[INFO] Deleting <https://builds.apache.org/job/maven-plugins-ITs-m3-windows/ws/target>
[INFO] 
[INFO] --- maven-enforcer-plugin:1.3.1:enforce (enforce-bytecode-version) @ maven-plugins-aggregator
---
[INFO] 
[INFO] --- maven-enforcer-plugin:1.3.1:enforce (ban-known-bad-maven-versions) @ maven-plugins-aggregator
---
[INFO] 
[INFO] --- maven-remote-resources-plugin:1.5:process (default) @ maven-plugins-aggregator
---
[INFO] 
[INFO] --- maven-site-plugin:3.3:attach-descriptor (attach-descriptor) @ maven-plugins-aggregator
---
[INFO] 
[INFO] --- maven-install-plugin:2.5.1:install (default-install) @ maven-plugins-aggregator
---
[INFO] Installing <https://builds.apache.org/job/maven-plugins-ITs-m3-windows/ws/pom.xml>
to C:\.m2\repository\org\apache\maven\plugins\maven-plugins-aggregator\1-SNAPSHOT\maven-plugins-aggregator-1-SNAPSHOT.pom
[INFO] ------------------------------------------------------------------------
[INFO] Reactor Summary:
[INFO] 
[INFO] Apache Maven ACR Plugin ............................ SUCCESS [01:14 min]
[INFO] Apache Maven Ant Plugin ............................ SUCCESS [03:01 min]
[INFO] Apache Maven AntRun Plugin ......................... SUCCESS [02:02 min]
[INFO] Apache Maven Changelog Plugin ...................... SUCCESS [02:12 min]
[INFO] Apache Maven Changes Plugin ........................ SUCCESS [02:21 min]
[INFO] Apache Maven Clean Plugin .......................... SUCCESS [ 34.489 s]
[INFO] Apache Maven Compiler Plugin ....................... SUCCESS [03:23 min]
[INFO] Apache Maven Deploy Plugin ......................... FAILURE [02:37 min]
[INFO] Apache Maven Documentation Checker Plugin .......... SUCCESS [  8.083 s]
[INFO] Apache Maven EAR Plugin ............................ SUCCESS [08:03 min]
[INFO] Apache Maven EJB Plugin ............................ SUCCESS [01:04 min]
[INFO] Apache Maven Help Plugin ........................... SUCCESS [01:12 min]
[INFO] Apache Maven Install Plugin ........................ SUCCESS [02:00 min]
[INFO] Apache Maven Jarsigner Plugin ...................... SUCCESS [01:17 min]
[INFO] Apache Maven Javadoc Plugin ........................ SUCCESS [06:26 min]
[INFO] Apache Maven Linkcheck Plugin ...................... SUCCESS [  6.240 s]
[INFO] Apache Maven Patch Plugin .......................... SUCCESS [  8.180 s]
[INFO] Apache Maven PDF Plugin ............................ SUCCESS [01:31 min]
[INFO] Apache Maven RAR Plugin ............................ SUCCESS [ 21.964 s]
[INFO] Apache Maven Repository Plugin ..................... SUCCESS [01:07 min]
[INFO] Apache Maven Resources Plugin ...................... SUCCESS [01:58 min]
[INFO] Apache Maven Site Plugin ........................... SUCCESS [10:47 min]
[INFO] Apache Maven Source Plugin ......................... SUCCESS [01:37 min]
[INFO] Apache Maven Stage Plugin .......................... SUCCESS [  6.362 s]
[INFO] Apache Maven Toolchains Plugin ..................... SUCCESS [ 35.519 s]
[INFO] Apache Maven Verifier Plugin ....................... SUCCESS [ 18.781 s]
[INFO] Apache Maven WAR Plugin ............................ SUCCESS [02:35 min]
[INFO] Apache Maven DOAP Plugin ........................... SUCCESS [ 30.410 s]
[INFO] Apache Maven PMD Plugin ............................ SUCCESS [03:37 min]
[INFO] Apache Maven Invoker Plugin ........................ SUCCESS [08:22 min]
[INFO] Apache Maven JAR Plugin ............................ SUCCESS [02:35 min]
[INFO] Apache Maven Checkstyle Plugin ..................... SUCCESS [06:22 min]
[INFO] Apache Maven Project Info Reports Plugin ........... SUCCESS [04:11 min]
[INFO] Apache Maven Remote Resources Plugin ............... SUCCESS [01:41 min]
[INFO] Apache Maven Shade Plugin .......................... SUCCESS [06:00 min]
[INFO] Apache Maven SCM Publish Plugin .................... SUCCESS [01:47 min]
[INFO] Apache Maven Assembly Plugin ....................... FAILURE [16:48 min]
[INFO] Apache Maven Dependency Plugin ..................... FAILURE [03:46 min]
[INFO] Apache Maven Plugins Aggregator .................... SUCCESS [  0.713 s]
[INFO] ------------------------------------------------------------------------
[INFO] BUILD FAILURE
[INFO] ------------------------------------------------------------------------
[INFO] Total time: 01:54 h
[INFO] Finished at: 2016-05-25T00:20:47+01:00
[INFO] Final Memory: 163M/490M
[INFO] ------------------------------------------------------------------------
[WARNING] The requested profile "apache.snapshots" could not be activated because it does
not exist.
[ERROR] Failed to execute goal org.apache.maven.plugins:maven-invoker-plugin:2.0.0:verify
(integration-test) on project maven-deploy-plugin: 1 build failed. See console output above
for details. -> [Help 1]
[ERROR] Failed to execute goal org.apache.maven.plugins:maven-invoker-plugin:2.0.0:verify
(integration-test) on project maven-assembly-plugin: 1 build failed. See console output above
for details. -> [Help 1]
[ERROR] Failed to execute goal org.apache.maven.plugins:maven-invoker-plugin:2.0.0:verify
(integration-test) on project maven-dependency-plugin: 36 builds failed. See console output
above for details. -> [Help 1]
[ERROR] 
[ERROR] To see the full stack trace of the errors, re-run Maven with the -e switch.
[ERROR] Re-run Maven using the -X switch to enable full debug logging.
[ERROR] 
[ERROR] For more information about the errors and possible solutions, please read the following
articles:
[ERROR] [Help 1] http://cwiki.apache.org/confluence/display/MAVEN/MojoFailureException
[ERROR] 
[ERROR] After correcting the problems, you can resume the build with the command
[ERROR]   mvn <goals> -rf :maven-deploy-plugin
Build step 'Invoke top-level Maven targets' marked build as failure
Deleting 1 temporary files
Recording test results

Mime
View raw message