maven-notifications mailing list archives

Site index · List index
Message view « Date » · « Thread »
Top « Date » · « Thread »
From Apache Jenkins Server <jenk...@builds.apache.org>
Subject Build failed in Jenkins: maven-plugins-ITs-m3-windows #1441
Date Thu, 11 Feb 2016 23:00:43 GMT
See <https://builds.apache.org/job/maven-plugins-ITs-m3-windows/1441/changes>

Changes:

[Michael Osipov] Disable three ITs which fail due to DOXIASITETOOLS-155 for now

------------------------------------------
[...truncated 6735 lines...]
	at org.junit.Assert.fail(Assert.java:92)
	at org.junit.Assert.assertTrue(Assert.java:43)
	at org.junit.Assert.assertTrue(Assert.java:54)
	at org.apache.maven.plugins.shade.resource.ServiceResourceTransformerTest.concatenation(ServiceResourceTransformerTest.java:141)

Running org.apache.maven.plugins.shade.resource.XmlAppendingTransformerTest
Tests run: 1, Failures: 0, Errors: 0, Skipped: 0, Time elapsed: 0.001 sec - in org.apache.maven.plugins.shade.resource.XmlAppendingTransformerTest

Results :

Failed tests: 
  ServiceResourceTransformerTest.concatenation:141 null
  ServiceResourceTransformerTest.relocatedClasses:76 expected:<borg.foo.Service[]
> but was:<borg.foo.Service[
]
>

Tests run: 32, Failures: 2, Errors: 0, Skipped: 0

[INFO]                                                                         
[INFO] ------------------------------------------------------------------------
[INFO] Building Apache Maven SCM Publish Plugin 1.2-SNAPSHOT
[INFO] ------------------------------------------------------------------------
[INFO] 
[INFO] --- maven-clean-plugin:2.5:clean (default-clean) @ maven-scm-publish-plugin ---
[INFO] Deleting F:\hudson\hudson-slave\workspace\maven-plugins-ITs-m3-windows\maven-scm-publish-plugin\target
[INFO] 
[INFO] --- maven-enforcer-plugin:1.3.1:enforce (enforce-bytecode-version) @ maven-scm-publish-plugin
---
[INFO] 
[INFO] --- maven-enforcer-plugin:1.3.1:enforce (ban-known-bad-maven-versions) @ maven-scm-publish-plugin
---
[INFO] 
[INFO] --- maven-enforcer-plugin:1.3.1:enforce (ensure-no-container-api) @ maven-scm-publish-plugin
---
[INFO] 
[INFO] --- apache-rat-plugin:0.11:check (rat-check) @ maven-scm-publish-plugin ---
[INFO] 51 implicit excludes (use -debug for more details).
[INFO] Exclude: DEPENDENCIES
[INFO] 41 resources included (use -debug for more details)
[INFO] Rat check: Summary of files. Unapproved: 0 unknown: 0 generated: 0 approved: 39 licence.
[INFO] 
[INFO] --- maven-plugin-plugin:3.4:helpmojo (generate-helpmojo) @ maven-scm-publish-plugin
---
[INFO] Using 'UTF-8' encoding to read mojo metadata.
[INFO] Mojo extractor with id: java-annotations found 0 mojo descriptors.
[INFO] Mojo extractor with id: java-javadoc found 1 mojo descriptors.
[INFO] 
[INFO] --- maven-remote-resources-plugin:1.5:process (default) @ maven-scm-publish-plugin
---
[INFO] 
[INFO] --- maven-resources-plugin:2.7:resources (default-resources) @ maven-scm-publish-plugin
---
[INFO] Using 'UTF-8' encoding to copy filtered resources.
[INFO] Copying 2 resources
[INFO] Copying 3 resources
[INFO] 
[INFO] --- maven-compiler-plugin:3.2:compile (default-compile) @ maven-scm-publish-plugin
---
[INFO] Changes detected - recompiling the module!
[INFO] Compiling 4 source files to F:\hudson\hudson-slave\workspace\maven-plugins-ITs-m3-windows\maven-scm-publish-plugin\target\classes
[INFO] 
[INFO] --- maven-plugin-plugin:3.4:descriptor (default-descriptor) @ maven-scm-publish-plugin
---
[INFO] Using 'UTF-8' encoding to read mojo metadata.
[INFO] Mojo extractor with id: java-annotations found 2 mojo descriptors.
[INFO] Mojo extractor with id: java-javadoc found 1 mojo descriptors.
[INFO] 
[INFO] --- maven-resources-plugin:2.7:testResources (default-testResources) @ maven-scm-publish-plugin
---
[INFO] Using 'UTF-8' encoding to copy filtered resources.
[INFO] skip non existing resourceDirectory F:\hudson\hudson-slave\workspace\maven-plugins-ITs-m3-windows\maven-scm-publish-plugin\src\test\resources
[INFO] Copying 3 resources
[INFO] 
[INFO] --- maven-compiler-plugin:3.2:testCompile (default-testCompile) @ maven-scm-publish-plugin
---
[INFO] No sources to compile
[INFO] 
[INFO] --- maven-surefire-plugin:2.18.1:test (default-test) @ maven-scm-publish-plugin ---
[INFO] 
[INFO] --- maven-jar-plugin:2.5:jar (default-jar) @ maven-scm-publish-plugin ---
[INFO] Building jar: F:\hudson\hudson-slave\workspace\maven-plugins-ITs-m3-windows\maven-scm-publish-plugin\target\maven-scm-publish-plugin-1.2-SNAPSHOT.jar
[INFO] 
[INFO] --- maven-plugin-plugin:3.4:addPluginArtifactMetadata (default-addPluginArtifactMetadata)
@ maven-scm-publish-plugin ---
[INFO] 
[INFO] --- maven-invoker-plugin:2.0.0:install (integration-test) @ maven-scm-publish-plugin
---
[INFO] Installing F:\hudson\hudson-slave\workspace\maven-plugins-ITs-m3-windows\maven-acr-plugin\pom.xml
to F:\hudson\hudson-slave\workspace\maven-plugins-ITs-m3-windows\maven-scm-publish-plugin\target\local-repo\org\apache\maven\plugins\maven-acr-plugin\3.0.1-SNAPSHOT\maven-acr-plugin-3.0.1-SNAPSHOT.pom
[INFO] Installing F:\hudson\hudson-slave\workspace\maven-plugins-ITs-m3-windows\maven-acr-plugin\target\maven-acr-plugin-3.0.1-SNAPSHOT.jar
to F:\hudson\hudson-slave\workspace\maven-plugins-ITs-m3-windows\maven-scm-publish-plugin\target\local-repo\org\apache\maven\plugins\maven-acr-plugin\3.0.1-SNAPSHOT\maven-acr-plugin-3.0.1-SNAPSHOT.jar
[INFO] Installing F:\hudson\hudson-slave\workspace\maven-plugins-ITs-m3-windows\maven-acr-plugin\pom.xml
to F:\hudson\hudson-slave\workspace\maven-plugins-ITs-m3-windows\maven-scm-publish-plugin\target\local-repo\org\apache\maven\plugins\maven-acr-plugin\3.0.1-SNAPSHOT\maven-acr-plugin-3.0.1-SNAPSHOT.pom
[INFO] Installing F:\hudson\hudson-slave\workspace\maven-plugins-ITs-m3-windows\maven-ant-plugin\pom.xml
to F:\hudson\hudson-slave\workspace\maven-plugins-ITs-m3-windows\maven-scm-publish-plugin\target\local-repo\org\apache\maven\plugins\maven-ant-plugin\2.5-SNAPSHOT\maven-ant-plugin-2.5-SNAPSHOT.pom
[INFO] Installing F:\hudson\hudson-slave\workspace\maven-plugins-ITs-m3-windows\maven-ant-plugin\target\maven-ant-plugin-2.5-SNAPSHOT.jar
to F:\hudson\hudson-slave\workspace\maven-plugins-ITs-m3-windows\maven-scm-publish-plugin\target\local-repo\org\apache\maven\plugins\maven-ant-plugin\2.5-SNAPSHOT\maven-ant-plugin-2.5-SNAPSHOT.jar
[INFO] Installing F:\hudson\hudson-slave\workspace\maven-plugins-ITs-m3-windows\maven-ant-plugin\pom.xml
to F:\hudson\hudson-slave\workspace\maven-plugins-ITs-m3-windows\maven-scm-publish-plugin\target\local-repo\org\apache\maven\plugins\maven-ant-plugin\2.5-SNAPSHOT\maven-ant-plugin-2.5-SNAPSHOT.pom
[INFO] Installing F:\hudson\hudson-slave\workspace\maven-plugins-ITs-m3-windows\maven-antrun-plugin\pom.xml
to F:\hudson\hudson-slave\workspace\maven-plugins-ITs-m3-windows\maven-scm-publish-plugin\target\local-repo\org\apache\maven\plugins\maven-antrun-plugin\1.9-SNAPSHOT\maven-antrun-plugin-1.9-SNAPSHOT.pom
[INFO] Installing F:\hudson\hudson-slave\workspace\maven-plugins-ITs-m3-windows\maven-antrun-plugin\target\maven-antrun-plugin-1.9-SNAPSHOT.jar
to F:\hudson\hudson-slave\workspace\maven-plugins-ITs-m3-windows\maven-scm-publish-plugin\target\local-repo\org\apache\maven\plugins\maven-antrun-plugin\1.9-SNAPSHOT\maven-antrun-plugin-1.9-SNAPSHOT.jar
[INFO] Installing F:\hudson\hudson-slave\workspace\maven-plugins-ITs-m3-windows\maven-antrun-plugin\pom.xml
to F:\hudson\hudson-slave\workspace\maven-plugins-ITs-m3-windows\maven-scm-publish-plugin\target\local-repo\org\apache\maven\plugins\maven-antrun-plugin\1.9-SNAPSHOT\maven-antrun-plugin-1.9-SNAPSHOT.pom
[INFO] Installing F:\hudson\hudson-slave\workspace\maven-plugins-ITs-m3-windows\maven-changelog-plugin\pom.xml
to F:\hudson\hudson-slave\workspace\maven-plugins-ITs-m3-windows\maven-scm-publish-plugin\target\local-repo\org\apache\maven\plugins\maven-changelog-plugin\2.4-SNAPSHOT\maven-changelog-plugin-2.4-SNAPSHOT.pom
[INFO] Installing F:\hudson\hudson-slave\workspace\maven-plugins-ITs-m3-windows\maven-changelog-plugin\target\maven-changelog-plugin-2.4-SNAPSHOT.jar
to F:\hudson\hudson-slave\workspace\maven-plugins-ITs-m3-windows\maven-scm-publish-plugin\target\local-repo\org\apache\maven\plugins\maven-changelog-plugin\2.4-SNAPSHOT\maven-changelog-plugin-2.4-SNAPSHOT.jar
[INFO] Installing F:\hudson\hudson-slave\workspace\maven-plugins-ITs-m3-windows\maven-changelog-plugin\pom.xml
to F:\hudson\hudson-slave\workspace\maven-plugins-ITs-m3-windows\maven-scm-publish-plugin\target\local-repo\org\apache\maven\plugins\maven-changelog-plugin\2.4-SNAPSHOT\maven-changelog-plugin-2.4-SNAPSHOT.pom
[INFO] Installing F:\hudson\hudson-slave\workspace\maven-plugins-ITs-m3-windows\maven-changes-plugin\pom.xml
to F:\hudson\hudson-slave\workspace\maven-plugins-ITs-m3-windows\maven-scm-publish-plugin\target\local-repo\org\apache\maven\plugins\maven-changes-plugin\2.12-SNAPSHOT\maven-changes-plugin-2.12-SNAPSHOT.pom
[INFO] Installing F:\hudson\hudson-slave\workspace\maven-plugins-ITs-m3-windows\maven-changes-plugin\target\maven-changes-plugin-2.12-SNAPSHOT.jar
to F:\hudson\hudson-slave\workspace\maven-plugins-ITs-m3-windows\maven-scm-publish-plugin\target\local-repo\org\apache\maven\plugins\maven-changes-plugin\2.12-SNAPSHOT\maven-changes-plugin-2.12-SNAPSHOT.jar
[INFO] Installing F:\hudson\hudson-slave\workspace\maven-plugins-ITs-m3-windows\maven-changes-plugin\pom.xml
to F:\hudson\hudson-slave\workspace\maven-plugins-ITs-m3-windows\maven-scm-publish-plugin\target\local-repo\org\apache\maven\plugins\maven-changes-plugin\2.12-SNAPSHOT\maven-changes-plugin-2.12-SNAPSHOT.pom
[INFO] Installing F:\hudson\hudson-slave\workspace\maven-plugins-ITs-m3-windows\maven-clean-plugin\pom.xml
to F:\hudson\hudson-slave\workspace\maven-plugins-ITs-m3-windows\maven-scm-publish-plugin\target\local-repo\org\apache\maven\plugins\maven-clean-plugin\3.0.1-SNAPSHOT\maven-clean-plugin-3.0.1-SNAPSHOT.pom
[INFO] Installing F:\hudson\hudson-slave\workspace\maven-plugins-ITs-m3-windows\maven-clean-plugin\target\maven-clean-plugin-3.0.1-SNAPSHOT.jar
to F:\hudson\hudson-slave\workspace\maven-plugins-ITs-m3-windows\maven-scm-publish-plugin\target\local-repo\org\apache\maven\plugins\maven-clean-plugin\3.0.1-SNAPSHOT\maven-clean-plugin-3.0.1-SNAPSHOT.jar
[INFO] Installing F:\hudson\hudson-slave\workspace\maven-plugins-ITs-m3-windows\maven-clean-plugin\pom.xml
to F:\hudson\hudson-slave\workspace\maven-plugins-ITs-m3-windows\maven-scm-publish-plugin\target\local-repo\org\apache\maven\plugins\maven-clean-plugin\3.0.1-SNAPSHOT\maven-clean-plugin-3.0.1-SNAPSHOT.pom
[INFO] Installing F:\hudson\hudson-slave\workspace\maven-plugins-ITs-m3-windows\maven-compiler-plugin\pom.xml
to F:\hudson\hudson-slave\workspace\maven-plugins-ITs-m3-windows\maven-scm-publish-plugin\target\local-repo\org\apache\maven\plugins\maven-compiler-plugin\3.6-SNAPSHOT\maven-compiler-plugin-3.6-SNAPSHOT.pom
[INFO] Installing F:\hudson\hudson-slave\workspace\maven-plugins-ITs-m3-windows\maven-compiler-plugin\target\maven-compiler-plugin-3.6-SNAPSHOT.jar
to F:\hudson\hudson-slave\workspace\maven-plugins-ITs-m3-windows\maven-scm-publish-plugin\target\local-repo\org\apache\maven\plugins\maven-compiler-plugin\3.6-SNAPSHOT\maven-compiler-plugin-3.6-SNAPSHOT.jar
[INFO] Installing F:\hudson\hudson-slave\workspace\maven-plugins-ITs-m3-windows\maven-compiler-plugin\pom.xml
to F:\hudson\hudson-slave\workspace\maven-plugins-ITs-m3-windows\maven-scm-publish-plugin\target\local-repo\org\apache\maven\plugins\maven-compiler-plugin\3.6-SNAPSHOT\maven-compiler-plugin-3.6-SNAPSHOT.pom
[INFO] Installing F:\hudson\hudson-slave\workspace\maven-plugins-ITs-m3-windows\maven-deploy-plugin\pom.xml
to F:\hudson\hudson-slave\workspace\maven-plugins-ITs-m3-windows\maven-scm-publish-plugin\target\local-repo\org\apache\maven\plugins\maven-deploy-plugin\3.0-SNAPSHOT\maven-deploy-plugin-3.0-SNAPSHOT.pom
[INFO] Installing F:\hudson\hudson-slave\workspace\maven-plugins-ITs-m3-windows\maven-deploy-plugin\target\maven-deploy-plugin-3.0-SNAPSHOT.jar
to F:\hudson\hudson-slave\workspace\maven-plugins-ITs-m3-windows\maven-scm-publish-plugin\target\local-repo\org\apache\maven\plugins\maven-deploy-plugin\3.0-SNAPSHOT\maven-deploy-plugin-3.0-SNAPSHOT.jar
[INFO] Installing F:\hudson\hudson-slave\workspace\maven-plugins-ITs-m3-windows\maven-deploy-plugin\pom.xml
to F:\hudson\hudson-slave\workspace\maven-plugins-ITs-m3-windows\maven-scm-publish-plugin\target\local-repo\org\apache\maven\plugins\maven-deploy-plugin\3.0-SNAPSHOT\maven-deploy-plugin-3.0-SNAPSHOT.pom
[INFO] Installing F:\hudson\hudson-slave\workspace\maven-plugins-ITs-m3-windows\maven-docck-plugin\pom.xml
to F:\hudson\hudson-slave\workspace\maven-plugins-ITs-m3-windows\maven-scm-publish-plugin\target\local-repo\org\apache\maven\plugins\maven-docck-plugin\1.2-SNAPSHOT\maven-docck-plugin-1.2-SNAPSHOT.pom
[INFO] Installing F:\hudson\hudson-slave\workspace\maven-plugins-ITs-m3-windows\maven-docck-plugin\target\maven-docck-plugin-1.2-SNAPSHOT.jar
to F:\hudson\hudson-slave\workspace\maven-plugins-ITs-m3-windows\maven-scm-publish-plugin\target\local-repo\org\apache\maven\plugins\maven-docck-plugin\1.2-SNAPSHOT\maven-docck-plugin-1.2-SNAPSHOT.jar
[INFO] Installing F:\hudson\hudson-slave\workspace\maven-plugins-ITs-m3-windows\maven-docck-plugin\pom.xml
to F:\hudson\hudson-slave\workspace\maven-plugins-ITs-m3-windows\maven-scm-publish-plugin\target\local-repo\org\apache\maven\plugins\maven-docck-plugin\1.2-SNAPSHOT\maven-docck-plugin-1.2-SNAPSHOT.pom
[INFO] Installing F:\hudson\hudson-slave\workspace\maven-plugins-ITs-m3-windows\maven-ear-plugin\pom.xml
to F:\hudson\hudson-slave\workspace\maven-plugins-ITs-m3-windows\maven-scm-publish-plugin\target\local-repo\org\apache\maven\plugins\maven-ear-plugin\2.10.2-SNAPSHOT\maven-ear-plugin-2.10.2-SNAPSHOT.pom
[INFO] Installing F:\hudson\hudson-slave\workspace\maven-plugins-ITs-m3-windows\maven-ear-plugin\target\maven-ear-plugin-2.10.2-SNAPSHOT.jar
to F:\hudson\hudson-slave\workspace\maven-plugins-ITs-m3-windows\maven-scm-publish-plugin\target\local-repo\org\apache\maven\plugins\maven-ear-plugin\2.10.2-SNAPSHOT\maven-ear-plugin-2.10.2-SNAPSHOT.jar
[INFO] Installing F:\hudson\hudson-slave\workspace\maven-plugins-ITs-m3-windows\maven-ear-plugin\pom.xml
to F:\hudson\hudson-slave\workspace\maven-plugins-ITs-m3-windows\maven-scm-publish-plugin\target\local-repo\org\apache\maven\plugins\maven-ear-plugin\2.10.2-SNAPSHOT\maven-ear-plugin-2.10.2-SNAPSHOT.pom
[INFO] Installing F:\hudson\hudson-slave\workspace\maven-plugins-ITs-m3-windows\maven-ejb-plugin\pom.xml
to F:\hudson\hudson-slave\workspace\maven-plugins-ITs-m3-windows\maven-scm-publish-plugin\target\local-repo\org\apache\maven\plugins\maven-ejb-plugin\2.5.2-SNAPSHOT\maven-ejb-plugin-2.5.2-SNAPSHOT.pom
[INFO] Installing F:\hudson\hudson-slave\workspace\maven-plugins-ITs-m3-windows\maven-ejb-plugin\target\maven-ejb-plugin-2.5.2-SNAPSHOT.jar
to F:\hudson\hudson-slave\workspace\maven-plugins-ITs-m3-windows\maven-scm-publish-plugin\target\local-repo\org\apache\maven\plugins\maven-ejb-plugin\2.5.2-SNAPSHOT\maven-ejb-plugin-2.5.2-SNAPSHOT.jar
[INFO] Installing F:\hudson\hudson-slave\workspace\maven-plugins-ITs-m3-windows\maven-ejb-plugin\pom.xml
to F:\hudson\hudson-slave\workspace\maven-plugins-ITs-m3-windows\maven-scm-publish-plugin\target\local-repo\org\apache\maven\plugins\maven-ejb-plugin\2.5.2-SNAPSHOT\maven-ejb-plugin-2.5.2-SNAPSHOT.pom
[INFO] Installing F:\hudson\hudson-slave\workspace\maven-plugins-ITs-m3-windows\maven-help-plugin\pom.xml
to F:\hudson\hudson-slave\workspace\maven-plugins-ITs-m3-windows\maven-scm-publish-plugin\target\local-repo\org\apache\maven\plugins\maven-help-plugin\2.2.1-SNAPSHOT\maven-help-plugin-2.2.1-SNAPSHOT.pom
[INFO] Installing F:\hudson\hudson-slave\workspace\maven-plugins-ITs-m3-windows\maven-help-plugin\target\maven-help-plugin-2.2.1-SNAPSHOT.jar
to F:\hudson\hudson-slave\workspace\maven-plugins-ITs-m3-windows\maven-scm-publish-plugin\target\local-repo\org\apache\maven\plugins\maven-help-plugin\2.2.1-SNAPSHOT\maven-help-plugin-2.2.1-SNAPSHOT.jar
[INFO] Installing F:\hudson\hudson-slave\workspace\maven-plugins-ITs-m3-windows\maven-help-plugin\pom.xml
to F:\hudson\hudson-slave\workspace\maven-plugins-ITs-m3-windows\maven-scm-publish-plugin\target\local-repo\org\apache\maven\plugins\maven-help-plugin\2.2.1-SNAPSHOT\maven-help-plugin-2.2.1-SNAPSHOT.pom
[INFO] Installing F:\hudson\hudson-slave\workspace\maven-plugins-ITs-m3-windows\maven-install-plugin\pom.xml
to F:\hudson\hudson-slave\workspace\maven-plugins-ITs-m3-windows\maven-scm-publish-plugin\target\local-repo\org\apache\maven\plugins\maven-install-plugin\3.0-SNAPSHOT\maven-install-plugin-3.0-SNAPSHOT.pom
[INFO] Installing F:\hudson\hudson-slave\workspace\maven-plugins-ITs-m3-windows\maven-install-plugin\target\maven-install-plugin-3.0-SNAPSHOT.jar
to F:\hudson\hudson-slave\workspace\maven-plugins-ITs-m3-windows\maven-scm-publish-plugin\target\local-repo\org\apache\maven\plugins\maven-install-plugin\3.0-SNAPSHOT\maven-install-plugin-3.0-SNAPSHOT.jar
[INFO] Installing F:\hudson\hudson-slave\workspace\maven-plugins-ITs-m3-windows\maven-install-plugin\pom.xml
to F:\hudson\hudson-slave\workspace\maven-plugins-ITs-m3-windows\maven-scm-publish-plugin\target\local-repo\org\apache\maven\plugins\maven-install-plugin\3.0-SNAPSHOT\maven-install-plugin-3.0-SNAPSHOT.pom
[INFO] Installing F:\hudson\hudson-slave\workspace\maven-plugins-ITs-m3-windows\maven-jarsigner-plugin\pom.xml
to F:\hudson\hudson-slave\workspace\maven-plugins-ITs-m3-windows\maven-scm-publish-plugin\target\local-repo\org\apache\maven\plugins\maven-jarsigner-plugin\1.5-SNAPSHOT\maven-jarsigner-plugin-1.5-SNAPSHOT.pom
[INFO] Installing F:\hudson\hudson-slave\workspace\maven-plugins-ITs-m3-windows\maven-jarsigner-plugin\target\maven-jarsigner-plugin-1.5-SNAPSHOT.jar
to F:\hudson\hudson-slave\workspace\maven-plugins-ITs-m3-windows\maven-scm-publish-plugin\target\local-repo\org\apache\maven\plugins\maven-jarsigner-plugin\1.5-SNAPSHOT\maven-jarsigner-plugin-1.5-SNAPSHOT.jar
[INFO] Installing F:\hudson\hudson-slave\workspace\maven-plugins-ITs-m3-windows\maven-jarsigner-plugin\pom.xml
to F:\hudson\hudson-slave\workspace\maven-plugins-ITs-m3-windows\maven-scm-publish-plugin\target\local-repo\org\apache\maven\plugins\maven-jarsigner-plugin\1.5-SNAPSHOT\maven-jarsigner-plugin-1.5-SNAPSHOT.pom
[INFO] Installing F:\hudson\hudson-slave\workspace\maven-plugins-ITs-m3-windows\maven-javadoc-plugin\pom.xml
to F:\hudson\hudson-slave\workspace\maven-plugins-ITs-m3-windows\maven-scm-publish-plugin\target\local-repo\org\apache\maven\plugins\maven-javadoc-plugin\2.10.4-SNAPSHOT\maven-javadoc-plugin-2.10.4-SNAPSHOT.pom
[INFO]                                                                         
[INFO] ------------------------------------------------------------------------
[INFO] Building Apache Maven Plugins Aggregator 1-SNAPSHOT
[INFO] ------------------------------------------------------------------------
[INFO] 
[INFO] --- maven-clean-plugin:2.5:clean (default-clean) @ maven-plugins-aggregator ---
[INFO] Deleting <https://builds.apache.org/job/maven-plugins-ITs-m3-windows/ws/target>
[INFO] 
[INFO] --- maven-enforcer-plugin:1.3.1:enforce (enforce-bytecode-version) @ maven-plugins-aggregator
---
[INFO] 
[INFO] --- maven-enforcer-plugin:1.3.1:enforce (ban-known-bad-maven-versions) @ maven-plugins-aggregator
---
[INFO] 
[INFO] --- maven-remote-resources-plugin:1.5:process (default) @ maven-plugins-aggregator
---
[INFO] 
[INFO] --- maven-site-plugin:3.3:attach-descriptor (attach-descriptor) @ maven-plugins-aggregator
---
[INFO] 
[INFO] --- maven-install-plugin:2.5.1:install (default-install) @ maven-plugins-aggregator
---
[INFO] Installing <https://builds.apache.org/job/maven-plugins-ITs-m3-windows/ws/pom.xml>
to C:\.m2\repository\org\apache\maven\plugins\maven-plugins-aggregator\1-SNAPSHOT\maven-plugins-aggregator-1-SNAPSHOT.pom
[INFO] ------------------------------------------------------------------------
[INFO] Reactor Summary:
[INFO] 
[INFO] Apache Maven ACR Plugin ........................... SUCCESS [48.532s]
[INFO] Apache Maven Ant Plugin ........................... SUCCESS [1:59.380s]
[INFO] Apache Maven AntRun Plugin ........................ SUCCESS [1:14.061s]
[INFO] Apache Maven Changelog Plugin ..................... SUCCESS [1:18.840s]
[INFO] Apache Maven Changes Plugin ....................... SUCCESS [1:29.188s]
[INFO] Apache Maven Clean Plugin ......................... SUCCESS [28.990s]
[INFO] Apache Maven Compiler Plugin ...................... SUCCESS [3:19.215s]
[INFO] Apache Maven Deploy Plugin ........................ SUCCESS [2:24.806s]
[INFO] Apache Maven Documentation Checker Plugin ......... SUCCESS [6.789s]
[INFO] Apache Maven EAR Plugin ........................... SUCCESS [7:20.724s]
[INFO] Apache Maven EJB Plugin ........................... SUCCESS [54.756s]
[INFO] Apache Maven Help Plugin .......................... SUCCESS [1:09.922s]
[INFO] Apache Maven Install Plugin ....................... SUCCESS [1:40.225s]
[INFO] Apache Maven Jarsigner Plugin ..................... SUCCESS [1:04.230s]
[INFO] Apache Maven Javadoc Plugin ....................... FAILURE [1:24.946s]
[INFO] Apache Maven Linkcheck Plugin ..................... FAILURE [4.155s]
[INFO] Apache Maven Patch Plugin ......................... FAILURE [1.224s]
[INFO] Apache Maven PDF Plugin ........................... FAILURE [17.373s]
[INFO] Apache Maven RAR Plugin ........................... FAILURE [5.004s]
[INFO] Apache Maven Repository Plugin .................... FAILURE [4.527s]
[INFO] Apache Maven Resources Plugin ..................... FAILURE [10.363s]
[INFO] Apache Maven Site Plugin .......................... FAILURE [16.568s]
[INFO] Apache Maven Source Plugin ........................ FAILURE [7.917s]
[INFO] Apache Maven Stage Plugin ......................... FAILURE [4.129s]
[INFO] Apache Maven Toolchains Plugin .................... FAILURE [2.169s]
[INFO] Apache Maven Verifier Plugin ...................... FAILURE [2.136s]
[INFO] Apache Maven WAR Plugin ........................... FAILURE [17.831s]
[INFO] Apache Maven DOAP Plugin .......................... FAILURE [8.548s]
[INFO] Apache Maven PMD Plugin ........................... FAILURE [27.957s]
[INFO] Apache Maven Invoker Plugin ....................... FAILURE [13.217s]
[INFO] Apache Maven JAR Plugin ........................... FAILURE [4.132s]
[INFO] Apache Maven Project Info Reports Plugin .......... FAILURE [25.589s]
[INFO] Apache Maven Remote Resources Plugin .............. FAILURE [6.782s]
[INFO] Apache Maven Shade Plugin ......................... FAILURE [11.147s]
[INFO] Apache Maven SCM Publish Plugin ................... FAILURE [7.551s]
[INFO] Apache Maven Plugins Aggregator ................... SUCCESS [0.405s]
[INFO] ------------------------------------------------------------------------
[INFO] BUILD FAILURE
[INFO] ------------------------------------------------------------------------
[INFO] Total time: 30:04.850s
[INFO] Finished at: Thu Feb 11 22:59:23 GMT 2016
[INFO] Final Memory: 85M/372M
[INFO] ------------------------------------------------------------------------
[WARNING] The requested profile "apache.snapshots" could not be activated because it does
not exist.
[ERROR] Failed to execute goal org.apache.maven.plugins:maven-surefire-plugin:2.18.1:test
(default-test) on project maven-javadoc-plugin: There are test failures.
[ERROR] 
[ERROR] Please refer to F:\hudson\hudson-slave\workspace\maven-plugins-ITs-m3-windows\maven-javadoc-plugin\target\surefire-reports
for the individual test results.
[ERROR] -> [Help 1]
[ERROR] Failed to execute goal org.apache.maven.plugins:maven-invoker-plugin:2.0.0:install
(integration-test) on project maven-linkcheck-plugin: Failed to install project dependencies:
MavenProject: org.apache.maven.plugins:maven-linkcheck-plugin:1.3-SNAPSHOT @ F:\hudson\hudson-slave\workspace\maven-plugins-ITs-m3-windows\maven-linkcheck-plugin\pom.xml:
Failed to install project artifacts: MavenProject: org.apache.maven.plugins:maven-javadoc-plugin:2.10.4-SNAPSHOT
@ F:\hudson\hudson-slave\workspace\maven-plugins-ITs-m3-windows\maven-javadoc-plugin\pom.xml:
Failed to install artifact: org.apache.maven.plugins:maven-javadoc-plugin:maven-plugin:2.10.4-SNAPSHOT:
Artifact is not fully assembled: F:\hudson\hudson-slave\workspace\maven-plugins-ITs-m3-windows\maven-javadoc-plugin\target\classes
-> [Help 2]
[ERROR] Failed to execute goal org.apache.maven.plugins:maven-invoker-plugin:2.0.0:install
(integration-test) on project maven-patch-plugin: Failed to install project dependencies:
MavenProject: org.apache.maven.plugins:maven-patch-plugin:1.3-SNAPSHOT @ F:\hudson\hudson-slave\workspace\maven-plugins-ITs-m3-windows\maven-patch-plugin\pom.xml:
Failed to install project artifacts: MavenProject: org.apache.maven.plugins:maven-javadoc-plugin:2.10.4-SNAPSHOT
@ F:\hudson\hudson-slave\workspace\maven-plugins-ITs-m3-windows\maven-javadoc-plugin\pom.xml:
Failed to install artifact: org.apache.maven.plugins:maven-javadoc-plugin:maven-plugin:2.10.4-SNAPSHOT:
Artifact is not fully assembled: F:\hudson\hudson-slave\workspace\maven-plugins-ITs-m3-windows\maven-javadoc-plugin\target\classes
-> [Help 2]
[ERROR] Failed to execute goal org.apache.maven.plugins:maven-invoker-plugin:2.0.0:install
(integration-test) on project maven-pdf-plugin: Failed to install project dependencies: MavenProject:
org.apache.maven.plugins:maven-pdf-plugin:1.4-SNAPSHOT @ F:\hudson\hudson-slave\workspace\maven-plugins-ITs-m3-windows\maven-pdf-plugin\pom.xml:
Failed to install project artifacts: MavenProject: org.apache.maven.plugins:maven-javadoc-plugin:2.10.4-SNAPSHOT
@ F:\hudson\hudson-slave\workspace\maven-plugins-ITs-m3-windows\maven-javadoc-plugin\pom.xml:
Failed to install artifact: org.apache.maven.plugins:maven-javadoc-plugin:maven-plugin:2.10.4-SNAPSHOT:
Artifact is not fully assembled: F:\hudson\hudson-slave\workspace\maven-plugins-ITs-m3-windows\maven-javadoc-plugin\target\classes
-> [Help 2]
[ERROR] Failed to execute goal org.apache.maven.plugins:maven-invoker-plugin:2.0.0:install
(integration-test) on project maven-rar-plugin: Failed to install project dependencies: MavenProject:
org.apache.maven.plugins:maven-rar-plugin:3.0.0-SNAPSHOT @ F:\hudson\hudson-slave\workspace\maven-plugins-ITs-m3-windows\maven-rar-plugin\pom.xml:
Failed to install project artifacts: MavenProject: org.apache.maven.plugins:maven-javadoc-plugin:2.10.4-SNAPSHOT
@ F:\hudson\hudson-slave\workspace\maven-plugins-ITs-m3-windows\maven-javadoc-plugin\pom.xml:
Failed to install artifact: org.apache.maven.plugins:maven-javadoc-plugin:maven-plugin:2.10.4-SNAPSHOT:
Artifact is not fully assembled: F:\hudson\hudson-slave\workspace\maven-plugins-ITs-m3-windows\maven-javadoc-plugin\target\classes
-> [Help 2]
[ERROR] Failed to execute goal org.apache.maven.plugins:maven-invoker-plugin:2.0.0:install
(integration-test) on project maven-repository-plugin: Failed to install project dependencies:
MavenProject: org.apache.maven.plugins:maven-repository-plugin:2.5-SNAPSHOT @ F:\hudson\hudson-slave\workspace\maven-plugins-ITs-m3-windows\maven-repository-plugin\pom.xml:
Failed to install project artifacts: MavenProject: org.apache.maven.plugins:maven-javadoc-plugin:2.10.4-SNAPSHOT
@ F:\hudson\hudson-slave\workspace\maven-plugins-ITs-m3-windows\maven-javadoc-plugin\pom.xml:
Failed to install artifact: org.apache.maven.plugins:maven-javadoc-plugin:maven-plugin:2.10.4-SNAPSHOT:
Artifact is not fully assembled: F:\hudson\hudson-slave\workspace\maven-plugins-ITs-m3-windows\maven-javadoc-plugin\target\classes
-> [Help 2]
[ERROR] Failed to execute goal org.apache.maven.plugins:maven-invoker-plugin:2.0.0:install
(integration-test) on project maven-resources-plugin: Failed to install project dependencies:
MavenProject: org.apache.maven.plugins:maven-resources-plugin:2.8-SNAPSHOT @ F:\hudson\hudson-slave\workspace\maven-plugins-ITs-m3-windows\maven-resources-plugin\pom.xml:
Failed to install project artifacts: MavenProject: org.apache.maven.plugins:maven-javadoc-plugin:2.10.4-SNAPSHOT
@ F:\hudson\hudson-slave\workspace\maven-plugins-ITs-m3-windows\maven-javadoc-plugin\pom.xml:
Failed to install artifact: org.apache.maven.plugins:maven-javadoc-plugin:maven-plugin:2.10.4-SNAPSHOT:
Artifact is not fully assembled: F:\hudson\hudson-slave\workspace\maven-plugins-ITs-m3-windows\maven-javadoc-plugin\target\classes
-> [Help 2]
[ERROR] Failed to execute goal org.apache.maven.plugins:maven-invoker-plugin:2.0.0:install
(integration-test) on project maven-site-plugin: Failed to install project dependencies: MavenProject:
org.apache.maven.plugins:maven-site-plugin:3.5-SNAPSHOT @ F:\hudson\hudson-slave\workspace\maven-plugins-ITs-m3-windows\maven-site-plugin\dependency-reduced-pom.xml:
Failed to install project artifacts: MavenProject: org.apache.maven.plugins:maven-javadoc-plugin:2.10.4-SNAPSHOT
@ F:\hudson\hudson-slave\workspace\maven-plugins-ITs-m3-windows\maven-javadoc-plugin\pom.xml:
Failed to install artifact: org.apache.maven.plugins:maven-javadoc-plugin:maven-plugin:2.10.4-SNAPSHOT:
Artifact is not fully assembled: F:\hudson\hudson-slave\workspace\maven-plugins-ITs-m3-windows\maven-javadoc-plugin\target\classes
-> [Help 2]
[ERROR] Failed to execute goal org.apache.maven.plugins:maven-invoker-plugin:2.0.0:install
(integration-test) on project maven-source-plugin: Failed to install project dependencies:
MavenProject: org.apache.maven.plugins:maven-source-plugin:3.0.1-SNAPSHOT @ F:\hudson\hudson-slave\workspace\maven-plugins-ITs-m3-windows\maven-source-plugin\pom.xml:
Failed to install project artifacts: MavenProject: org.apache.maven.plugins:maven-javadoc-plugin:2.10.4-SNAPSHOT
@ F:\hudson\hudson-slave\workspace\maven-plugins-ITs-m3-windows\maven-javadoc-plugin\pom.xml:
Failed to install artifact: org.apache.maven.plugins:maven-javadoc-plugin:maven-plugin:2.10.4-SNAPSHOT:
Artifact is not fully assembled: F:\hudson\hudson-slave\workspace\maven-plugins-ITs-m3-windows\maven-javadoc-plugin\target\classes
-> [Help 2]
[ERROR] Failed to execute goal org.apache.maven.plugins:maven-invoker-plugin:2.0.0:install
(integration-test) on project maven-stage-plugin: Failed to install project dependencies:
MavenProject: org.apache.maven.plugins:maven-stage-plugin:1.1-SNAPSHOT @ F:\hudson\hudson-slave\workspace\maven-plugins-ITs-m3-windows\maven-stage-plugin\pom.xml:
Failed to install project artifacts: MavenProject: org.apache.maven.plugins:maven-javadoc-plugin:2.10.4-SNAPSHOT
@ F:\hudson\hudson-slave\workspace\maven-plugins-ITs-m3-windows\maven-javadoc-plugin\pom.xml:
Failed to install artifact: org.apache.maven.plugins:maven-javadoc-plugin:maven-plugin:2.10.4-SNAPSHOT:
Artifact is not fully assembled: F:\hudson\hudson-slave\workspace\maven-plugins-ITs-m3-windows\maven-javadoc-plugin\target\classes
-> [Help 2]
[ERROR] Failed to execute goal org.apache.maven.plugins:maven-invoker-plugin:2.0.0:install
(integration-test) on project maven-toolchains-plugin: Failed to install project dependencies:
MavenProject: org.apache.maven.plugins:maven-toolchains-plugin:1.2-SNAPSHOT @ F:\hudson\hudson-slave\workspace\maven-plugins-ITs-m3-windows\maven-toolchains-plugin\pom.xml:
Failed to install project artifacts: MavenProject: org.apache.maven.plugins:maven-javadoc-plugin:2.10.4-SNAPSHOT
@ F:\hudson\hudson-slave\workspace\maven-plugins-ITs-m3-windows\maven-javadoc-plugin\pom.xml:
Failed to install artifact: org.apache.maven.plugins:maven-javadoc-plugin:maven-plugin:2.10.4-SNAPSHOT:
Artifact is not fully assembled: F:\hudson\hudson-slave\workspace\maven-plugins-ITs-m3-windows\maven-javadoc-plugin\target\classes
-> [Help 2]
[ERROR] Failed to execute goal org.apache.maven.plugins:maven-invoker-plugin:2.0.0:install
(integration-test) on project maven-verifier-plugin: Failed to install project dependencies:
MavenProject: org.apache.maven.plugins:maven-verifier-plugin:3.0.0-SNAPSHOT @ F:\hudson\hudson-slave\workspace\maven-plugins-ITs-m3-windows\maven-verifier-plugin\pom.xml:
Failed to install project artifacts: MavenProject: org.apache.maven.plugins:maven-javadoc-plugin:2.10.4-SNAPSHOT
@ F:\hudson\hudson-slave\workspace\maven-plugins-ITs-m3-windows\maven-javadoc-plugin\pom.xml:
Failed to install artifact: org.apache.maven.plugins:maven-javadoc-plugin:maven-plugin:2.10.4-SNAPSHOT:
Artifact is not fully assembled: F:\hudson\hudson-slave\workspace\maven-plugins-ITs-m3-windows\maven-javadoc-plugin\target\classes
-> [Help 2]
[ERROR] Failed to execute goal org.apache.maven.plugins:maven-invoker-plugin:2.0.0:install
(integration-test) on project maven-war-plugin: Failed to install project dependencies: MavenProject:
org.apache.maven.plugins:maven-war-plugin:3.0.0-SNAPSHOT @ F:\hudson\hudson-slave\workspace\maven-plugins-ITs-m3-windows\maven-war-plugin\pom.xml:
Failed to install project artifacts: MavenProject: org.apache.maven.plugins:maven-javadoc-plugin:2.10.4-SNAPSHOT
@ F:\hudson\hudson-slave\workspace\maven-plugins-ITs-m3-windows\maven-javadoc-plugin\pom.xml:
Failed to install artifact: org.apache.maven.plugins:maven-javadoc-plugin:maven-plugin:2.10.4-SNAPSHOT:
Artifact is not fully assembled: F:\hudson\hudson-slave\workspace\maven-plugins-ITs-m3-windows\maven-javadoc-plugin\target\classes
-> [Help 2]
[ERROR] Failed to execute goal org.apache.maven.plugins:maven-invoker-plugin:2.0.0:install
(integration-test) on project maven-doap-plugin: Failed to install project dependencies: MavenProject:
org.apache.maven.plugins:maven-doap-plugin:1.3-SNAPSHOT @ F:\hudson\hudson-slave\workspace\maven-plugins-ITs-m3-windows\maven-doap-plugin\pom.xml:
Failed to install project artifacts: MavenProject: org.apache.maven.plugins:maven-javadoc-plugin:2.10.4-SNAPSHOT
@ F:\hudson\hudson-slave\workspace\maven-plugins-ITs-m3-windows\maven-javadoc-plugin\pom.xml:
Failed to install artifact: org.apache.maven.plugins:maven-javadoc-plugin:maven-plugin:2.10.4-SNAPSHOT:
Artifact is not fully assembled: F:\hudson\hudson-slave\workspace\maven-plugins-ITs-m3-windows\maven-javadoc-plugin\target\classes
-> [Help 2]
[ERROR] Failed to execute goal org.apache.maven.plugins:maven-invoker-plugin:2.0.0:install
(integration-test) on project maven-pmd-plugin: Failed to install project dependencies: MavenProject:
org.apache.maven.plugins:maven-pmd-plugin:3.7-SNAPSHOT @ F:\hudson\hudson-slave\workspace\maven-plugins-ITs-m3-windows\maven-pmd-plugin\pom.xml:
Failed to install project artifacts: MavenProject: org.apache.maven.plugins:maven-javadoc-plugin:2.10.4-SNAPSHOT
@ F:\hudson\hudson-slave\workspace\maven-plugins-ITs-m3-windows\maven-javadoc-plugin\pom.xml:
Failed to install artifact: org.apache.maven.plugins:maven-javadoc-plugin:maven-plugin:2.10.4-SNAPSHOT:
Artifact is not fully assembled: F:\hudson\hudson-slave\workspace\maven-plugins-ITs-m3-windows\maven-javadoc-plugin\target\classes
-> [Help 2]
[ERROR] Failed to execute goal org.apache.maven.plugins:maven-invoker-plugin:2.0.0:install
(integration-test) on project maven-invoker-plugin: Failed to install project dependencies:
MavenProject: org.apache.maven.plugins:maven-invoker-plugin:2.0.1-SNAPSHOT @ F:\hudson\hudson-slave\workspace\maven-plugins-ITs-m3-windows\maven-invoker-plugin\pom.xml:
Failed to install project artifacts: MavenProject: org.apache.maven.plugins:maven-javadoc-plugin:2.10.4-SNAPSHOT
@ F:\hudson\hudson-slave\workspace\maven-plugins-ITs-m3-windows\maven-javadoc-plugin\pom.xml:
Failed to install artifact: org.apache.maven.plugins:maven-javadoc-plugin:maven-plugin:2.10.4-SNAPSHOT:
Artifact is not fully assembled: F:\hudson\hudson-slave\workspace\maven-plugins-ITs-m3-windows\maven-javadoc-plugin\target\classes
-> [Help 2]
[ERROR] Failed to execute goal org.apache.maven.plugins:maven-invoker-plugin:2.0.0:install
(integration-test) on project maven-jar-plugin: Failed to install project dependencies: MavenProject:
org.apache.maven.plugins:maven-jar-plugin:3.0.0-SNAPSHOT @ F:\hudson\hudson-slave\workspace\maven-plugins-ITs-m3-windows\maven-jar-plugin\pom.xml:
Failed to install project artifacts: MavenProject: org.apache.maven.plugins:maven-javadoc-plugin:2.10.4-SNAPSHOT
@ F:\hudson\hudson-slave\workspace\maven-plugins-ITs-m3-windows\maven-javadoc-plugin\pom.xml:
Failed to install artifact: org.apache.maven.plugins:maven-javadoc-plugin:maven-plugin:2.10.4-SNAPSHOT:
Artifact is not fully assembled: F:\hudson\hudson-slave\workspace\maven-plugins-ITs-m3-windows\maven-javadoc-plugin\target\classes
-> [Help 2]
[ERROR] Failed to execute goal org.apache.maven.plugins:maven-invoker-plugin:2.0.0:install
(integration-test) on project maven-project-info-reports-plugin: Failed to install project
dependencies: MavenProject: org.apache.maven.plugins:maven-project-info-reports-plugin:2.9-SNAPSHOT
@ F:\hudson\hudson-slave\workspace\maven-plugins-ITs-m3-windows\maven-project-info-reports-plugin\pom.xml:
Failed to install project artifacts: MavenProject: org.apache.maven.plugins:maven-javadoc-plugin:2.10.4-SNAPSHOT
@ F:\hudson\hudson-slave\workspace\maven-plugins-ITs-m3-windows\maven-javadoc-plugin\pom.xml:
Failed to install artifact: org.apache.maven.plugins:maven-javadoc-plugin:maven-plugin:2.10.4-SNAPSHOT:
Artifact is not fully assembled: F:\hudson\hudson-slave\workspace\maven-plugins-ITs-m3-windows\maven-javadoc-plugin\target\classes
-> [Help 2]
[ERROR] Failed to execute goal org.apache.maven.plugins:maven-invoker-plugin:2.0.0:install
(integration-test) on project maven-remote-resources-plugin: Failed to install project dependencies:
MavenProject: org.apache.maven.plugins:maven-remote-resources-plugin:1.6-SNAPSHOT @ F:\hudson\hudson-slave\workspace\maven-plugins-ITs-m3-windows\maven-remote-resources-plugin\pom.xml:
Failed to install project artifacts: MavenProject: org.apache.maven.plugins:maven-javadoc-plugin:2.10.4-SNAPSHOT
@ F:\hudson\hudson-slave\workspace\maven-plugins-ITs-m3-windows\maven-javadoc-plugin\pom.xml:
Failed to install artifact: org.apache.maven.plugins:maven-javadoc-plugin:maven-plugin:2.10.4-SNAPSHOT:
Artifact is not fully assembled: F:\hudson\hudson-slave\workspace\maven-plugins-ITs-m3-windows\maven-javadoc-plugin\target\classes
-> [Help 2]
[ERROR] Failed to execute goal org.apache.maven.plugins:maven-surefire-plugin:2.18.1:test
(default-test) on project maven-shade-plugin: There are test failures.
[ERROR] 
[ERROR] Please refer to F:\hudson\hudson-slave\workspace\maven-plugins-ITs-m3-windows\maven-shade-plugin\target\surefire-reports
for the individual test results.
[ERROR] -> [Help 1]
[ERROR] Failed to execute goal org.apache.maven.plugins:maven-invoker-plugin:2.0.0:install
(integration-test) on project maven-scm-publish-plugin: Failed to install project dependencies:
MavenProject: org.apache.maven.plugins:maven-scm-publish-plugin:1.2-SNAPSHOT @ F:\hudson\hudson-slave\workspace\maven-plugins-ITs-m3-windows\maven-scm-publish-plugin\pom.xml:
Failed to install project artifacts: MavenProject: org.apache.maven.plugins:maven-javadoc-plugin:2.10.4-SNAPSHOT
@ F:\hudson\hudson-slave\workspace\maven-plugins-ITs-m3-windows\maven-javadoc-plugin\pom.xml:
Failed to install artifact: org.apache.maven.plugins:maven-javadoc-plugin:maven-plugin:2.10.4-SNAPSHOT:
Artifact is not fully assembled: F:\hudson\hudson-slave\workspace\maven-plugins-ITs-m3-windows\maven-javadoc-plugin\target\classes
-> [Help 2]
[ERROR] 
[ERROR] To see the full stack trace of the errors, re-run Maven with the -e switch.
[ERROR] Re-run Maven using the -X switch to enable full debug logging.
[ERROR] 
[ERROR] For more information about the errors and possible solutions, please read the following
articles:
[ERROR] [Help 1] http://cwiki.apache.org/confluence/display/MAVEN/MojoFailureException
[ERROR] [Help 2] http://cwiki.apache.org/confluence/display/MAVEN/MojoExecutionException
[ERROR] 
[ERROR] After correcting the problems, you can resume the build with the command
[ERROR]   mvn <goals> -rf :maven-javadoc-plugin
Build step 'Invoke top-level Maven targets' marked build as failure
Deleting 1 temporary files
Recording test results
ERROR: Unable to send to address: dantran@QBServer.(none)
javax.mail.internet.AddressException: Domain ends with dot in string ``dantran@QBServer.''
	at javax.mail.internet.InternetAddress.checkAddress(InternetAddress.java:1277)
	at javax.mail.internet.InternetAddress.parse(InternetAddress.java:1091)
	at javax.mail.internet.InternetAddress.parse(InternetAddress.java:633)
	at javax.mail.internet.InternetAddress.<init>(InternetAddress.java:111)
	at hudson.tasks.Mailer.stringToAddress(Mailer.java:206)
	at jenkins.plugins.mailer.tasks.MimeMessageBuilder.toNormalizedAddress(MimeMessageBuilder.java:262)
	at jenkins.plugins.mailer.tasks.MimeMessageBuilder.addRecipients(MimeMessageBuilder.java:141)
	at jenkins.plugins.mailer.tasks.MimeMessageBuilder.addRecipients(MimeMessageBuilder.java:133)
	at hudson.tasks.MailSender.createEmptyMail(MailSender.java:388)
	at hudson.tasks.MailSender.createFailureMail(MailSender.java:262)
	at hudson.tasks.MailSender.createMail(MailSender.java:180)
	at hudson.tasks.MailSender.run(MailSender.java:109)
	at hudson.tasks.Mailer.perform(Mailer.java:145)
	at hudson.tasks.BuildStepCompatibilityLayer.perform(BuildStepCompatibilityLayer.java:74)
	at hudson.tasks.BuildStepMonitor$1.perform(BuildStepMonitor.java:20)
	at hudson.model.AbstractBuild$AbstractBuildExecution.perform(AbstractBuild.java:776)
	at hudson.model.AbstractBuild$AbstractBuildExecution.performAllBuildSteps(AbstractBuild.java:723)
	at hudson.model.Build$BuildExecution.post2(Build.java:183)
	at hudson.model.AbstractBuild$AbstractBuildExecution.post(AbstractBuild.java:670)
	at hudson.model.Run.execute(Run.java:1763)
	at hudson.model.FreeStyleBuild.run(FreeStyleBuild.java:43)
	at hudson.model.ResourceController.execute(ResourceController.java:98)
	at hudson.model.Executor.run(Executor.java:381)

Mime
View raw message