maven-notifications mailing list archives

Site index · List index
Message view « Date » · « Thread »
Top « Date » · « Thread »
From Apache Jenkins Server <jenk...@builds.apache.org>
Subject Build failed in Jenkins: maven-plugins-ITs-m3.0.4 #1499
Date Sat, 06 Feb 2016 15:30:53 GMT
See <https://builds.apache.org/job/maven-plugins-ITs-m3.0.4/1499/changes>

Changes:

[khmarbaise] o Removed literal assignment of a default value
  for a plugin parameter which is already set by
  injection.
o Removed debug output of configuration.
o Refactored code a little bit.

------------------------------------------
[...truncated 6895 lines...]
[INFO] ------------------------------------------------------------------------
[INFO]                                                                         
[INFO] ------------------------------------------------------------------------
[INFO] Building Apache Maven GPG Plugin 1.7-SNAPSHOT
[INFO] ------------------------------------------------------------------------
[INFO] 
[INFO] --- maven-clean-plugin:2.5:clean (default-clean) @ maven-gpg-plugin ---
[INFO] Deleting /x1/jenkins/jenkins-slave/workspace/maven-plugins-ITs-m3.0.4/maven-gpg-plugin/target
[INFO] 
[INFO] --- maven-enforcer-plugin:1.3.1:enforce (enforce-bytecode-version) @ maven-gpg-plugin
---
[INFO] 
[INFO] --- maven-enforcer-plugin:1.3.1:enforce (ban-known-bad-maven-versions) @ maven-gpg-plugin
---
[INFO] 
[INFO] --- maven-enforcer-plugin:1.3.1:enforce (ensure-no-container-api) @ maven-gpg-plugin
---
[INFO] 
[INFO] --- apache-rat-plugin:0.11:check (rat-check) @ maven-gpg-plugin ---
[INFO] 51 implicit excludes (use -debug for more details).
[INFO] Exclude: src/test/resources/gnupg/*
[INFO] Exclude: DEPENDENCIES
[INFO] 66 resources included (use -debug for more details)
[INFO] Rat check: Summary of files. Unapproved: 0 unknown: 0 generated: 0 approved: 54 licence.
[INFO] 
[INFO] --- maven-plugin-plugin:3.4:helpmojo (generate-helpmojo) @ maven-gpg-plugin ---
[INFO] Using 'UTF-8' encoding to read mojo metadata.
[INFO] Mojo extractor with id: java-annotations found 0 mojo descriptors.
[INFO] Mojo extractor with id: java-javadoc found 0 mojo descriptors.
[INFO] 
[INFO] --- maven-remote-resources-plugin:1.5:process (default) @ maven-gpg-plugin ---
[INFO] 
[INFO] --- maven-resources-plugin:2.7:resources (default-resources) @ maven-gpg-plugin ---
[INFO] Using 'UTF-8' encoding to copy filtered resources.
[INFO] Copying 1 resource
[INFO] Copying 3 resources
[INFO] 
[INFO] --- maven-compiler-plugin:3.2:compile (default-compile) @ maven-gpg-plugin ---
[INFO] Changes detected - recompiling the module!
[INFO] Compiling 9 source files to /x1/jenkins/jenkins-slave/workspace/maven-plugins-ITs-m3.0.4/maven-gpg-plugin/target/classes
[INFO] Some input files use unchecked or unsafe operations.
[INFO] Recompile with -Xlint:unchecked for details.
[INFO] 
[INFO] --- maven-plugin-plugin:3.4:descriptor (default-descriptor) @ maven-gpg-plugin ---
[INFO] Using 'UTF-8' encoding to read mojo metadata.
[INFO] Mojo extractor with id: java-annotations found 3 mojo descriptors.
[INFO] Mojo extractor with id: java-javadoc found 0 mojo descriptors.
[INFO] 
[INFO] --- maven-resources-plugin:2.7:testResources (default-testResources) @ maven-gpg-plugin
---
[INFO] Using 'UTF-8' encoding to copy filtered resources.
[INFO] Copying 8 resources
[INFO] Copying 3 resources
[INFO] 
[INFO] --- maven-compiler-plugin:3.2:testCompile (default-testCompile) @ maven-gpg-plugin
---
[INFO] No sources to compile
[INFO] 
[INFO] --- maven-surefire-plugin:2.18.1:test (default-test) @ maven-gpg-plugin ---
[INFO] 
[INFO] --- maven-jar-plugin:2.5:jar (default-jar) @ maven-gpg-plugin ---
[INFO] Building jar: /x1/jenkins/jenkins-slave/workspace/maven-plugins-ITs-m3.0.4/maven-gpg-plugin/target/maven-gpg-plugin-1.7-SNAPSHOT.jar
[INFO] 
[INFO] --- maven-plugin-plugin:3.4:addPluginArtifactMetadata (default-addPluginArtifactMetadata)
@ maven-gpg-plugin ---
[INFO] 
[INFO] --- maven-invoker-plugin:2.0.0:install (integration-test) @ maven-gpg-plugin ---
[INFO] Installing /x1/jenkins/jenkins-slave/workspace/maven-plugins-ITs-m3.0.4/maven-acr-plugin/pom.xml
to /x1/jenkins/jenkins-slave/workspace/maven-plugins-ITs-m3.0.4/maven-gpg-plugin/target/local-repo/org/apache/maven/plugins/maven-acr-plugin/3.0.1-SNAPSHOT/maven-acr-plugin-3.0.1-SNAPSHOT.pom
[INFO] Installing /x1/jenkins/jenkins-slave/workspace/maven-plugins-ITs-m3.0.4/maven-ant-plugin/pom.xml
to /x1/jenkins/jenkins-slave/workspace/maven-plugins-ITs-m3.0.4/maven-gpg-plugin/target/local-repo/org/apache/maven/plugins/maven-ant-plugin/2.5-SNAPSHOT/maven-ant-plugin-2.5-SNAPSHOT.pom
[INFO] Installing /x1/jenkins/jenkins-slave/workspace/maven-plugins-ITs-m3.0.4/maven-ant-plugin/target/maven-ant-plugin-2.5-SNAPSHOT.jar
to /x1/jenkins/jenkins-slave/workspace/maven-plugins-ITs-m3.0.4/maven-gpg-plugin/target/local-repo/org/apache/maven/plugins/maven-ant-plugin/2.5-SNAPSHOT/maven-ant-plugin-2.5-SNAPSHOT.jar
[INFO] Installing /x1/jenkins/jenkins-slave/workspace/maven-plugins-ITs-m3.0.4/maven-ant-plugin/pom.xml
to /x1/jenkins/jenkins-slave/workspace/maven-plugins-ITs-m3.0.4/maven-gpg-plugin/target/local-repo/org/apache/maven/plugins/maven-ant-plugin/2.5-SNAPSHOT/maven-ant-plugin-2.5-SNAPSHOT.pom
[INFO] Installing /x1/jenkins/jenkins-slave/workspace/maven-plugins-ITs-m3.0.4/maven-antrun-plugin/pom.xml
to /x1/jenkins/jenkins-slave/workspace/maven-plugins-ITs-m3.0.4/maven-gpg-plugin/target/local-repo/org/apache/maven/plugins/maven-antrun-plugin/1.9-SNAPSHOT/maven-antrun-plugin-1.9-SNAPSHOT.pom
[INFO] Installing /x1/jenkins/jenkins-slave/workspace/maven-plugins-ITs-m3.0.4/maven-antrun-plugin/target/maven-antrun-plugin-1.9-SNAPSHOT.jar
to /x1/jenkins/jenkins-slave/workspace/maven-plugins-ITs-m3.0.4/maven-gpg-plugin/target/local-repo/org/apache/maven/plugins/maven-antrun-plugin/1.9-SNAPSHOT/maven-antrun-plugin-1.9-SNAPSHOT.jar
[INFO] Installing /x1/jenkins/jenkins-slave/workspace/maven-plugins-ITs-m3.0.4/maven-antrun-plugin/pom.xml
to /x1/jenkins/jenkins-slave/workspace/maven-plugins-ITs-m3.0.4/maven-gpg-plugin/target/local-repo/org/apache/maven/plugins/maven-antrun-plugin/1.9-SNAPSHOT/maven-antrun-plugin-1.9-SNAPSHOT.pom
[INFO] Installing /x1/jenkins/jenkins-slave/workspace/maven-plugins-ITs-m3.0.4/maven-changelog-plugin/pom.xml
to /x1/jenkins/jenkins-slave/workspace/maven-plugins-ITs-m3.0.4/maven-gpg-plugin/target/local-repo/org/apache/maven/plugins/maven-changelog-plugin/2.4-SNAPSHOT/maven-changelog-plugin-2.4-SNAPSHOT.pom
[INFO] Installing /x1/jenkins/jenkins-slave/workspace/maven-plugins-ITs-m3.0.4/maven-changelog-plugin/target/maven-changelog-plugin-2.4-SNAPSHOT.jar
to /x1/jenkins/jenkins-slave/workspace/maven-plugins-ITs-m3.0.4/maven-gpg-plugin/target/local-repo/org/apache/maven/plugins/maven-changelog-plugin/2.4-SNAPSHOT/maven-changelog-plugin-2.4-SNAPSHOT.jar
[INFO] Installing /x1/jenkins/jenkins-slave/workspace/maven-plugins-ITs-m3.0.4/maven-changelog-plugin/pom.xml
to /x1/jenkins/jenkins-slave/workspace/maven-plugins-ITs-m3.0.4/maven-gpg-plugin/target/local-repo/org/apache/maven/plugins/maven-changelog-plugin/2.4-SNAPSHOT/maven-changelog-plugin-2.4-SNAPSHOT.pom
[INFO] Installing /x1/jenkins/jenkins-slave/workspace/maven-plugins-ITs-m3.0.4/maven-changes-plugin/pom.xml
to /x1/jenkins/jenkins-slave/workspace/maven-plugins-ITs-m3.0.4/maven-gpg-plugin/target/local-repo/org/apache/maven/plugins/maven-changes-plugin/2.12-SNAPSHOT/maven-changes-plugin-2.12-SNAPSHOT.pom
[INFO] Installing /x1/jenkins/jenkins-slave/workspace/maven-plugins-ITs-m3.0.4/maven-changes-plugin/target/maven-changes-plugin-2.12-SNAPSHOT.jar
to /x1/jenkins/jenkins-slave/workspace/maven-plugins-ITs-m3.0.4/maven-gpg-plugin/target/local-repo/org/apache/maven/plugins/maven-changes-plugin/2.12-SNAPSHOT/maven-changes-plugin-2.12-SNAPSHOT.jar
[INFO] Installing /x1/jenkins/jenkins-slave/workspace/maven-plugins-ITs-m3.0.4/maven-changes-plugin/pom.xml
to /x1/jenkins/jenkins-slave/workspace/maven-plugins-ITs-m3.0.4/maven-gpg-plugin/target/local-repo/org/apache/maven/plugins/maven-changes-plugin/2.12-SNAPSHOT/maven-changes-plugin-2.12-SNAPSHOT.pom
[INFO] Installing /x1/jenkins/jenkins-slave/workspace/maven-plugins-ITs-m3.0.4/maven-clean-plugin/pom.xml
to /x1/jenkins/jenkins-slave/workspace/maven-plugins-ITs-m3.0.4/maven-gpg-plugin/target/local-repo/org/apache/maven/plugins/maven-clean-plugin/3.0.1-SNAPSHOT/maven-clean-plugin-3.0.1-SNAPSHOT.pom
[INFO] Installing /x1/jenkins/jenkins-slave/workspace/maven-plugins-ITs-m3.0.4/maven-clean-plugin/target/maven-clean-plugin-3.0.1-SNAPSHOT.jar
to /x1/jenkins/jenkins-slave/workspace/maven-plugins-ITs-m3.0.4/maven-gpg-plugin/target/local-repo/org/apache/maven/plugins/maven-clean-plugin/3.0.1-SNAPSHOT/maven-clean-plugin-3.0.1-SNAPSHOT.jar
[INFO] Installing /x1/jenkins/jenkins-slave/workspace/maven-plugins-ITs-m3.0.4/maven-clean-plugin/pom.xml
to /x1/jenkins/jenkins-slave/workspace/maven-plugins-ITs-m3.0.4/maven-gpg-plugin/target/local-repo/org/apache/maven/plugins/maven-clean-plugin/3.0.1-SNAPSHOT/maven-clean-plugin-3.0.1-SNAPSHOT.pom
[INFO] Installing /x1/jenkins/jenkins-slave/workspace/maven-plugins-ITs-m3.0.4/maven-compiler-plugin/pom.xml
to /x1/jenkins/jenkins-slave/workspace/maven-plugins-ITs-m3.0.4/maven-gpg-plugin/target/local-repo/org/apache/maven/plugins/maven-compiler-plugin/3.6-SNAPSHOT/maven-compiler-plugin-3.6-SNAPSHOT.pom
[INFO] Installing /x1/jenkins/jenkins-slave/workspace/maven-plugins-ITs-m3.0.4/maven-compiler-plugin/target/maven-compiler-plugin-3.6-SNAPSHOT.jar
to /x1/jenkins/jenkins-slave/workspace/maven-plugins-ITs-m3.0.4/maven-gpg-plugin/target/local-repo/org/apache/maven/plugins/maven-compiler-plugin/3.6-SNAPSHOT/maven-compiler-plugin-3.6-SNAPSHOT.jar
[INFO] Installing /x1/jenkins/jenkins-slave/workspace/maven-plugins-ITs-m3.0.4/maven-compiler-plugin/pom.xml
to /x1/jenkins/jenkins-slave/workspace/maven-plugins-ITs-m3.0.4/maven-gpg-plugin/target/local-repo/org/apache/maven/plugins/maven-compiler-plugin/3.6-SNAPSHOT/maven-compiler-plugin-3.6-SNAPSHOT.pom
[INFO] Installing /x1/jenkins/jenkins-slave/workspace/maven-plugins-ITs-m3.0.4/maven-deploy-plugin/pom.xml
to /x1/jenkins/jenkins-slave/workspace/maven-plugins-ITs-m3.0.4/maven-gpg-plugin/target/local-repo/org/apache/maven/plugins/maven-deploy-plugin/3.0-SNAPSHOT/maven-deploy-plugin-3.0-SNAPSHOT.pom
[INFO] Installing /x1/jenkins/jenkins-slave/workspace/maven-plugins-ITs-m3.0.4/maven-deploy-plugin/target/maven-deploy-plugin-3.0-SNAPSHOT.jar
to /x1/jenkins/jenkins-slave/workspace/maven-plugins-ITs-m3.0.4/maven-gpg-plugin/target/local-repo/org/apache/maven/plugins/maven-deploy-plugin/3.0-SNAPSHOT/maven-deploy-plugin-3.0-SNAPSHOT.jar
[INFO] Installing /x1/jenkins/jenkins-slave/workspace/maven-plugins-ITs-m3.0.4/maven-deploy-plugin/pom.xml
to /x1/jenkins/jenkins-slave/workspace/maven-plugins-ITs-m3.0.4/maven-gpg-plugin/target/local-repo/org/apache/maven/plugins/maven-deploy-plugin/3.0-SNAPSHOT/maven-deploy-plugin-3.0-SNAPSHOT.pom
[INFO] Installing /x1/jenkins/jenkins-slave/workspace/maven-plugins-ITs-m3.0.4/maven-docck-plugin/pom.xml
to /x1/jenkins/jenkins-slave/workspace/maven-plugins-ITs-m3.0.4/maven-gpg-plugin/target/local-repo/org/apache/maven/plugins/maven-docck-plugin/1.2-SNAPSHOT/maven-docck-plugin-1.2-SNAPSHOT.pom
[INFO] Installing /x1/jenkins/jenkins-slave/workspace/maven-plugins-ITs-m3.0.4/maven-docck-plugin/target/maven-docck-plugin-1.2-SNAPSHOT.jar
to /x1/jenkins/jenkins-slave/workspace/maven-plugins-ITs-m3.0.4/maven-gpg-plugin/target/local-repo/org/apache/maven/plugins/maven-docck-plugin/1.2-SNAPSHOT/maven-docck-plugin-1.2-SNAPSHOT.jar
[INFO] Installing /x1/jenkins/jenkins-slave/workspace/maven-plugins-ITs-m3.0.4/maven-docck-plugin/pom.xml
to /x1/jenkins/jenkins-slave/workspace/maven-plugins-ITs-m3.0.4/maven-gpg-plugin/target/local-repo/org/apache/maven/plugins/maven-docck-plugin/1.2-SNAPSHOT/maven-docck-plugin-1.2-SNAPSHOT.pom
[INFO] Installing /x1/jenkins/jenkins-slave/workspace/maven-plugins-ITs-m3.0.4/maven-ear-plugin/pom.xml
to /x1/jenkins/jenkins-slave/workspace/maven-plugins-ITs-m3.0.4/maven-gpg-plugin/target/local-repo/org/apache/maven/plugins/maven-ear-plugin/2.10.2-SNAPSHOT/maven-ear-plugin-2.10.2-SNAPSHOT.pom
[INFO] Installing /x1/jenkins/jenkins-slave/workspace/maven-plugins-ITs-m3.0.4/maven-ejb-plugin/pom.xml
to /x1/jenkins/jenkins-slave/workspace/maven-plugins-ITs-m3.0.4/maven-gpg-plugin/target/local-repo/org/apache/maven/plugins/maven-ejb-plugin/2.5.2-SNAPSHOT/maven-ejb-plugin-2.5.2-SNAPSHOT.pom
[INFO] Installing /x1/jenkins/jenkins-slave/workspace/maven-plugins-ITs-m3.0.4/maven-help-plugin/pom.xml
to /x1/jenkins/jenkins-slave/workspace/maven-plugins-ITs-m3.0.4/maven-gpg-plugin/target/local-repo/org/apache/maven/plugins/maven-help-plugin/2.2.1-SNAPSHOT/maven-help-plugin-2.2.1-SNAPSHOT.pom
[INFO] Installing /x1/jenkins/jenkins-slave/workspace/maven-plugins-ITs-m3.0.4/maven-help-plugin/target/maven-help-plugin-2.2.1-SNAPSHOT.jar
to /x1/jenkins/jenkins-slave/workspace/maven-plugins-ITs-m3.0.4/maven-gpg-plugin/target/local-repo/org/apache/maven/plugins/maven-help-plugin/2.2.1-SNAPSHOT/maven-help-plugin-2.2.1-SNAPSHOT.jar
[INFO] Installing /x1/jenkins/jenkins-slave/workspace/maven-plugins-ITs-m3.0.4/maven-help-plugin/pom.xml
to /x1/jenkins/jenkins-slave/workspace/maven-plugins-ITs-m3.0.4/maven-gpg-plugin/target/local-repo/org/apache/maven/plugins/maven-help-plugin/2.2.1-SNAPSHOT/maven-help-plugin-2.2.1-SNAPSHOT.pom
[INFO] Installing /x1/jenkins/jenkins-slave/workspace/maven-plugins-ITs-m3.0.4/maven-install-plugin/pom.xml
to /x1/jenkins/jenkins-slave/workspace/maven-plugins-ITs-m3.0.4/maven-gpg-plugin/target/local-repo/org/apache/maven/plugins/maven-install-plugin/3.0-SNAPSHOT/maven-install-plugin-3.0-SNAPSHOT.pom
[INFO] Installing /x1/jenkins/jenkins-slave/workspace/maven-plugins-ITs-m3.0.4/maven-install-plugin/target/maven-install-plugin-3.0-SNAPSHOT.jar
to /x1/jenkins/jenkins-slave/workspace/maven-plugins-ITs-m3.0.4/maven-gpg-plugin/target/local-repo/org/apache/maven/plugins/maven-install-plugin/3.0-SNAPSHOT/maven-install-plugin-3.0-SNAPSHOT.jar
[INFO] Installing /x1/jenkins/jenkins-slave/workspace/maven-plugins-ITs-m3.0.4/maven-install-plugin/pom.xml
to /x1/jenkins/jenkins-slave/workspace/maven-plugins-ITs-m3.0.4/maven-gpg-plugin/target/local-repo/org/apache/maven/plugins/maven-install-plugin/3.0-SNAPSHOT/maven-install-plugin-3.0-SNAPSHOT.pom
[INFO] Installing /x1/jenkins/jenkins-slave/workspace/maven-plugins-ITs-m3.0.4/maven-jarsigner-plugin/pom.xml
to /x1/jenkins/jenkins-slave/workspace/maven-plugins-ITs-m3.0.4/maven-gpg-plugin/target/local-repo/org/apache/maven/plugins/maven-jarsigner-plugin/1.5-SNAPSHOT/maven-jarsigner-plugin-1.5-SNAPSHOT.pom
[INFO] Installing /x1/jenkins/jenkins-slave/workspace/maven-plugins-ITs-m3.0.4/maven-jarsigner-plugin/target/maven-jarsigner-plugin-1.5-SNAPSHOT.jar
to /x1/jenkins/jenkins-slave/workspace/maven-plugins-ITs-m3.0.4/maven-gpg-plugin/target/local-repo/org/apache/maven/plugins/maven-jarsigner-plugin/1.5-SNAPSHOT/maven-jarsigner-plugin-1.5-SNAPSHOT.jar
[INFO] Installing /x1/jenkins/jenkins-slave/workspace/maven-plugins-ITs-m3.0.4/maven-jarsigner-plugin/pom.xml
to /x1/jenkins/jenkins-slave/workspace/maven-plugins-ITs-m3.0.4/maven-gpg-plugin/target/local-repo/org/apache/maven/plugins/maven-jarsigner-plugin/1.5-SNAPSHOT/maven-jarsigner-plugin-1.5-SNAPSHOT.pom
[INFO] Installing /x1/jenkins/jenkins-slave/workspace/maven-plugins-ITs-m3.0.4/maven-javadoc-plugin/pom.xml
to /x1/jenkins/jenkins-slave/workspace/maven-plugins-ITs-m3.0.4/maven-gpg-plugin/target/local-repo/org/apache/maven/plugins/maven-javadoc-plugin/2.10.4-SNAPSHOT/maven-javadoc-plugin-2.10.4-SNAPSHOT.pom
[INFO] Installing /x1/jenkins/jenkins-slave/workspace/maven-plugins-ITs-m3.0.4/maven-javadoc-plugin/target/maven-javadoc-plugin-2.10.4-SNAPSHOT.jar
to /x1/jenkins/jenkins-slave/workspace/maven-plugins-ITs-m3.0.4/maven-gpg-plugin/target/local-repo/org/apache/maven/plugins/maven-javadoc-plugin/2.10.4-SNAPSHOT/maven-javadoc-plugin-2.10.4-SNAPSHOT.jar
[INFO] Installing /x1/jenkins/jenkins-slave/workspace/maven-plugins-ITs-m3.0.4/maven-javadoc-plugin/pom.xml
to /x1/jenkins/jenkins-slave/workspace/maven-plugins-ITs-m3.0.4/maven-gpg-plugin/target/local-repo/org/apache/maven/plugins/maven-javadoc-plugin/2.10.4-SNAPSHOT/maven-javadoc-plugin-2.10.4-SNAPSHOT.pom
[INFO] Installing /x1/jenkins/jenkins-slave/workspace/maven-plugins-ITs-m3.0.4/maven-linkcheck-plugin/pom.xml
to /x1/jenkins/jenkins-slave/workspace/maven-plugins-ITs-m3.0.4/maven-gpg-plugin/target/local-repo/org/apache/maven/plugins/maven-linkcheck-plugin/1.3-SNAPSHOT/maven-linkcheck-plugin-1.3-SNAPSHOT.pom
[INFO] Installing /x1/jenkins/jenkins-slave/workspace/maven-plugins-ITs-m3.0.4/maven-linkcheck-plugin/target/maven-linkcheck-plugin-1.3-SNAPSHOT.jar
to /x1/jenkins/jenkins-slave/workspace/maven-plugins-ITs-m3.0.4/maven-gpg-plugin/target/local-repo/org/apache/maven/plugins/maven-linkcheck-plugin/1.3-SNAPSHOT/maven-linkcheck-plugin-1.3-SNAPSHOT.jar
[INFO] Installing /x1/jenkins/jenkins-slave/workspace/maven-plugins-ITs-m3.0.4/maven-linkcheck-plugin/pom.xml
to /x1/jenkins/jenkins-slave/workspace/maven-plugins-ITs-m3.0.4/maven-gpg-plugin/target/local-repo/org/apache/maven/plugins/maven-linkcheck-plugin/1.3-SNAPSHOT/maven-linkcheck-plugin-1.3-SNAPSHOT.pom
[INFO] Installing /x1/jenkins/jenkins-slave/workspace/maven-plugins-ITs-m3.0.4/maven-patch-plugin/pom.xml
to /x1/jenkins/jenkins-slave/workspace/maven-plugins-ITs-m3.0.4/maven-gpg-plugin/target/local-repo/org/apache/maven/plugins/maven-patch-plugin/1.3-SNAPSHOT/maven-patch-plugin-1.3-SNAPSHOT.pom
[INFO] Installing /x1/jenkins/jenkins-slave/workspace/maven-plugins-ITs-m3.0.4/maven-patch-plugin/target/maven-patch-plugin-1.3-SNAPSHOT.jar
to /x1/jenkins/jenkins-slave/workspace/maven-plugins-ITs-m3.0.4/maven-gpg-plugin/target/local-repo/org/apache/maven/plugins/maven-patch-plugin/1.3-SNAPSHOT/maven-patch-plugin-1.3-SNAPSHOT.jar
[INFO] Installing /x1/jenkins/jenkins-slave/workspace/maven-plugins-ITs-m3.0.4/maven-patch-plugin/pom.xml
to /x1/jenkins/jenkins-slave/workspace/maven-plugins-ITs-m3.0.4/maven-gpg-plugin/target/local-repo/org/apache/maven/plugins/maven-patch-plugin/1.3-SNAPSHOT/maven-patch-plugin-1.3-SNAPSHOT.pom
[INFO] Installing /x1/jenkins/jenkins-slave/workspace/maven-plugins-ITs-m3.0.4/maven-pdf-plugin/pom.xml
to /x1/jenkins/jenkins-slave/workspace/maven-plugins-ITs-m3.0.4/maven-gpg-plugin/target/local-repo/org/apache/maven/plugins/maven-pdf-plugin/1.4-SNAPSHOT/maven-pdf-plugin-1.4-SNAPSHOT.pom
[INFO] Installing /x1/jenkins/jenkins-slave/workspace/maven-plugins-ITs-m3.0.4/maven-pdf-plugin/target/maven-pdf-plugin-1.4-SNAPSHOT.jar
to /x1/jenkins/jenkins-slave/workspace/maven-plugins-ITs-m3.0.4/maven-gpg-plugin/target/local-repo/org/apache/maven/plugins/maven-pdf-plugin/1.4-SNAPSHOT/maven-pdf-plugin-1.4-SNAPSHOT.jar
[INFO] Installing /x1/jenkins/jenkins-slave/workspace/maven-plugins-ITs-m3.0.4/maven-pdf-plugin/pom.xml
to /x1/jenkins/jenkins-slave/workspace/maven-plugins-ITs-m3.0.4/maven-gpg-plugin/target/local-repo/org/apache/maven/plugins/maven-pdf-plugin/1.4-SNAPSHOT/maven-pdf-plugin-1.4-SNAPSHOT.pom
[INFO] Installing /x1/jenkins/jenkins-slave/workspace/maven-plugins-ITs-m3.0.4/maven-rar-plugin/pom.xml
to /x1/jenkins/jenkins-slave/workspace/maven-plugins-ITs-m3.0.4/maven-gpg-plugin/target/local-repo/org/apache/maven/plugins/maven-rar-plugin/3.0.0-SNAPSHOT/maven-rar-plugin-3.0.0-SNAPSHOT.pom
[INFO] Installing /x1/jenkins/jenkins-slave/workspace/maven-plugins-ITs-m3.0.4/maven-repository-plugin/pom.xml
to /x1/jenkins/jenkins-slave/workspace/maven-plugins-ITs-m3.0.4/maven-gpg-plugin/target/local-repo/org/apache/maven/plugins/maven-repository-plugin/2.5-SNAPSHOT/maven-repository-plugin-2.5-SNAPSHOT.pom
[INFO] Installing /x1/jenkins/jenkins-slave/workspace/maven-plugins-ITs-m3.0.4/maven-repository-plugin/target/maven-repository-plugin-2.5-SNAPSHOT.jar
to /x1/jenkins/jenkins-slave/workspace/maven-plugins-ITs-m3.0.4/maven-gpg-plugin/target/local-repo/org/apache/maven/plugins/maven-repository-plugin/2.5-SNAPSHOT/maven-repository-plugin-2.5-SNAPSHOT.jar
[INFO] Installing /x1/jenkins/jenkins-slave/workspace/maven-plugins-ITs-m3.0.4/maven-repository-plugin/pom.xml
to /x1/jenkins/jenkins-slave/workspace/maven-plugins-ITs-m3.0.4/maven-gpg-plugin/target/local-repo/org/apache/maven/plugins/maven-repository-plugin/2.5-SNAPSHOT/maven-repository-plugin-2.5-SNAPSHOT.pom
[INFO] Installing /x1/jenkins/jenkins-slave/workspace/maven-plugins-ITs-m3.0.4/maven-resources-plugin/pom.xml
to /x1/jenkins/jenkins-slave/workspace/maven-plugins-ITs-m3.0.4/maven-gpg-plugin/target/local-repo/org/apache/maven/plugins/maven-resources-plugin/2.8-SNAPSHOT/maven-resources-plugin-2.8-SNAPSHOT.pom
[INFO] Installing /x1/jenkins/jenkins-slave/workspace/maven-plugins-ITs-m3.0.4/maven-resources-plugin/target/maven-resources-plugin-2.8-SNAPSHOT.jar
to /x1/jenkins/jenkins-slave/workspace/maven-plugins-ITs-m3.0.4/maven-gpg-plugin/target/local-repo/org/apache/maven/plugins/maven-resources-plugin/2.8-SNAPSHOT/maven-resources-plugin-2.8-SNAPSHOT.jar
[INFO] Installing /x1/jenkins/jenkins-slave/workspace/maven-plugins-ITs-m3.0.4/maven-resources-plugin/pom.xml
to /x1/jenkins/jenkins-slave/workspace/maven-plugins-ITs-m3.0.4/maven-gpg-plugin/target/local-repo/org/apache/maven/plugins/maven-resources-plugin/2.8-SNAPSHOT/maven-resources-plugin-2.8-SNAPSHOT.pom
[INFO] Installing /x1/jenkins/jenkins-slave/workspace/maven-plugins-ITs-m3.0.4/maven-resources-plugin/target/maven-resources-plugin-2.8-SNAPSHOT-tests.jar
to /x1/jenkins/jenkins-slave/workspace/maven-plugins-ITs-m3.0.4/maven-gpg-plugin/target/local-repo/org/apache/maven/plugins/maven-resources-plugin/2.8-SNAPSHOT/maven-resources-plugin-2.8-SNAPSHOT-tests.jar
[INFO] Installing /x1/jenkins/jenkins-slave/workspace/maven-plugins-ITs-m3.0.4/maven-site-plugin/dependency-reduced-pom.xml
to /x1/jenkins/jenkins-slave/workspace/maven-plugins-ITs-m3.0.4/maven-gpg-plugin/target/local-repo/org/apache/maven/plugins/maven-site-plugin/3.5-SNAPSHOT/maven-site-plugin-3.5-SNAPSHOT.pom
[INFO] Installing /x1/jenkins/jenkins-slave/workspace/maven-plugins-ITs-m3.0.4/maven-site-plugin/target/maven-site-plugin-3.5-SNAPSHOT.jar
to /x1/jenkins/jenkins-slave/workspace/maven-plugins-ITs-m3.0.4/maven-gpg-plugin/target/local-repo/org/apache/maven/plugins/maven-site-plugin/3.5-SNAPSHOT/maven-site-plugin-3.5-SNAPSHOT.jar
[INFO] Installing /x1/jenkins/jenkins-slave/workspace/maven-plugins-ITs-m3.0.4/maven-site-plugin/dependency-reduced-pom.xml
to /x1/jenkins/jenkins-slave/workspace/maven-plugins-ITs-m3.0.4/maven-gpg-plugin/target/local-repo/org/apache/maven/plugins/maven-site-plugin/3.5-SNAPSHOT/maven-site-plugin-3.5-SNAPSHOT.pom
[INFO] Installing /x1/jenkins/jenkins-slave/workspace/maven-plugins-ITs-m3.0.4/maven-source-plugin/pom.xml
to /x1/jenkins/jenkins-slave/workspace/maven-plugins-ITs-m3.0.4/maven-gpg-plugin/target/local-repo/org/apache/maven/plugins/maven-source-plugin/3.0.0-SNAPSHOT/maven-source-plugin-3.0.0-SNAPSHOT.pom
[INFO] Installing /x1/jenkins/jenkins-slave/workspace/maven-plugins-ITs-m3.0.4/maven-stage-plugin/pom.xml
to /x1/jenkins/jenkins-slave/workspace/maven-plugins-ITs-m3.0.4/maven-gpg-plugin/target/local-repo/org/apache/maven/plugins/maven-stage-plugin/1.1-SNAPSHOT/maven-stage-plugin-1.1-SNAPSHOT.pom
[INFO] Installing /x1/jenkins/jenkins-slave/workspace/maven-plugins-ITs-m3.0.4/maven-stage-plugin/target/maven-stage-plugin-1.1-SNAPSHOT.jar
to /x1/jenkins/jenkins-slave/workspace/maven-plugins-ITs-m3.0.4/maven-gpg-plugin/target/local-repo/org/apache/maven/plugins/maven-stage-plugin/1.1-SNAPSHOT/maven-stage-plugin-1.1-SNAPSHOT.jar
[INFO] Installing /x1/jenkins/jenkins-slave/workspace/maven-plugins-ITs-m3.0.4/maven-stage-plugin/pom.xml
to /x1/jenkins/jenkins-slave/workspace/maven-plugins-ITs-m3.0.4/maven-gpg-plugin/target/local-repo/org/apache/maven/plugins/maven-stage-plugin/1.1-SNAPSHOT/maven-stage-plugin-1.1-SNAPSHOT.pom
[INFO] Installing /x1/jenkins/jenkins-slave/workspace/maven-plugins-ITs-m3.0.4/maven-toolchains-plugin/pom.xml
to /x1/jenkins/jenkins-slave/workspace/maven-plugins-ITs-m3.0.4/maven-gpg-plugin/target/local-repo/org/apache/maven/plugins/maven-toolchains-plugin/1.2-SNAPSHOT/maven-toolchains-plugin-1.2-SNAPSHOT.pom
[INFO] Installing /x1/jenkins/jenkins-slave/workspace/maven-plugins-ITs-m3.0.4/maven-toolchains-plugin/target/maven-toolchains-plugin-1.2-SNAPSHOT.jar
to /x1/jenkins/jenkins-slave/workspace/maven-plugins-ITs-m3.0.4/maven-gpg-plugin/target/local-repo/org/apache/maven/plugins/maven-toolchains-plugin/1.2-SNAPSHOT/maven-toolchains-plugin-1.2-SNAPSHOT.jar
[INFO] Installing /x1/jenkins/jenkins-slave/workspace/maven-plugins-ITs-m3.0.4/maven-toolchains-plugin/pom.xml
to /x1/jenkins/jenkins-slave/workspace/maven-plugins-ITs-m3.0.4/maven-gpg-plugin/target/local-repo/org/apache/maven/plugins/maven-toolchains-plugin/1.2-SNAPSHOT/maven-toolchains-plugin-1.2-SNAPSHOT.pom
[INFO] Installing /x1/jenkins/jenkins-slave/workspace/maven-plugins-ITs-m3.0.4/maven-verifier-plugin/pom.xml
to /x1/jenkins/jenkins-slave/workspace/maven-plugins-ITs-m3.0.4/maven-gpg-plugin/target/local-repo/org/apache/maven/plugins/maven-verifier-plugin/3.0.0-SNAPSHOT/maven-verifier-plugin-3.0.0-SNAPSHOT.pom
[INFO] Installing /x1/jenkins/jenkins-slave/workspace/maven-plugins-ITs-m3.0.4/maven-verifier-plugin/target/maven-verifier-plugin-3.0.0-SNAPSHOT.jar
to /x1/jenkins/jenkins-slave/workspace/maven-plugins-ITs-m3.0.4/maven-gpg-plugin/target/local-repo/org/apache/maven/plugins/maven-verifier-plugin/3.0.0-SNAPSHOT/maven-verifier-plugin-3.0.0-SNAPSHOT.jar
[INFO] Installing /x1/jenkins/jenkins-slave/workspace/maven-plugins-ITs-m3.0.4/maven-verifier-plugin/pom.xml
to /x1/jenkins/jenkins-slave/workspace/maven-plugins-ITs-m3.0.4/maven-gpg-plugin/target/local-repo/org/apache/maven/plugins/maven-verifier-plugin/3.0.0-SNAPSHOT/maven-verifier-plugin-3.0.0-SNAPSHOT.pom
[INFO] Installing /x1/jenkins/jenkins-slave/workspace/maven-plugins-ITs-m3.0.4/maven-war-plugin/pom.xml
to /x1/jenkins/jenkins-slave/workspace/maven-plugins-ITs-m3.0.4/maven-gpg-plugin/target/local-repo/org/apache/maven/plugins/maven-war-plugin/3.0.0-SNAPSHOT/maven-war-plugin-3.0.0-SNAPSHOT.pom
[INFO] Installing /x1/jenkins/jenkins-slave/workspace/maven-plugins-ITs-m3.0.4/maven-doap-plugin/pom.xml
to /x1/jenkins/jenkins-slave/workspace/maven-plugins-ITs-m3.0.4/maven-gpg-plugin/target/local-repo/org/apache/maven/plugins/maven-doap-plugin/1.3-SNAPSHOT/maven-doap-plugin-1.3-SNAPSHOT.pom
[INFO] Installing /x1/jenkins/jenkins-slave/workspace/maven-plugins-ITs-m3.0.4/maven-doap-plugin/target/maven-doap-plugin-1.3-SNAPSHOT.jar
to /x1/jenkins/jenkins-slave/workspace/maven-plugins-ITs-m3.0.4/maven-gpg-plugin/target/local-repo/org/apache/maven/plugins/maven-doap-plugin/1.3-SNAPSHOT/maven-doap-plugin-1.3-SNAPSHOT.jar
[INFO] Installing /x1/jenkins/jenkins-slave/workspace/maven-plugins-ITs-m3.0.4/maven-doap-plugin/pom.xml
to /x1/jenkins/jenkins-slave/workspace/maven-plugins-ITs-m3.0.4/maven-gpg-plugin/target/local-repo/org/apache/maven/plugins/maven-doap-plugin/1.3-SNAPSHOT/maven-doap-plugin-1.3-SNAPSHOT.pom
[INFO] Installing /x1/jenkins/jenkins-slave/workspace/maven-plugins-ITs-m3.0.4/maven-pmd-plugin/pom.xml
to /x1/jenkins/jenkins-slave/workspace/maven-plugins-ITs-m3.0.4/maven-gpg-plugin/target/local-repo/org/apache/maven/plugins/maven-pmd-plugin/3.7-SNAPSHOT/maven-pmd-plugin-3.7-SNAPSHOT.pom
[INFO] Installing /x1/jenkins/jenkins-slave/workspace/maven-plugins-ITs-m3.0.4/maven-pmd-plugin/target/maven-pmd-plugin-3.7-SNAPSHOT.jar
to /x1/jenkins/jenkins-slave/workspace/maven-plugins-ITs-m3.0.4/maven-gpg-plugin/target/local-repo/org/apache/maven/plugins/maven-pmd-plugin/3.7-SNAPSHOT/maven-pmd-plugin-3.7-SNAPSHOT.jar
[INFO] Installing /x1/jenkins/jenkins-slave/workspace/maven-plugins-ITs-m3.0.4/maven-pmd-plugin/pom.xml
to /x1/jenkins/jenkins-slave/workspace/maven-plugins-ITs-m3.0.4/maven-gpg-plugin/target/local-repo/org/apache/maven/plugins/maven-pmd-plugin/3.7-SNAPSHOT/maven-pmd-plugin-3.7-SNAPSHOT.pom
[INFO] Installing /x1/jenkins/jenkins-slave/workspace/maven-plugins-ITs-m3.0.4/maven-invoker-plugin/pom.xml
to /x1/jenkins/jenkins-slave/workspace/maven-plugins-ITs-m3.0.4/maven-gpg-plugin/target/local-repo/org/apache/maven/plugins/maven-invoker-plugin/2.0.1-SNAPSHOT/maven-invoker-plugin-2.0.1-SNAPSHOT.pom
[INFO] Installing /x1/jenkins/jenkins-slave/workspace/maven-plugins-ITs-m3.0.4/maven-invoker-plugin/target/maven-invoker-plugin-2.0.1-SNAPSHOT.jar
to /x1/jenkins/jenkins-slave/workspace/maven-plugins-ITs-m3.0.4/maven-gpg-plugin/target/local-repo/org/apache/maven/plugins/maven-invoker-plugin/2.0.1-SNAPSHOT/maven-invoker-plugin-2.0.1-SNAPSHOT.jar
[INFO] Installing /x1/jenkins/jenkins-slave/workspace/maven-plugins-ITs-m3.0.4/maven-invoker-plugin/pom.xml
to /x1/jenkins/jenkins-slave/workspace/maven-plugins-ITs-m3.0.4/maven-gpg-plugin/target/local-repo/org/apache/maven/plugins/maven-invoker-plugin/2.0.1-SNAPSHOT/maven-invoker-plugin-2.0.1-SNAPSHOT.pom
[INFO] Installing /x1/jenkins/jenkins-slave/workspace/maven-plugins-ITs-m3.0.4/maven-jar-plugin/pom.xml
to /x1/jenkins/jenkins-slave/workspace/maven-plugins-ITs-m3.0.4/maven-gpg-plugin/target/local-repo/org/apache/maven/plugins/maven-jar-plugin/3.0.0-SNAPSHOT/maven-jar-plugin-3.0.0-SNAPSHOT.pom
[INFO] Installing /x1/jenkins/jenkins-slave/workspace/maven-plugins-ITs-m3.0.4/maven-gpg-plugin/pom.xml
to /x1/jenkins/jenkins-slave/workspace/maven-plugins-ITs-m3.0.4/maven-gpg-plugin/target/local-repo/org/apache/maven/plugins/maven-gpg-plugin/1.7-SNAPSHOT/maven-gpg-plugin-1.7-SNAPSHOT.pom
[INFO] Installing /x1/jenkins/jenkins-slave/workspace/maven-plugins-ITs-m3.0.4/maven-gpg-plugin/target/maven-gpg-plugin-1.7-SNAPSHOT.jar
to /x1/jenkins/jenkins-slave/workspace/maven-plugins-ITs-m3.0.4/maven-gpg-plugin/target/local-repo/org/apache/maven/plugins/maven-gpg-plugin/1.7-SNAPSHOT/maven-gpg-plugin-1.7-SNAPSHOT.jar
[INFO] 
[INFO] --- maven-invoker-plugin:2.0.0:integration-test (integration-test) @ maven-gpg-plugin
---
[INFO] Building: alternative-secret-keyring/pom.xml
[INFO] run script verify.bsh
[INFO] ..SUCCESS (2.9 s)
[INFO] Building: sign-with-passphase-from-maven-settings/pom.xml
[INFO] run script verify.bsh
[INFO] ..SUCCESS (2.5 s)
[INFO] Building: no-main-artifact/pom.xml
[INFO] run script verify.bsh
[INFO] ..SUCCESS (2.2 s)
[INFO] Building: sign-release/pom.xml
[INFO] run script verify.bsh
[INFO] ..SUCCESS (2.3 s)
[INFO] 
[INFO] --- maven-invoker-plugin:2.0.0:verify (integration-test) @ maven-gpg-plugin ---
[INFO] -------------------------------------------------
[INFO] Build Summary:
[INFO]   Passed: 4, Failed: 0, Errors: 0, Skipped: 0
[INFO] -------------------------------------------------
[INFO] 
[INFO] --- maven-checkstyle-plugin:2.15:check (checkstyle-check) @ maven-gpg-plugin ---
[INFO] There is 1 error reported by Checkstyle 6.1.1 with config/maven_checks.xml ruleset.
[INFO] Ignored 1 error, 0 violation remaining.
[INFO] 
[INFO] --- maven-install-plugin:2.5.2:install (default-install) @ maven-gpg-plugin ---
[INFO] Installing /x1/jenkins/jenkins-slave/workspace/maven-plugins-ITs-m3.0.4/maven-gpg-plugin/target/maven-gpg-plugin-1.7-SNAPSHOT.jar
to /home/jenkins/.m2/repository/org/apache/maven/plugins/maven-gpg-plugin/1.7-SNAPSHOT/maven-gpg-plugin-1.7-SNAPSHOT.jar
[INFO] Installing /x1/jenkins/jenkins-slave/workspace/maven-plugins-ITs-m3.0.4/maven-gpg-plugin/pom.xml
to /home/jenkins/.m2/repository/org/apache/maven/plugins/maven-gpg-plugin/1.7-SNAPSHOT/maven-gpg-plugin-1.7-SNAPSHOT.pom
[INFO]                                                                         
[INFO] ------------------------------------------------------------------------
[INFO] Building Apache Maven Plugins Aggregator 1-SNAPSHOT
[INFO] ------------------------------------------------------------------------
[INFO] 
[INFO] --- maven-clean-plugin:2.5:clean (default-clean) @ maven-plugins-aggregator ---
[INFO] Deleting /x1/jenkins/jenkins-slave/workspace/maven-plugins-ITs-m3.0.4/target
[INFO] 
[INFO] --- maven-enforcer-plugin:1.3.1:enforce (enforce-bytecode-version) @ maven-plugins-aggregator
---
[INFO] 
[INFO] --- maven-enforcer-plugin:1.3.1:enforce (ban-known-bad-maven-versions) @ maven-plugins-aggregator
---
[INFO] 
[INFO] --- maven-remote-resources-plugin:1.5:process (default) @ maven-plugins-aggregator
---
[INFO] 
[INFO] --- maven-site-plugin:3.3:attach-descriptor (attach-descriptor) @ maven-plugins-aggregator
---
[INFO] 
[INFO] --- maven-install-plugin:2.5.1:install (default-install) @ maven-plugins-aggregator
---
[INFO] Installing /x1/jenkins/jenkins-slave/workspace/maven-plugins-ITs-m3.0.4/pom.xml to
/home/jenkins/.m2/repository/org/apache/maven/plugins/maven-plugins-aggregator/1-SNAPSHOT/maven-plugins-aggregator-1-SNAPSHOT.pom
[INFO] ------------------------------------------------------------------------
[INFO] Reactor Summary:
[INFO] 
[INFO] Apache Maven ACR Plugin ........................... FAILURE [1.090s]
[INFO] Apache Maven Ant Plugin ........................... SUCCESS [1:06.998s]
[INFO] Apache Maven AntRun Plugin ........................ SUCCESS [49.179s]
[INFO] Apache Maven Changelog Plugin ..................... SUCCESS [40.238s]
[INFO] Apache Maven Changes Plugin ....................... SUCCESS [51.956s]
[INFO] Apache Maven Clean Plugin ......................... SUCCESS [22.621s]
[INFO] Apache Maven Compiler Plugin ...................... SUCCESS [1:49.544s]
[INFO] Apache Maven Deploy Plugin ........................ SUCCESS [1:22.466s]
[INFO] Apache Maven Documentation Checker Plugin ......... SUCCESS [5.775s]
[INFO] Apache Maven EAR Plugin ........................... FAILURE [0.049s]
[INFO] Apache Maven EJB Plugin ........................... FAILURE [0.014s]
[INFO] Apache Maven Help Plugin .......................... SUCCESS [44.821s]
[INFO] Apache Maven Install Plugin ....................... SUCCESS [1:06.814s]
[INFO] Apache Maven Jarsigner Plugin ..................... SUCCESS [32.412s]
[INFO] Apache Maven Javadoc Plugin ....................... SUCCESS [3:28.760s]
[INFO] Apache Maven Linkcheck Plugin ..................... SUCCESS [4.104s]
[INFO] Apache Maven Patch Plugin ......................... SUCCESS [10.461s]
[INFO] Apache Maven PDF Plugin ........................... SUCCESS [28.145s]
[INFO] Apache Maven RAR Plugin ........................... FAILURE [0.011s]
[INFO] Apache Maven Repository Plugin .................... SUCCESS [26.750s]
[INFO] Apache Maven Resources Plugin ..................... SUCCESS [1:00.335s]
[INFO] Apache Maven Site Plugin .......................... SUCCESS [6:47.739s]
[INFO] Apache Maven Source Plugin ........................ FAILURE [0.015s]
[INFO] Apache Maven Stage Plugin ......................... SUCCESS [4.714s]
[INFO] Apache Maven Toolchains Plugin .................... SUCCESS [20.571s]
[INFO] Apache Maven Verifier Plugin ...................... SUCCESS [9.210s]
[INFO] Apache Maven WAR Plugin ........................... FAILURE [0.042s]
[INFO] Apache Maven DOAP Plugin .......................... SUCCESS [20.682s]
[INFO] Apache Maven PMD Plugin ........................... SUCCESS [1:50.066s]
[INFO] Apache Maven Invoker Plugin ....................... SUCCESS [4:36.003s]
[INFO] Apache Maven JAR Plugin ........................... FAILURE [0.007s]
[INFO] Apache Maven GPG Plugin ........................... SUCCESS [12.314s]
[INFO] Apache Maven Plugins Aggregator ................... SUCCESS [0.319s]
[INFO] ------------------------------------------------------------------------
[INFO] BUILD FAILURE
[INFO] ------------------------------------------------------------------------
[INFO] Total time: 29:35.254s
[INFO] Finished at: Sat Feb 06 15:30:55 UTC 2016
[INFO] Final Memory: 83M/423M
[INFO] ------------------------------------------------------------------------
[WARNING] The requested profile "apache.snapshots" could not be activated because it does
not exist.
[ERROR] Failed to execute goal on project maven-acr-plugin: Could not resolve dependencies
for project org.apache.maven.plugins:maven-acr-plugin:maven-plugin:3.0.1-SNAPSHOT: Could not
find artifact org.codehaus.plexus:plexus-archiver:jar:3.0.3 in central (http://repo.maven.apache.org/maven2)
-> [Help 1]
[ERROR] Failed to execute goal on project maven-ear-plugin: Could not resolve dependencies
for project org.apache.maven.plugins:maven-ear-plugin:maven-plugin:2.10.2-SNAPSHOT: Failure
to find org.codehaus.plexus:plexus-archiver:jar:3.0.3 in http://repo.maven.apache.org/maven2
was cached in the local repository, resolution will not be reattempted until the update interval
of central has elapsed or updates are forced -> [Help 1]
[ERROR] Failed to execute goal on project maven-ejb-plugin: Could not resolve dependencies
for project org.apache.maven.plugins:maven-ejb-plugin:maven-plugin:2.5.2-SNAPSHOT: Failure
to find org.codehaus.plexus:plexus-archiver:jar:3.0.3 in http://repo.maven.apache.org/maven2
was cached in the local repository, resolution will not be reattempted until the update interval
of central has elapsed or updates are forced -> [Help 1]
[ERROR] Failed to execute goal on project maven-rar-plugin: Could not resolve dependencies
for project org.apache.maven.plugins:maven-rar-plugin:maven-plugin:3.0.0-SNAPSHOT: Failure
to find org.codehaus.plexus:plexus-archiver:jar:3.0.3 in http://repo.maven.apache.org/maven2
was cached in the local repository, resolution will not be reattempted until the update interval
of central has elapsed or updates are forced -> [Help 1]
[ERROR] Failed to execute goal on project maven-source-plugin: Could not resolve dependencies
for project org.apache.maven.plugins:maven-source-plugin:maven-plugin:3.0.0-SNAPSHOT: Failure
to find org.codehaus.plexus:plexus-archiver:jar:3.0.3 in http://repo.maven.apache.org/maven2
was cached in the local repository, resolution will not be reattempted until the update interval
of central has elapsed or updates are forced -> [Help 1]
[ERROR] Failed to execute goal on project maven-war-plugin: Could not resolve dependencies
for project org.apache.maven.plugins:maven-war-plugin:maven-plugin:3.0.0-SNAPSHOT: Failure
to find org.codehaus.plexus:plexus-archiver:jar:3.0.3 in http://repo.maven.apache.org/maven2
was cached in the local repository, resolution will not be reattempted until the update interval
of central has elapsed or updates are forced -> [Help 1]
[ERROR] Failed to execute goal on project maven-jar-plugin: Could not resolve dependencies
for project org.apache.maven.plugins:maven-jar-plugin:maven-plugin:3.0.0-SNAPSHOT: Failure
to find org.codehaus.plexus:plexus-archiver:jar:3.0.3 in http://repo.maven.apache.org/maven2
was cached in the local repository, resolution will not be reattempted until the update interval
of central has elapsed or updates are forced -> [Help 1]
[ERROR] 
[ERROR] To see the full stack trace of the errors, re-run Maven with the -e switch.
[ERROR] Re-run Maven using the -X switch to enable full debug logging.
[ERROR] 
[ERROR] For more information about the errors and possible solutions, please read the following
articles:
[ERROR] [Help 1] http://cwiki.apache.org/confluence/display/MAVEN/DependencyResolutionException
Build step 'Invoke top-level Maven targets' marked build as failure
Deleting 1 temporary files
Recording test results

Mime
View raw message