maven-notifications mailing list archives

Site index · List index
Message view « Date » · « Thread »
Top « Date » · « Thread »
From Apache Jenkins Server <jenk...@builds.apache.org>
Subject Build failed in Jenkins: maven-skins #235
Date Mon, 08 Feb 2016 21:19:22 GMT
See <https://builds.apache.org/job/maven-skins/235/>

------------------------------------------
[...truncated 236 lines...]
Downloaded: http://repository.apache.org/snapshots/org/apache/maven/doxia/doxia-module-fml/1.7-SNAPSHOT/doxia-module-fml-1.7-20160202.202741-80.jar
(38 KB at 473.5 KB/sec)
Downloaded: http://repository.apache.org/snapshots/org/apache/maven/doxia/doxia-core/1.7-SNAPSHOT/doxia-core-1.7-20160202.202725-80.jar
(164 KB at 731.8 KB/sec)
Downloaded: http://repository.apache.org/snapshots/org/apache/maven/doxia/doxia-decoration-model/1.7-SNAPSHOT/doxia-decoration-model-1.7-20160208.183239-97.jar
(61 KB at 525.0 KB/sec)
Downloaded: http://repository.apache.org/snapshots/org/apache/maven/doxia/doxia-site-renderer/1.7-SNAPSHOT/doxia-site-renderer-1.7-20160208.072957-98.jar
(63 KB at 602.6 KB/sec)
Downloaded: http://repository.apache.org/snapshots/org/apache/maven/doxia/doxia-integration-tools/1.7-SNAPSHOT/doxia-integration-tools-1.7-20160208.183338-123.jar
(46 KB at 462.3 KB/sec)
[INFO] 
[INFO] --- maven-invoker-plugin:1.10:install (integration-test) @ maven-fluido-skin ---
[INFO] Installing <https://builds.apache.org/job/maven-skins/ws/maven-default-skin/pom.xml>
to <https://builds.apache.org/job/maven-skins/ws/maven-fluido-skin/target/local-repo/org/apache/maven/skins/maven-default-skin/1.2-SNAPSHOT/maven-default-skin-1.2-SNAPSHOT.pom>
[INFO] Installing <https://builds.apache.org/job/maven-skins/ws/maven-default-skin/target/maven-default-skin-1.2-SNAPSHOT.jar>
to <https://builds.apache.org/job/maven-skins/ws/maven-fluido-skin/target/local-repo/org/apache/maven/skins/maven-default-skin/1.2-SNAPSHOT/maven-default-skin-1.2-SNAPSHOT.jar>
[INFO] Installing <https://builds.apache.org/job/maven-skins/ws/maven-default-skin/pom.xml>
to <https://builds.apache.org/job/maven-skins/ws/maven-fluido-skin/target/local-repo/org/apache/maven/skins/maven-default-skin/1.2-SNAPSHOT/maven-default-skin-1.2-SNAPSHOT.pom>
[INFO] Installing <https://builds.apache.org/job/maven-skins/ws/maven-fluido-skin/pom.xml>
to <https://builds.apache.org/job/maven-skins/ws/maven-fluido-skin/target/local-repo/org/apache/maven/skins/maven-fluido-skin/1.5-SNAPSHOT/maven-fluido-skin-1.5-SNAPSHOT.pom>
[INFO] Installing <https://builds.apache.org/job/maven-skins/ws/maven-fluido-skin/target/maven-fluido-skin-1.5-SNAPSHOT.jar>
to <https://builds.apache.org/job/maven-skins/ws/maven-fluido-skin/target/local-repo/org/apache/maven/skins/maven-fluido-skin/1.5-SNAPSHOT/maven-fluido-skin-1.5-SNAPSHOT.jar>
[INFO] 
[INFO] --- maven-invoker-plugin:1.10:integration-test (integration-test) @ maven-fluido-skin
---
[INFO] Building: mskins-75/pom.xml
[INFO] ..FAILED (25.2 s)
[INFO]   The build exited with code 1. See <https://builds.apache.org/job/maven-skins/ws/maven-fluido-skin/target/it/mskins-75/build.log>
for details.
[INFO] Building: mskins-21/pom.xml
[INFO] ..FAILED (16.7 s)
[INFO]   The build exited with code 1. See <https://builds.apache.org/job/maven-skins/ws/maven-fluido-skin/target/it/mskins-21/build.log>
for details.
[INFO] Building: mskins-10/pom.xml
[INFO] ..FAILED (14.7 s)
[INFO]   The build exited with code 1. See <https://builds.apache.org/job/maven-skins/ws/maven-fluido-skin/target/it/mskins-10/build.log>
for details.
[INFO] Building: mskins-33_topbar/pom.xml
[INFO] ..FAILED (16.2 s)
[INFO]   The build exited with code 1. See <https://builds.apache.org/job/maven-skins/ws/maven-fluido-skin/target/it/mskins-33_topbar/build.log>
for details.
[INFO] Building: mskins-14_sitesearch/pom.xml
[INFO] ..FAILED (19.3 s)
[INFO]   The build exited with code 1. See <https://builds.apache.org/job/maven-skins/ws/maven-fluido-skin/target/it/mskins-14_sitesearch/build.log>
for details.
[INFO] Building: mskins-33/pom.xml
[INFO] ..FAILED (16.0 s)
[INFO]   The build exited with code 1. See <https://builds.apache.org/job/maven-skins/ws/maven-fluido-skin/target/it/mskins-33/build.log>
for details.
[INFO] Building: mskins-72/pom.xml
[INFO] ..FAILED (13.0 s)
[INFO]   The build exited with code 1. See <https://builds.apache.org/job/maven-skins/ws/maven-fluido-skin/target/it/mskins-72/build.log>
for details.
[INFO] Building: mskins-76/pom.xml
[INFO] ..FAILED (17.0 s)
[INFO]   The build exited with code 1. See <https://builds.apache.org/job/maven-skins/ws/maven-fluido-skin/target/it/mskins-76/build.log>
for details.
[INFO] Building: mskins-34/pom.xml
[INFO] ..FAILED (17.3 s)
[INFO]   The build exited with code 1. See <https://builds.apache.org/job/maven-skins/ws/maven-fluido-skin/target/it/mskins-34/build.log>
for details.
[INFO] Building: mskins-17/pom.xml
[INFO] ..FAILED (19.5 s)
[INFO]   The build exited with code 1. See <https://builds.apache.org/job/maven-skins/ws/maven-fluido-skin/target/it/mskins-17/build.log>
for details.
[INFO] Building: mskins-14/pom.xml
[INFO] ..FAILED (14.7 s)
[INFO]   The build exited with code 1. See <https://builds.apache.org/job/maven-skins/ws/maven-fluido-skin/target/it/mskins-14/build.log>
for details.
[INFO] Building: mskins-24/pom.xml
[INFO] ..FAILED (15.2 s)
[INFO]   The build exited with code 1. See <https://builds.apache.org/job/maven-skins/ws/maven-fluido-skin/target/it/mskins-24/build.log>
for details.
[INFO] Building: mskins-22_topbar/pom.xml
[INFO] ..FAILED (16.0 s)
[INFO]   The build exited with code 1. See <https://builds.apache.org/job/maven-skins/ws/maven-fluido-skin/target/it/mskins-22_topbar/build.log>
for details.
[INFO] Building: mskins-23/pom.xml
[INFO] ..FAILED (16.3 s)
[INFO]   The build exited with code 1. See <https://builds.apache.org/job/maven-skins/ws/maven-fluido-skin/target/it/mskins-23/build.log>
for details.
[INFO] Building: topbar-inverse/pom.xml
[INFO] ..FAILED (16.2 s)
[INFO]   The build exited with code 1. See <https://builds.apache.org/job/maven-skins/ws/maven-fluido-skin/target/it/topbar-inverse/build.log>
for details.
[INFO] Building: mskins-13/pom.xml
[INFO] ..FAILED (15.4 s)
[INFO]   The build exited with code 1. See <https://builds.apache.org/job/maven-skins/ws/maven-fluido-skin/target/it/mskins-13/build.log>
for details.
[INFO] Building: mskins-24_topbar/pom.xml
[INFO] ..FAILED (17.4 s)
[INFO]   The build exited with code 1. See <https://builds.apache.org/job/maven-skins/ws/maven-fluido-skin/target/it/mskins-24_topbar/build.log>
for details.
[INFO] Building: mskins-22_default/pom.xml
[INFO] ..FAILED (17.0 s)
[INFO]   The build exited with code 1. See <https://builds.apache.org/job/maven-skins/ws/maven-fluido-skin/target/it/mskins-22_default/build.log>
for details.
[INFO] Building: mskins-15/pom.xml
[INFO] ..FAILED (13.3 s)
[INFO]   The build exited with code 1. See <https://builds.apache.org/job/maven-skins/ws/maven-fluido-skin/target/it/mskins-15/build.log>
for details.
[INFO] Building: mskins-41/pom.xml
[INFO] ..FAILED (17.1 s)
[INFO]   The build exited with code 1. See <https://builds.apache.org/job/maven-skins/ws/maven-fluido-skin/target/it/mskins-41/build.log>
for details.
[INFO] Building: sidebar/pom.xml
[INFO] ..FAILED (13.3 s)
[INFO]   The build exited with code 1. See <https://builds.apache.org/job/maven-skins/ws/maven-fluido-skin/target/it/sidebar/build.log>
for details.
[INFO] Building: mskins-34_topbar/pom.xml
[INFO] ..FAILED (16.7 s)
[INFO]   The build exited with code 1. See <https://builds.apache.org/job/maven-skins/ws/maven-fluido-skin/target/it/mskins-34_topbar/build.log>
for details.
[INFO] Building: mskins-47/pom.xml
[INFO] ..FAILED (18.6 s)
[INFO]   The build exited with code 1. See <https://builds.apache.org/job/maven-skins/ws/maven-fluido-skin/target/it/mskins-47/build.log>
for details.
[INFO] Building: mskins-85/pom.xml
[INFO] ..FAILED (16.7 s)
[INFO]   The build exited with code 1. See <https://builds.apache.org/job/maven-skins/ws/maven-fluido-skin/target/it/mskins-85/build.log>
for details.
[INFO] Building: topbar/pom.xml
[INFO] ..FAILED (18.7 s)
[INFO]   The build exited with code 1. See <https://builds.apache.org/job/maven-skins/ws/maven-fluido-skin/target/it/topbar/build.log>
for details.
[INFO] Building: mskins-76_topbar/pom.xml
[INFO] ..FAILED (14.9 s)
[INFO]   The build exited with code 1. See <https://builds.apache.org/job/maven-skins/ws/maven-fluido-skin/target/it/mskins-76_topbar/build.log>
for details.
[INFO] Building: mskins-22/pom.xml
[INFO] ..FAILED (16.5 s)
[INFO]   The build exited with code 1. See <https://builds.apache.org/job/maven-skins/ws/maven-fluido-skin/target/it/mskins-22/build.log>
for details.
[INFO] Building: mskins-28/pom.xml
[INFO] ..FAILED (14.6 s)
[INFO]   The build exited with code 1. See <https://builds.apache.org/job/maven-skins/ws/maven-fluido-skin/target/it/mskins-28/build.log>
for details.
[INFO] Building: mskins-25/pom.xml
[INFO] ..FAILED (15.4 s)
[INFO]   The build exited with code 1. See <https://builds.apache.org/job/maven-skins/ws/maven-fluido-skin/target/it/mskins-25/build.log>
for details.
[INFO] Building: mskins-31/pom.xml
[INFO] ..FAILED (18.2 s)
[INFO]   The build exited with code 1. See <https://builds.apache.org/job/maven-skins/ws/maven-fluido-skin/target/it/mskins-31/build.log>
for details.
[INFO] Building: mskins-16/pom.xml
[INFO] ..FAILED (17.6 s)
[INFO]   The build exited with code 1. See <https://builds.apache.org/job/maven-skins/ws/maven-fluido-skin/target/it/mskins-16/build.log>
for details.
[JENKINS] Recording test results
[INFO] 
[INFO] --- maven-checkstyle-plugin:2.13:check (checkstyle-check) @ maven-fluido-skin ---
[INFO] 
[INFO] 
[INFO] --- maven-invoker-plugin:1.10:verify (integration-test) @ maven-fluido-skin ---
[INFO] -------------------------------------------------
[INFO] Build Summary:
[INFO]   Passed: 0, Failed: 31, Errors: 0, Skipped: 0
[INFO] -------------------------------------------------
[ERROR] The following builds failed:
[ERROR] *  mskins-16/pom.xml
[ERROR] *  mskins-17/pom.xml
[ERROR] *  mskins-76/pom.xml
[ERROR] *  mskins-25/pom.xml
[ERROR] *  mskins-22_topbar/pom.xml
[ERROR] *  mskins-22/pom.xml
[ERROR] *  mskins-34/pom.xml
[ERROR] *  mskins-24_topbar/pom.xml
[ERROR] *  mskins-47/pom.xml
[ERROR] *  mskins-24/pom.xml
[ERROR] *  mskins-33/pom.xml
[ERROR] *  mskins-14/pom.xml
[ERROR] *  mskins-72/pom.xml
[ERROR] *  topbar/pom.xml
[ERROR] *  mskins-31/pom.xml
[ERROR] *  mskins-41/pom.xml
[ERROR] *  mskins-13/pom.xml
[ERROR] *  mskins-85/pom.xml
[ERROR] *  mskins-21/pom.xml
[ERROR] *  mskins-76_topbar/pom.xml
[ERROR] *  mskins-22_default/pom.xml
[ERROR] *  topbar-inverse/pom.xml
[ERROR] *  mskins-75/pom.xml
[ERROR] *  mskins-14_sitesearch/pom.xml
[ERROR] *  mskins-23/pom.xml
[ERROR] *  mskins-15/pom.xml
[ERROR] *  mskins-10/pom.xml
[ERROR] *  mskins-33_topbar/pom.xml
[ERROR] *  mskins-28/pom.xml
[ERROR] *  sidebar/pom.xml
[ERROR] *  mskins-34_topbar/pom.xml
[INFO] -------------------------------------------------
[INFO]                                                                         
[INFO] ------------------------------------------------------------------------
[INFO] Building Maven Skins Aggregator 1-SNAPSHOT
[INFO] ------------------------------------------------------------------------
[INFO] 
[INFO] --- maven-clean-plugin:2.5:clean (default-clean) @ maven-skins-aggregator ---
[INFO] Deleting <https://builds.apache.org/job/maven-skins/ws/target>
[INFO] 
[INFO] --- maven-enforcer-plugin:1.3.1:enforce (enforce-bytecode-version) @ maven-skins-aggregator
---
[INFO] 
[INFO] --- maven-enforcer-plugin:1.3.1:enforce (ban-known-bad-maven-versions) @ maven-skins-aggregator
---
[INFO] 
[INFO] --- apache-rat-plugin:0.11:check (rat-check) @ maven-skins-aggregator ---
[INFO] 53 implicit excludes (use -debug for more details).
[INFO] Exclude: DEPENDENCIES
[INFO] 3 resources included (use -debug for more details)
[INFO] Rat check: Summary of files. Unapproved: 0 unknown: 0 generated: 0 approved: 2 licence.
[INFO] 
[INFO] --- maven-remote-resources-plugin:1.5:process (default) @ maven-skins-aggregator ---
[INFO] 
[INFO] --- maven-site-plugin:3.4:attach-descriptor (attach-descriptor) @ maven-skins-aggregator
---
[INFO] 
[INFO] --- maven-checkstyle-plugin:2.13:check (checkstyle-check) @ maven-skins-aggregator
---
[INFO] 
[INFO] 
[INFO] --- maven-install-plugin:2.5.2:install (default-install) @ maven-skins-aggregator ---
[INFO] Installing <https://builds.apache.org/job/maven-skins/ws/pom.xml> to /home/jenkins/jenkins-slave/maven-repositories/1/org/apache/maven/skins/maven-skins-aggregator/1-SNAPSHOT/maven-skins-aggregator-1-SNAPSHOT.pom
[INFO] Installing <https://builds.apache.org/job/maven-skins/ws/target/maven-skins-aggregator-1-SNAPSHOT-site.xml>
to /home/jenkins/jenkins-slave/maven-repositories/1/org/apache/maven/skins/maven-skins-aggregator/1-SNAPSHOT/maven-skins-aggregator-1-SNAPSHOT-site.xml
[INFO] ------------------------------------------------------------------------
[INFO] Reactor Summary:
[INFO] 
[INFO] Maven Default Skin ................................ SUCCESS [1:05.858s]
[INFO] Apache Maven Fluido Skin .......................... FAILURE [9:05.193s]
[INFO] Maven Skins Aggregator ............................ SUCCESS [2.374s]
[INFO] ------------------------------------------------------------------------
[INFO] BUILD FAILURE
[INFO] ------------------------------------------------------------------------
[INFO] Total time: 10:15.488s
[INFO] Finished at: Mon Feb 08 21:19:22 UTC 2016
[INFO] Final Memory: 41M/692M
[INFO] ------------------------------------------------------------------------
Waiting for Jenkins to finish collecting data
[ERROR] Failed to execute goal org.apache.maven.plugins:maven-invoker-plugin:1.10:verify (integration-test)
on project maven-fluido-skin: 31 builds failed. See console output above for details. ->
[Help 1]
org.apache.maven.lifecycle.LifecycleExecutionException: Failed to execute goal org.apache.maven.plugins:maven-invoker-plugin:1.10:verify
(integration-test) on project maven-fluido-skin: 31 builds failed. See console output above
for details.
	at org.apache.maven.lifecycle.internal.MojoExecutor.execute(MojoExecutor.java:213)
	at org.apache.maven.lifecycle.internal.MojoExecutor.execute(MojoExecutor.java:153)
	at org.apache.maven.lifecycle.internal.MojoExecutor.execute(MojoExecutor.java:145)
	at org.apache.maven.lifecycle.internal.LifecycleModuleBuilder.buildProject(LifecycleModuleBuilder.java:84)
	at org.apache.maven.lifecycle.internal.LifecycleModuleBuilder.buildProject(LifecycleModuleBuilder.java:59)
	at org.apache.maven.lifecycle.internal.LifecycleStarter.singleThreadedBuild(LifecycleStarter.java:183)
	at org.apache.maven.lifecycle.internal.LifecycleStarter.execute(LifecycleStarter.java:161)
	at org.apache.maven.DefaultMaven.doExecute(DefaultMaven.java:320)
	at org.apache.maven.DefaultMaven.execute(DefaultMaven.java:156)
	at org.jvnet.hudson.maven3.launcher.Maven3Launcher.main(Maven3Launcher.java:117)
	at sun.reflect.NativeMethodAccessorImpl.invoke0(Native Method)
	at sun.reflect.NativeMethodAccessorImpl.invoke(NativeMethodAccessorImpl.java:39)
	at sun.reflect.DelegatingMethodAccessorImpl.invoke(DelegatingMethodAccessorImpl.java:25)
	at java.lang.reflect.Method.invoke(Method.java:597)
	at org.codehaus.plexus.classworlds.launcher.Launcher.launchStandard(Launcher.java:329)
	at org.codehaus.plexus.classworlds.launcher.Launcher.launch(Launcher.java:239)
	at org.jvnet.hudson.maven3.agent.Maven3Main.launch(Maven3Main.java:181)
	at sun.reflect.NativeMethodAccessorImpl.invoke0(Native Method)
	at sun.reflect.NativeMethodAccessorImpl.invoke(NativeMethodAccessorImpl.java:39)
	at sun.reflect.DelegatingMethodAccessorImpl.invoke(DelegatingMethodAccessorImpl.java:25)
	at java.lang.reflect.Method.invoke(Method.java:597)
	at hudson.maven.Maven3Builder.call(Maven3Builder.java:136)
	at hudson.maven.Maven3Builder.call(Maven3Builder.java:71)
	at hudson.remoting.UserRequest.perform(UserRequest.java:121)
	at hudson.remoting.UserRequest.perform(UserRequest.java:49)
	at hudson.remoting.Request$2.run(Request.java:326)
	at hudson.remoting.InterceptingExecutorService$1.call(InterceptingExecutorService.java:68)
	at java.util.concurrent.FutureTask$Sync.innerRun(FutureTask.java:303)
	at java.util.concurrent.FutureTask.run(FutureTask.java:138)
	at java.util.concurrent.ThreadPoolExecutor$Worker.runTask(ThreadPoolExecutor.java:895)
	at java.util.concurrent.ThreadPoolExecutor$Worker.run(ThreadPoolExecutor.java:918)
	at java.lang.Thread.run(Thread.java:662)
Caused by: org.apache.maven.plugin.MojoFailureException: 31 builds failed. See console output
above for details.
	at org.apache.maven.plugin.invoker.InvokerSession.handleFailures(InvokerSession.java:258)
	at org.apache.maven.plugin.invoker.VerifyMojo.execute(VerifyMojo.java:137)
	at org.apache.maven.plugin.DefaultBuildPluginManager.executeMojo(DefaultBuildPluginManager.java:101)
	at org.apache.maven.lifecycle.internal.MojoExecutor.execute(MojoExecutor.java:209)
	... 31 more
[ERROR] 
[ERROR] Re-run Maven using the -X switch to enable full debug logging.
[ERROR] 
[ERROR] For more information about the errors and possible solutions, please read the following
articles:
[ERROR] [Help 1] http://cwiki.apache.org/confluence/display/MAVEN/MojoFailureException
[ERROR] 
[ERROR] After correcting the problems, you can resume the build with the command
[ERROR]   mvn <goals> -rf :maven-fluido-skin
[JENKINS] Archiving <https://builds.apache.org/job/maven-skins/ws/maven-fluido-skin/pom.xml>
to org.apache.maven.skins/maven-fluido-skin/1.5-SNAPSHOT/maven-fluido-skin-1.5-SNAPSHOT.pom
[JENKINS] Archiving <https://builds.apache.org/job/maven-skins/ws/maven-fluido-skin/target/maven-fluido-skin-1.5-SNAPSHOT.jar>
to org.apache.maven.skins/maven-fluido-skin/1.5-SNAPSHOT/maven-fluido-skin-1.5-SNAPSHOT.jar
Compressed 364.75 KB of artifacts by 17.5% relative to #229
[JENKINS] Archiving <https://builds.apache.org/job/maven-skins/ws/maven-default-skin/pom.xml>
to org.apache.maven.skins/maven-default-skin/1.2-SNAPSHOT/maven-default-skin-1.2-SNAPSHOT.pom
[JENKINS] Archiving <https://builds.apache.org/job/maven-skins/ws/maven-default-skin/target/maven-default-skin-1.2-SNAPSHOT.jar>
to org.apache.maven.skins/maven-default-skin/1.2-SNAPSHOT/maven-default-skin-1.2-SNAPSHOT.jar
[JENKINS] Archiving <https://builds.apache.org/job/maven-skins/ws/pom.xml> to org.apache.maven.skins/maven-skins-aggregator/1-SNAPSHOT/maven-skins-aggregator-1-SNAPSHOT.pom
[JENKINS] Archiving <https://builds.apache.org/job/maven-skins/ws/target/maven-skins-aggregator-1-SNAPSHOT-site.xml>
to org.apache.maven.skins/maven-skins-aggregator/1-SNAPSHOT/maven-skins-aggregator-1-SNAPSHOT-site.xml
Sending e-mails to: notifications@maven.apache.org
channel stopped

Mime
View raw message