maven-notifications mailing list archives

Site index · List index
Message view « Date » · « Thread »
Top « Date » · « Thread »
From Apache Jenkins Server <jenk...@builds.apache.org>
Subject Build failed in Jenkins: core-it-maven-3-win #1116
Date Thu, 18 Feb 2016 23:21:41 GMT
See <https://builds.apache.org/job/core-it-maven-3-win/1116/changes>

Changes:

[schulte] [MNG-5981] upgrade Sisu to 0.3.3 to pick up lifecycle fix

------------------------------------------
[...truncated 10513 lines...]
mng1073AggregatorForksReactor(itForkGoal)...................OK (2.7 s)
mng1052PluginMngtConfig(itMNG1052)..........................OK (2.7 s)
mng1021EqualAttachmentBuildNumber(itMNG1021)................OK (2.9 s)
mng0985NonExecutedPluginMngtGoals(itMNG0985)................OK (2.4 s)
mng0956ComponentInjectionViaProjectLevelPluginDep(itMNG0956)OK (2.8 s)
mng0947OptionalDependency(it)...............................OK (3.0 s)
mng0870ReactorAwarePluginDiscovery(itMNG0870)...............OK (2.9 s)
mng0866EvaluateDefaultValue(itMNG866).......................OK (2.8 s)
mng0848SystemPropOverridesDefaultValue(itMNG848)............OK (2.9 s)
mng0836PluginParentResolution(itMNG836).....................OK (2.7 s)
mng0823MojoContextPassing(itMNG0823)........................OK (2.5 s)
mng0820ConflictResolution(itMNG0820)........................OK (3.1 s)
mng0818WarDepsNotTransitive(itMNG0818)......................OK (3.0 s)
mng0814ExplicitProfileActivation(itMNG814)..................OK (2.6 s)
mng0786ProfileAwareReactor(itMNG0786).......................OK (2.6 s)
mng0781PluginConfigVsExecConfig(itMNG0781)..................OK (2.6 s)
mng0773SettingsProfileReactorPollution(itMNG773)............OK (2.3 s)
mng0768OfflineMode(itMNG768)................................OK (8.8 s)
mng0761MissingSnapshotDistRepo(itMNG761)....................OK (2.9 s)
mng0731LegacyRepoLayout(itMNG731)...........................SKIPPED - Maven version 3.4.0-SNAPSHOT
not in range [2.0,3.0-alpha-3)
mng0680ParentBasedir(itMNG680)..............................OK (2.6 s)
mng0674PluginParameterAlias(itLifecycle)....................OK (2.6 s)
mng0674PluginParameterAlias(itCli)..........................OK (2.6 s)
mng0666IgnoreLegacyPom(itMNG666)............................OK (3.0 s)
mng0557UserSettingsCliOption(itMNG557)......................OK (2.7 s)
mng0553SettingsAuthzEncryption(itRelocation)................OK (3.9 s)
mng0553SettingsAuthzEncryption(itEncryption)................OK (5.4 s)
mng0553SettingsAuthzEncryption(itBasic).....................OK (4.0 s)
mng0522InheritedPluginMgmtConfig(itMNG522)..................OK (2.9 s)
mng0507ArtifactRelocation(itMNG507).........................OK (4.6 s)
mng0505VersionRange(itMNG505)...............................OK (3.1 s)
mng0496IgnoreUnknownPluginParameters(itMNG496)..............OK (2.9 s)
mng0479OverrideCentralRepo(itResolution)....................OK (10.1 s)
mng0479OverrideCentralRepo(itModel).........................OK (5.5 s)
mng0471CustomLifecycle(itMNG471)............................OK (2.6 s)
mng0469ReportConfig(itReportConfigOverridesBuildDefaults)...SKIPPED - Maven version 3.4.0-SNAPSHOT
not in range [2.0.0,3.0-alpha-1)
mng0469ReportConfig(itBuildConfigDominantDuringBuild).......OK (2.6 s)
mng0469ReportConfig(itBuildConfigIrrelevantForReports)......OK (2.6 s)
mng0461TolerateMissingDependencyPom(it).....................OK (3.1 s)
mng0449PluginVersionResolution(itLifecycleInvocation).......OK (2.7 s)
mng0449PluginVersionResolution(itCliInvocation).............OK (2.6 s)
mng0377PluginLookupFromPrefix(itMNG377).....................OK (3.4 s)
mng0294MergeGlobalAndUserSettings(itMNG294).................OK (2.7 s)
mng0282NonReactorExecWhenProjectIndependent(itMNG282).......OK (2.7 s)
mng0249ResolveDepsFromReactor(itMNG0249)....................OK (3.2 s)
mng0187CollectedProjects(it)................................OK (2.6 s)
mng0095ReactorFailureBehavior(itFailFast)...................OK (2.7 s)
mng0095ReactorFailureBehavior(itFailNever)..................OK (2.7 s)
mng0095ReactorFailureBehavior(itFailAtEnd)..................OK (2.8 s)
0145ReactorWithIncludesExcludes(itDefaultIncludesExcludes)..SKIPPED - Maven version 3.4.0-SNAPSHOT
not in range [2.0,3.0-alpha-1)
0145ReactorWithIncludesExcludes(itCustomIncludes)...........SKIPPED - Maven version 3.4.0-SNAPSHOT
not in range [2.0,3.0-alpha-1)
0145ReactorWithIncludesExcludes(itCustomExcludes)...........SKIPPED - Maven version 3.4.0-SNAPSHOT
not in range [2.0,3.0-alpha-1)
0144LifecycleExecutionOrder(it0144).........................OK (3.6 s)
0143TransitiveDependencyScopes(itCompileScope)..............OK (3.1 s)
0143TransitiveDependencyScopes(itProvidedScope).............OK (3.0 s)
0143TransitiveDependencyScopes(itRuntimeScope)..............OK (3.0 s)
0143TransitiveDependencyScopes(itTestScope).................OK (3.0 s)
0142DirectDependencyScopes(it0142)..........................OK (3.0 s)
0140InterpolationWithPomPrefix(it0140)......................OK (2.6 s)
0139InterpolationWithProjectPrefix(it0139)..................OK (2.5 s)
0138PluginLifecycle(it0138).................................OK (3.4 s)
0137EarLifecycle(it0137)....................................OK (3.1 s)
0136RarLifecycle(it0136)....................................OK (3.3 s)
0135EjbLifecycle(it0135)....................................OK (3.4 s)
0134WarLifecycle(it0134)....................................OK (3.6 s)
0133JarLifecycle(it0133)....................................OK (3.4 s)
0132PomLifecycle(it0132)....................................OK (2.9 s)
0131SiteLifecycle(it0131)...................................OK (3.0 s)
0130CleanLifecycle(it0130)..................................OK (2.6 s)
0113ServerAuthzAvailableToWagonMgrInPlugin(it0113)..........OK (3.0 s)
0090EnvVarInterpolation(it0090).............................OK (2.7 s)
0087PluginRealmWithProjectLevelDeps(it0087).................OK (2.8 s)
0086PluginRealm(it0086).....................................OK (2.8 s)
0085TransitiveSystemScope(it0085)...........................OK (3.1 s)
0072InterpolationWithDottedProperty(it0072).................OK (2.7 s)
0071PluginConfigWithDottedProperty(it0071)..................OK (2.8 s)
0064MojoConfigViaSetters(it0064)............................OK (2.6 s)
0063SystemScopeDependency(it0063)...........................OK (2.9 s)
0056MultipleGoalExecutions(it0056)..........................OK (2.6 s)
0052ReleaseProfile(it0052)..................................OK (3.3 s)
0051ReleaseProfile(it0051)..................................OK (3.4 s)
0041ArtifactTypeFromPluginExtension(it0041).................OK (3.9 s)
0040PackagingFromPluginExtension(it0040)....................OK (2.7 s)
0039ReleasePomInReactor(it0039).............................SKIPPED - Maven version 3.4.0-SNAPSHOT
not in range [2.0,3.0-alpha-1)
0038AlternatePomFileDifferentDir(it0038)....................OK (2.6 s)
0037AlternatePomFileSameDir(it0037).........................OK (2.5 s)
0036ReleasePom(it0036)......................................SKIPPED - Maven version 3.4.0-SNAPSHOT
not in range (2.0,3.0-alpha-1)
0032MavenPrerequisite(it0032)...............................OK (2.4 s)
0030DepPomDepMngtInheritance(it0030)........................OK (8.0 s)
0025MultipleExecutionLevelConfigs(it0025)...................OK (2.7 s)
0024MultipleGoalExecutions(it0024)..........................OK (2.6 s)
0023SettingsProfile(it0023).................................OK (2.7 s)
0021PomProfile(it0021)......................................OK (3.0 s)
0019PluginVersionMngtBySuperPom(it0019).....................OK (3.9 s)
0018DependencyManagement(it0018)............................OK (3.0 s)
0012PomInterpolation(it0012)................................OK (2.8 s)
0011DefaultVersionByDependencyManagement(it0011)............OK (3.1 s)
0010DependencyClosureResolution(it0010).....................OK (3.1 s)
0009GoalConfiguration(it0009)...............................OK (2.7 s)
0008SimplePlugin(it0008)....................................OK (3.0 s)
Tests run: 779, Failures: 1, Errors: 0, Skipped: 0, Time elapsed: 2,877.95 sec <<<
FAILURE! - in org.apache.maven.it.IntegrationTestSuite
testitResolution(org.apache.maven.it.MavenITmng5227DependencyOptionalFlagManagementTest) 
Time elapsed: 3.143 sec  <<< FAILURE!
junit.framework.AssertionFailedError: [classes, direct-0.2.jar, transitive-0.1.jar]
	at junit.framework.Assert.fail(Assert.java:47)
	at junit.framework.Assert.assertTrue(Assert.java:20)
	at junit.framework.Assert.assertFalse(Assert.java:34)
	at org.apache.maven.it.MavenITmng5227DependencyOptionalFlagManagementTest.testitResolution(MavenITmng5227DependencyOptionalFlagManagementTest.java:86)


Results :

Failed tests: 
  MavenITmng5227DependencyOptionalFlagManagementTest>AbstractMavenIntegrationTestCase.runTest:219->testitResolution:86
[classes, direct-0.2.jar, transitive-0.1.jar]

Tests run: 779, Failures: 1, Errors: 0, Skipped: 0

[INFO] ------------------------------------------------------------------------
[INFO] Reactor Summary:
[INFO] 
[INFO] Maven Core ITs ..................................... SUCCESS [ 50.128 s]
[INFO] Maven IT Support ................................... SUCCESS [  0.949 s]
[INFO] Maven IT :: Plugins ................................ SUCCESS [  0.756 s]
[INFO] Maven IT Plugin :: Active Collection ............... SUCCESS [  9.996 s]
[INFO] Maven IT Plugin :: Ant-Based ....................... SUCCESS [  5.623 s]
[INFO] Maven IT Plugin :: Artifact ........................ SUCCESS [  3.180 s]
[INFO] Maven IT Plugin :: Class Loader :: Dependency A .... SUCCESS [  0.553 s]
[INFO] Maven IT Plugin :: Class Loader :: Dependency B .... SUCCESS [  0.832 s]
[INFO] Maven IT Plugin :: Class Loader :: Dependency C .... SUCCESS [  0.492 s]
[INFO] Maven IT Plugin :: Class Loader .................... SUCCESS [  2.898 s]
[INFO] Maven IT Plugin :: Class Loader :: Aggregator ...... SUCCESS [  0.484 s]
[INFO] Maven IT Plugin :: Configuration ................... SUCCESS [  1.219 s]
[INFO] Maven IT Plugin :: Context Passing ................. SUCCESS [  0.653 s]
[INFO] Maven ITs :: Core Plugin Stubs ..................... SUCCESS [  0.458 s]
[INFO] Maven IT Clean Plugin Stub ......................... SUCCESS [  1.005 s]
[INFO] Maven IT Compiler Plugin Stub ...................... SUCCESS [  1.164 s]
[INFO] Maven IT Deploy Plugin Stub ........................ SUCCESS [  1.186 s]
[INFO] Maven IT EAR Plugin Stub ........................... SUCCESS [  0.757 s]
[INFO] Maven IT EJB Plugin Stub ........................... SUCCESS [  0.635 s]
[INFO] Maven IT Install Plugin Stub ....................... SUCCESS [  0.692 s]
[INFO] Maven IT JAR Plugin Stub ........................... SUCCESS [  0.833 s]
[INFO] Maven IT Javadoc Plugin Stub ....................... SUCCESS [  0.815 s]
[INFO] Maven IT Plugin Plugin Stub ........................ SUCCESS [  0.722 s]
[INFO] Maven IT RAR Plugin Stub ........................... SUCCESS [  0.751 s]
[INFO] Maven IT Resources Plugin Stub ..................... SUCCESS [  0.675 s]
[INFO] Maven IT Site Plugin Stub .......................... SUCCESS [  0.880 s]
[INFO] Maven IT Source Plugin Stub ........................ SUCCESS [  1.013 s]
[INFO] Maven IT Surefire Plugin Stub ...................... SUCCESS [  0.761 s]
[INFO] Maven IT WAR Plugin Stub ........................... SUCCESS [  0.917 s]
[INFO] Maven IT Plugin :: Dependency Collection ........... SUCCESS [  0.742 s]
[INFO] Maven IT Plugin :: Dependency Resolution ........... SUCCESS [  8.481 s]
[INFO] Maven IT Plugin :: Expression ...................... SUCCESS [  1.936 s]
[INFO] Maven IT Plugin :: Error Mojos ..................... SUCCESS [  3.321 s]
[INFO] Maven IT Component ................................. SUCCESS [  0.591 s]
[INFO] Maven IT Plugin :: Extension Consumer .............. SUCCESS [  0.579 s]
[INFO] Maven IT Plugin :: Extension Provider .............. SUCCESS [  0.584 s]
[INFO] Maven IT Plugin :: Fork ............................ SUCCESS [  0.741 s]
[INFO] Maven IT Plugin :: Invalid Descriptor .............. SUCCESS [  0.559 s]
[INFO] Maven IT Plugin :: Log File ........................ SUCCESS [  0.685 s]
[INFO] Maven IT Helper Library ............................ SUCCESS [  2.294 s]
[INFO] Maven IT Plugin :: Model Interpolation ............. SUCCESS [  1.582 s]
[INFO] Maven IT Plugin :: No Default Component ............ SUCCESS [  0.534 s]
[INFO] Maven IT Plugin :: No Project ...................... SUCCESS [  0.533 s]
[INFO] Maven IT Plugin :: Online .......................... SUCCESS [  0.504 s]
[INFO] Maven IT Plugin :: Optional Mojos .................. SUCCESS [  0.599 s]
[INFO] Maven IT Plugin :: Packaging ....................... SUCCESS [  0.510 s]
[INFO] Maven IT Plugin :: Parameter Implementation ........ SUCCESS [  0.552 s]
[INFO] Maven IT Plugin :: Plugin Dependency ............... SUCCESS [  0.705 s]
[INFO] Maven IT Plugin :: Project ......................... SUCCESS [  1.752 s]
[INFO] Maven IT Plugin :: Project Interpolation ........... SUCCESS [  0.962 s]
[INFO] Maven IT Plugin :: Setter .......................... SUCCESS [  0.691 s]
[INFO] Maven IT Plugin :: Singleton Component ............. SUCCESS [  0.525 s]
[INFO] Maven IT Plugin :: Site ............................ SUCCESS [  3.559 s]
[INFO] Maven IT Plugin :: Toolchain ....................... SUCCESS [  6.562 s]
[INFO] Maven IT Plugin :: Touch ........................... SUCCESS [  1.029 s]
[INFO] Maven IT Plugin :: Uses Properties Plugin .......... SUCCESS [  0.501 s]
[INFO] Maven IT Plugin :: Uses Wagon Plugin ............... SUCCESS [  4.424 s]
[INFO] Maven IT Plugin :: This plugin should contain the mojos needed by all tests. SUCCESS
[  0.480 s]
[INFO] Maven IT Plugin :: Plexus Utils 1.1 ................ SUCCESS [  0.747 s]
[INFO] Maven IT Plugin :: Plexus Utils New ................ SUCCESS [  0.676 s]
[INFO] Maven IT Plugin :: Plexus Component API ............ SUCCESS [  1.479 s]
[INFO] Maven IT Plugin :: Log4J Client .................... SUCCESS [  1.051 s]
[INFO] Maven IT Plugin :: Extension 1 ..................... SUCCESS [  0.437 s]
[INFO] Maven IT Plugin :: Extension 2 ..................... SUCCESS [  0.899 s]
[INFO] Maven IT Plugin :: Plexus Lifecycle ................ SUCCESS [  2.011 s]
[INFO] Maven IT Plugin :: Settings ........................ SUCCESS [  0.672 s]
[INFO] Maven IT Plugin :: mng-5805 extension .............. SUCCESS [  0.393 s]
[INFO] Maven IT Plugin :: mng-5805 plugin ................. SUCCESS [  0.667 s]
[INFO] Maven IT Plugin :: mng-5805 plugin-dep ............. SUCCESS [  0.427 s]
[INFO] Maven IT Plugin :: mng-5958 extension .............. SUCCESS [  6.922 s]
[INFO] Maven IT Toolchain ................................. SUCCESS [  1.518 s]
[INFO] Maven IT Wagon ..................................... SUCCESS [  0.672 s]
[INFO] Maven IT Support Artifacts ......................... SUCCESS [  2.193 s]
[INFO] Maven IT Extension ................................. SUCCESS [  0.391 s]
[INFO] Maven ITs .......................................... FAILURE [48:21 min]
[INFO] ------------------------------------------------------------------------
[INFO] BUILD FAILURE
[INFO] ------------------------------------------------------------------------
[INFO] Total time: 51:04 min
[INFO] Finished at: 2016-02-18T15:21:27-08:00
[INFO] Final Memory: 62M/742M
[INFO] ------------------------------------------------------------------------
[ERROR] Failed to execute goal org.apache.maven.plugins:maven-surefire-plugin:2.18.1:test
(default-test) on project core-it-suite: There are test failures.
[ERROR] 
[ERROR] Please refer to F:\ws\m3-its\core-integration-testing-trunk\core-it-suite\target\surefire-reports
for the individual test results.
[ERROR] -> [Help 1]
org.apache.maven.lifecycle.LifecycleExecutionException: Failed to execute goal org.apache.maven.plugins:maven-surefire-plugin:2.18.1:test
(default-test) on project core-it-suite: There are test failures.

Please refer to F:\ws\m3-its\core-integration-testing-trunk\core-it-suite\target\surefire-reports
for the individual test results.
	at org.apache.maven.lifecycle.internal.MojoExecutor.execute(MojoExecutor.java:212)
	at org.apache.maven.lifecycle.internal.MojoExecutor.execute(MojoExecutor.java:153)
	at org.apache.maven.lifecycle.internal.MojoExecutor.execute(MojoExecutor.java:145)
	at org.apache.maven.lifecycle.internal.LifecycleModuleBuilder.buildProject(LifecycleModuleBuilder.java:116)
	at org.apache.maven.lifecycle.internal.LifecycleModuleBuilder.buildProject(LifecycleModuleBuilder.java:80)
	at org.apache.maven.lifecycle.internal.builder.singlethreaded.SingleThreadedBuilder.build(SingleThreadedBuilder.java:51)
	at org.apache.maven.lifecycle.internal.LifecycleStarter.execute(LifecycleStarter.java:128)
	at org.apache.maven.DefaultMaven.doExecute(DefaultMaven.java:307)
	at org.apache.maven.DefaultMaven.doExecute(DefaultMaven.java:193)
	at org.apache.maven.DefaultMaven.execute(DefaultMaven.java:106)
	at org.apache.maven.cli.MavenCli.execute(MavenCli.java:862)
	at org.apache.maven.cli.MavenCli.doMain(MavenCli.java:286)
	at org.apache.maven.cli.MavenCli.main(MavenCli.java:197)
	at sun.reflect.NativeMethodAccessorImpl.invoke0(Native Method)
	at sun.reflect.NativeMethodAccessorImpl.invoke(NativeMethodAccessorImpl.java:57)
	at sun.reflect.DelegatingMethodAccessorImpl.invoke(DelegatingMethodAccessorImpl.java:43)
	at java.lang.reflect.Method.invoke(Method.java:601)
	at org.codehaus.plexus.classworlds.launcher.Launcher.launchEnhanced(Launcher.java:289)
	at org.codehaus.plexus.classworlds.launcher.Launcher.launch(Launcher.java:229)
	at org.codehaus.plexus.classworlds.launcher.Launcher.mainWithExitCode(Launcher.java:415)
	at org.codehaus.plexus.classworlds.launcher.Launcher.main(Launcher.java:356)
Caused by: org.apache.maven.plugin.MojoFailureException: There are test failures.

Please refer to F:\ws\m3-its\core-integration-testing-trunk\core-it-suite\target\surefire-reports
for the individual test results.
	at org.apache.maven.plugin.surefire.SurefireHelper.reportExecution(SurefireHelper.java:82)
	at org.apache.maven.plugin.surefire.SurefirePlugin.handleSummary(SurefirePlugin.java:254)
	at org.apache.maven.plugin.surefire.AbstractSurefireMojo.executeAfterPreconditionsChecked(AbstractSurefireMojo.java:854)
	at org.apache.maven.plugin.surefire.AbstractSurefireMojo.execute(AbstractSurefireMojo.java:722)
	at org.apache.maven.plugin.DefaultBuildPluginManager.executeMojo(DefaultBuildPluginManager.java:134)
	at org.apache.maven.lifecycle.internal.MojoExecutor.execute(MojoExecutor.java:208)
	... 20 more
[ERROR] 
[ERROR] Re-run Maven using the -X switch to enable full debug logging.
[ERROR] 
[ERROR] For more information about the errors and possible solutions, please read the following
articles:
[ERROR] [Help 1] http://cwiki.apache.org/confluence/display/MAVEN/MojoFailureException
[ERROR] 
[ERROR] After correcting the problems, you can resume the build with the command
[ERROR]   mvn <goals> -rf :core-it-suite
Build step 'Invoke top-level Maven targets' marked build as failure
Recording test results

Mime
View raw message