maven-notifications mailing list archives

Site index · List index
Message view « Date » · « Thread »
Top « Date » · « Thread »
From Apache Jenkins Server <jenk...@builds.apache.org>
Subject Build failed in Jenkins: core-it-maven-3-win #1078
Date Thu, 14 Jan 2016 15:24:29 GMT
See <https://builds.apache.org/job/core-it-maven-3-win/1078/changes>

Changes:

[schulte] [MNG-5359] Declared execution in PluginMgmt gets bound to lifecycle

------------------------------------------
[...truncated 10412 lines...]
org.apache.maven.it.VerificationException: Exit code was non-zero: 1; command line and log
= 
<https://builds.apache.org/job/core-it-maven-3-win/ws/apache-maven-3-SNAPSHOT\bin\mvn>
--global-settings F:\ws\m3-its\core-integration-testing-trunk\core-it-suite\target\test-classes\settings-remote.xml
-e --batch-mode -Dmaven.repo.local=<https://builds.apache.org/job/core-it-maven-3-win/ws/it-local-repo>
install
[INFO] Error stacktraces are turned on.
[INFO] Scanning for projects...
[INFO]                                                                         
[INFO] ------------------------------------------------------------------------
[INFO] Building Maven Integration Test :: MNG-5359 0.1-SNAPSHOT
[INFO] ------------------------------------------------------------------------
[INFO] Downloading: http://repo1.maven.org/maven2/org/apache/maven/plugins/maven-compiler-plugin/2.5.1/maven-compiler-plugin-2.5.1.pom
[INFO] Downloaded: http://repo1.maven.org/maven2/org/apache/maven/plugins/maven-compiler-plugin/2.5.1/maven-compiler-plugin-2.5.1.pom
(8 KB at 35.3 KB/sec)
[INFO] Downloading: http://repo1.maven.org/maven2/org/apache/maven/plugins/maven-compiler-plugin/2.5.1/maven-compiler-plugin-2.5.1.jar
[INFO] Downloaded: http://repo1.maven.org/maven2/org/apache/maven/plugins/maven-compiler-plugin/2.5.1/maven-compiler-plugin-2.5.1.jar
(32 KB at 387.1 KB/sec)
[INFO] Downloading: http://repo1.maven.org/maven2/org/apache/maven/plugins/maven-jar-plugin/2.4/maven-jar-plugin-2.4.pom
[INFO] Downloaded: http://repo1.maven.org/maven2/org/apache/maven/plugins/maven-jar-plugin/2.4/maven-jar-plugin-2.4.pom
(6 KB at 100.0 KB/sec)
[INFO] Downloading: http://repo1.maven.org/maven2/org/apache/maven/plugins/maven-jar-plugin/2.4/maven-jar-plugin-2.4.jar
[INFO] Downloaded: http://repo1.maven.org/maven2/org/apache/maven/plugins/maven-jar-plugin/2.4/maven-jar-plugin-2.4.jar
(34 KB at 420.6 KB/sec)
[INFO] 
[INFO] --- maven-resources-plugin:2.6:resources (default-resources) @ test ---
[INFO] Using 'UTF-8' encoding to copy filtered resources.
[INFO] skip non existing resourceDirectory F:\ws\m3-its\core-integration-testing-trunk\core-it-suite\target\test-classes\mng-5359\src\main\resources
[INFO] 
[INFO] --- maven-compiler-plugin:2.5.1:compile (default-compile) @ test ---
[INFO] Downloading: http://repo1.maven.org/maven2/org/codehaus/plexus/plexus-compiler-api/1.9.1/plexus-compiler-api-1.9.1.pom
[INFO] Downloaded: http://repo1.maven.org/maven2/org/codehaus/plexus/plexus-compiler-api/1.9.1/plexus-compiler-api-1.9.1.pom
(867 B at 13.7 KB/sec)
[INFO] Downloading: http://repo1.maven.org/maven2/org/codehaus/plexus/plexus-compiler/1.9.1/plexus-compiler-1.9.1.pom
[INFO] Downloaded: http://repo1.maven.org/maven2/org/codehaus/plexus/plexus-compiler/1.9.1/plexus-compiler-1.9.1.pom
(4 KB at 28.6 KB/sec)
[INFO] Downloading: http://repo1.maven.org/maven2/org/codehaus/plexus/plexus-components/1.1.20/plexus-components-1.1.20.pom
[INFO] Downloaded: http://repo1.maven.org/maven2/org/codehaus/plexus/plexus-components/1.1.20/plexus-components-1.1.20.pom
(3 KB at 48.3 KB/sec)
[INFO] Downloading: http://repo1.maven.org/maven2/org/codehaus/plexus/plexus-compiler-manager/1.9.1/plexus-compiler-manager-1.9.1.pom
[INFO] Downloaded: http://repo1.maven.org/maven2/org/codehaus/plexus/plexus-compiler-manager/1.9.1/plexus-compiler-manager-1.9.1.pom
(692 B at 11.1 KB/sec)
[INFO] Downloading: http://repo1.maven.org/maven2/org/codehaus/plexus/plexus-compiler-javac/1.9.1/plexus-compiler-javac-1.9.1.pom
[INFO] Downloaded: http://repo1.maven.org/maven2/org/codehaus/plexus/plexus-compiler-javac/1.9.1/plexus-compiler-javac-1.9.1.pom
(688 B at 10.8 KB/sec)
[INFO] Downloading: http://repo1.maven.org/maven2/org/codehaus/plexus/plexus-compilers/1.9.1/plexus-compilers-1.9.1.pom
[INFO] Downloaded: http://repo1.maven.org/maven2/org/codehaus/plexus/plexus-compilers/1.9.1/plexus-compilers-1.9.1.pom
(2 KB at 19.3 KB/sec)
[INFO] Downloading: http://repo1.maven.org/maven2/org/codehaus/plexus/plexus-compiler-api/1.9.1/plexus-compiler-api-1.9.1.jar
[INFO] Downloading: http://repo1.maven.org/maven2/org/codehaus/plexus/plexus-compiler-javac/1.9.1/plexus-compiler-javac-1.9.1.jar
[INFO] Downloading: http://repo1.maven.org/maven2/org/codehaus/plexus/plexus-compiler-manager/1.9.1/plexus-compiler-manager-1.9.1.jar
[INFO] Downloaded: http://repo1.maven.org/maven2/org/codehaus/plexus/plexus-compiler-api/1.9.1/plexus-compiler-api-1.9.1.jar
(21 KB at 232.1 KB/sec)
[INFO] Downloaded: http://repo1.maven.org/maven2/org/codehaus/plexus/plexus-compiler-manager/1.9.1/plexus-compiler-manager-1.9.1.jar
(5 KB at 38.4 KB/sec)
[INFO] Downloaded: http://repo1.maven.org/maven2/org/codehaus/plexus/plexus-compiler-javac/1.9.1/plexus-compiler-javac-1.9.1.jar
(14 KB at 107.5 KB/sec)
[INFO] Compiling 1 source file to F:\ws\m3-its\core-integration-testing-trunk\core-it-suite\target\test-classes\mng-5359\target\classes
[INFO] 
[INFO] --- maven-resources-plugin:2.6:testResources (default-testResources) @ test ---
[INFO] Using 'UTF-8' encoding to copy filtered resources.
[INFO] skip non existing resourceDirectory F:\ws\m3-its\core-integration-testing-trunk\core-it-suite\target\test-classes\mng-5359\src\test\resources
[INFO] 
[INFO] --- maven-compiler-plugin:2.5.1:testCompile (default-testCompile) @ test ---
[INFO] No sources to compile
[INFO] 
[INFO] --- maven-surefire-plugin:2.12.4:test (default-test) @ test ---
[INFO] No tests to run.
[INFO] 
[INFO] --- maven-jar-plugin:2.4:jar (default-jar) @ test ---
[INFO] Downloading: http://repo1.maven.org/maven2/org/codehaus/plexus/plexus-archiver/2.1/plexus-archiver-2.1.jar
[INFO] Downloading: http://repo1.maven.org/maven2/org/codehaus/plexus/plexus-io/2.0.2/plexus-io-2.0.2.jar
[INFO] Downloaded: http://repo1.maven.org/maven2/org/codehaus/plexus/plexus-io/2.0.2/plexus-io-2.0.2.jar
(57 KB at 486.3 KB/sec)
[INFO] Downloaded: http://repo1.maven.org/maven2/org/codehaus/plexus/plexus-archiver/2.1/plexus-archiver-2.1.jar
(181 KB at 1324.4 KB/sec)
[INFO] Building jar: F:\ws\m3-its\core-integration-testing-trunk\core-it-suite\target\test-classes\mng-5359\target\test-0.1-SNAPSHOT.jar
[INFO] 
[INFO] --- maven-clean-plugin:2.5:clean (auto-clean) @ test ---
[INFO] Deleting F:\ws\m3-its\core-integration-testing-trunk\core-it-suite\target\test-classes\mng-5359\target
[INFO] 
[INFO] --- maven-install-plugin:2.4:install (default-install) @ test ---
[INFO] ------------------------------------------------------------------------
[INFO] BUILD FAILURE
[INFO] ------------------------------------------------------------------------
[INFO] Total time: 5.223 s
[INFO] Finished at: 2016-01-14T06:32:56-08:00
[INFO] Final Memory: 15M/742M
[INFO] ------------------------------------------------------------------------
[ERROR] Failed to execute goal org.apache.maven.plugins:maven-install-plugin:2.4:install (default-install)
on project test: The packaging for this project did not assign a file to the build artifact
-> [Help 1]
org.apache.maven.lifecycle.LifecycleExecutionException: Failed to execute goal org.apache.maven.plugins:maven-install-plugin:2.4:install
(default-install) on project test: The packaging for this project did not assign a file to
the build artifact
	at org.apache.maven.lifecycle.internal.MojoExecutor.execute(MojoExecutor.java:214)
	at org.apache.maven.lifecycle.internal.MojoExecutor.execute(MojoExecutor.java:155)
	at org.apache.maven.lifecycle.internal.MojoExecutor.execute(MojoExecutor.java:147)
	at org.apache.maven.lifecycle.internal.LifecycleModuleBuilder.buildProject(LifecycleModuleBuilder.java:116)
	at org.apache.maven.lifecycle.internal.LifecycleModuleBuilder.buildProject(LifecycleModuleBuilder.java:80)
	at org.apache.maven.lifecycle.internal.builder.singlethreaded.SingleThreadedBuilder.build(SingleThreadedBuilder.java:51)
	at org.apache.maven.lifecycle.internal.LifecycleStarter.execute(LifecycleStarter.java:128)
	at org.apache.maven.DefaultMaven.doExecute(DefaultMaven.java:307)
	at org.apache.maven.DefaultMaven.doExecute(DefaultMaven.java:193)
	at org.apache.maven.DefaultMaven.execute(DefaultMaven.java:106)
	at org.apache.maven.cli.MavenCli.execute(MavenCli.java:865)
	at org.apache.maven.cli.MavenCli.doMain(MavenCli.java:288)
	at org.apache.maven.cli.MavenCli.main(MavenCli.java:199)
	at sun.reflect.NativeMethodAccessorImpl.invoke0(Native Method)
	at sun.reflect.NativeMethodAccessorImpl.invoke(NativeMethodAccessorImpl.java:57)
	at sun.reflect.DelegatingMethodAccessorImpl.invoke(DelegatingMethodAccessorImpl.java:43)
	at java.lang.reflect.Method.invoke(Method.java:601)
	at org.codehaus.plexus.classworlds.launcher.Launcher.launchEnhanced(Launcher.java:289)
	at org.codehaus.plexus.classworlds.launcher.Launcher.launch(Launcher.java:229)
	at org.codehaus.plexus.classworlds.launcher.Launcher.mainWithExitCode(Launcher.java:415)
	at org.codehaus.plexus.classworlds.launcher.Launcher.main(Launcher.java:356)
Caused by: org.apache.maven.plugin.MojoExecutionException: The packaging for this project
did not assign a file to the build artifact
	at org.apache.maven.plugin.install.InstallMojo.execute(InstallMojo.java:136)
	at org.apache.maven.plugin.DefaultBuildPluginManager.executeMojo(DefaultBuildPluginManager.java:134)
	at org.apache.maven.lifecycle.internal.MojoExecutor.execute(MojoExecutor.java:209)
	... 20 more
[ERROR] 
[ERROR] Re-run Maven using the -X switch to enable full debug logging.
[ERROR] 
[ERROR] For more information about the errors and possible solutions, please read the following
articles:
[ERROR] [Help 1] http://cwiki.apache.org/confluence/display/MAVEN/MojoExecutionException

	at org.apache.maven.it.Verifier.executeGoals(Verifier.java:1369)
	at org.apache.maven.it.Verifier.executeGoal(Verifier.java:1254)
	at org.apache.maven.it.Verifier.executeGoal(Verifier.java:1248)
	at org.apache.maven.it.MavenITmng5359CleanPluginExecutionDeclarationInPluginMgmtTest.testit(MavenITmng5359CleanPluginExecutionDeclarationInPluginMgmtTest.java:52)


Results :

Tests in error: 
  MavenITmng5359CleanPluginExecutionDeclarationInPluginMgmtTest>AbstractMavenIntegrationTestCase.runTest:219->testit:52
ยป Verification

Tests run: 772, Failures: 0, Errors: 1, Skipped: 0

[INFO] ------------------------------------------------------------------------
[INFO] Reactor Summary:
[INFO] 
[INFO] Maven Core ITs ..................................... SUCCESS [ 42.788 s]
[INFO] Maven IT Support ................................... SUCCESS [  1.109 s]
[INFO] Maven IT :: Plugins ................................ SUCCESS [  0.711 s]
[INFO] Maven IT Plugin :: Active Collection ............... SUCCESS [ 11.547 s]
[INFO] Maven IT Plugin :: Ant-Based ....................... SUCCESS [  5.970 s]
[INFO] Maven IT Plugin :: Artifact ........................ SUCCESS [  4.091 s]
[INFO] Maven IT Plugin :: Class Loader :: Dependency A .... SUCCESS [  0.548 s]
[INFO] Maven IT Plugin :: Class Loader :: Dependency B .... SUCCESS [  0.801 s]
[INFO] Maven IT Plugin :: Class Loader :: Dependency C .... SUCCESS [  0.492 s]
[INFO] Maven IT Plugin :: Class Loader .................... SUCCESS [  2.743 s]
[INFO] Maven IT Plugin :: Class Loader :: Aggregator ...... SUCCESS [  0.440 s]
[INFO] Maven IT Plugin :: Configuration ................... SUCCESS [  1.162 s]
[INFO] Maven IT Plugin :: Context Passing ................. SUCCESS [  0.518 s]
[INFO] Maven ITs :: Core Plugin Stubs ..................... SUCCESS [  0.428 s]
[INFO] Maven IT Clean Plugin Stub ......................... SUCCESS [  1.106 s]
[INFO] Maven IT Compiler Plugin Stub ...................... SUCCESS [  0.974 s]
[INFO] Maven IT Deploy Plugin Stub ........................ SUCCESS [  0.993 s]
[INFO] Maven IT EAR Plugin Stub ........................... SUCCESS [  0.666 s]
[INFO] Maven IT EJB Plugin Stub ........................... SUCCESS [  0.731 s]
[INFO] Maven IT Install Plugin Stub ....................... SUCCESS [  0.669 s]
[INFO] Maven IT JAR Plugin Stub ........................... SUCCESS [  0.820 s]
[INFO] Maven IT Javadoc Plugin Stub ....................... SUCCESS [  0.699 s]
[INFO] Maven IT Plugin Plugin Stub ........................ SUCCESS [  0.688 s]
[INFO] Maven IT RAR Plugin Stub ........................... SUCCESS [  0.805 s]
[INFO] Maven IT Resources Plugin Stub ..................... SUCCESS [  0.683 s]
[INFO] Maven IT Site Plugin Stub .......................... SUCCESS [  0.871 s]
[INFO] Maven IT Source Plugin Stub ........................ SUCCESS [  0.750 s]
[INFO] Maven IT Surefire Plugin Stub ...................... SUCCESS [  0.599 s]
[INFO] Maven IT WAR Plugin Stub ........................... SUCCESS [  0.749 s]
[INFO] Maven IT Plugin :: Dependency Collection ........... SUCCESS [  0.863 s]
[INFO] Maven IT Plugin :: Dependency Resolution ........... SUCCESS [  9.787 s]
[INFO] Maven IT Plugin :: Expression ...................... SUCCESS [  1.838 s]
[INFO] Maven IT Plugin :: Error Mojos ..................... SUCCESS [  3.042 s]
[INFO] Maven IT Component ................................. SUCCESS [  0.456 s]
[INFO] Maven IT Plugin :: Extension Consumer .............. SUCCESS [  0.563 s]
[INFO] Maven IT Plugin :: Extension Provider .............. SUCCESS [  1.100 s]
[INFO] Maven IT Plugin :: Fork ............................ SUCCESS [  0.739 s]
[INFO] Maven IT Plugin :: Invalid Descriptor .............. SUCCESS [  0.605 s]
[INFO] Maven IT Plugin :: Log File ........................ SUCCESS [  0.520 s]
[INFO] Maven IT Helper Library ............................ SUCCESS [  1.700 s]
[INFO] Maven IT Plugin :: Model Interpolation ............. SUCCESS [  1.694 s]
[INFO] Maven IT Plugin :: No Default Component ............ SUCCESS [  0.620 s]
[INFO] Maven IT Plugin :: No Project ...................... SUCCESS [  0.522 s]
[INFO] Maven IT Plugin :: Online .......................... SUCCESS [  0.658 s]
[INFO] Maven IT Plugin :: Optional Mojos .................. SUCCESS [  0.642 s]
[INFO] Maven IT Plugin :: Packaging ....................... SUCCESS [  0.837 s]
[INFO] Maven IT Plugin :: Parameter Implementation ........ SUCCESS [  0.977 s]
[INFO] Maven IT Plugin :: Plugin Dependency ............... SUCCESS [  0.698 s]
[INFO] Maven IT Plugin :: Project ......................... SUCCESS [  0.925 s]
[INFO] Maven IT Plugin :: Project Interpolation ........... SUCCESS [  0.994 s]
[INFO] Maven IT Plugin :: Setter .......................... SUCCESS [  0.823 s]
[INFO] Maven IT Plugin :: Singleton Component ............. SUCCESS [  0.549 s]
[INFO] Maven IT Plugin :: Site ............................ SUCCESS [  4.427 s]
[INFO] Maven IT Plugin :: Toolchain ....................... SUCCESS [  6.992 s]
[INFO] Maven IT Plugin :: Touch ........................... SUCCESS [  1.254 s]
[INFO] Maven IT Plugin :: Uses Properties Plugin .......... SUCCESS [  0.461 s]
[INFO] Maven IT Plugin :: Uses Wagon Plugin ............... SUCCESS [  4.034 s]
[INFO] Maven IT Plugin :: This plugin should contain the mojos needed by all tests. SUCCESS
[  0.491 s]
[INFO] Maven IT Plugin :: Plexus Utils 1.1 ................ SUCCESS [  0.754 s]
[INFO] Maven IT Plugin :: Plexus Utils New ................ SUCCESS [  0.927 s]
[INFO] Maven IT Plugin :: Plexus Component API ............ SUCCESS [  1.810 s]
[INFO] Maven IT Plugin :: Log4J Client .................... SUCCESS [  0.815 s]
[INFO] Maven IT Plugin :: Extension 1 ..................... SUCCESS [  0.418 s]
[INFO] Maven IT Plugin :: Extension 2 ..................... SUCCESS [  0.455 s]
[INFO] Maven IT Plugin :: Plexus Lifecycle ................ SUCCESS [  1.918 s]
[INFO] Maven IT Plugin :: Settings ........................ SUCCESS [  0.620 s]
[INFO] Maven IT Plugin :: mng-5805 extension .............. SUCCESS [  0.377 s]
[INFO] Maven IT Plugin :: mng-5805 plugin ................. SUCCESS [  1.648 s]
[INFO] Maven IT Plugin :: mng-5805 plugin-dep ............. SUCCESS [  0.534 s]
[INFO] Maven IT Toolchain ................................. SUCCESS [  1.100 s]
[INFO] Maven IT Wagon ..................................... SUCCESS [  0.797 s]
[INFO] Maven IT Support Artifacts ......................... SUCCESS [  1.957 s]
[INFO] Maven IT Extension ................................. SUCCESS [  0.394 s]
[INFO] Maven ITs .......................................... FAILURE [51:55 min]
[INFO] ------------------------------------------------------------------------
[INFO] BUILD FAILURE
[INFO] ------------------------------------------------------------------------
[INFO] Total time: 54:28 min
[INFO] Finished at: 2016-01-14T07:23:52-08:00
[INFO] Final Memory: 60M/742M
[INFO] ------------------------------------------------------------------------
[ERROR] Failed to execute goal org.apache.maven.plugins:maven-surefire-plugin:2.18.1:test
(default-test) on project core-it-suite: There are test failures.
[ERROR] 
[ERROR] Please refer to F:\ws\m3-its\core-integration-testing-trunk\core-it-suite\target\surefire-reports
for the individual test results.
[ERROR] -> [Help 1]
org.apache.maven.lifecycle.LifecycleExecutionException: Failed to execute goal org.apache.maven.plugins:maven-surefire-plugin:2.18.1:test
(default-test) on project core-it-suite: There are test failures.

Please refer to F:\ws\m3-its\core-integration-testing-trunk\core-it-suite\target\surefire-reports
for the individual test results.
	at org.apache.maven.lifecycle.internal.MojoExecutor.execute(MojoExecutor.java:212)
	at org.apache.maven.lifecycle.internal.MojoExecutor.execute(MojoExecutor.java:153)
	at org.apache.maven.lifecycle.internal.MojoExecutor.execute(MojoExecutor.java:145)
	at org.apache.maven.lifecycle.internal.LifecycleModuleBuilder.buildProject(LifecycleModuleBuilder.java:116)
	at org.apache.maven.lifecycle.internal.LifecycleModuleBuilder.buildProject(LifecycleModuleBuilder.java:80)
	at org.apache.maven.lifecycle.internal.builder.singlethreaded.SingleThreadedBuilder.build(SingleThreadedBuilder.java:51)
	at org.apache.maven.lifecycle.internal.LifecycleStarter.execute(LifecycleStarter.java:128)
	at org.apache.maven.DefaultMaven.doExecute(DefaultMaven.java:307)
	at org.apache.maven.DefaultMaven.doExecute(DefaultMaven.java:193)
	at org.apache.maven.DefaultMaven.execute(DefaultMaven.java:106)
	at org.apache.maven.cli.MavenCli.execute(MavenCli.java:862)
	at org.apache.maven.cli.MavenCli.doMain(MavenCli.java:286)
	at org.apache.maven.cli.MavenCli.main(MavenCli.java:197)
	at sun.reflect.NativeMethodAccessorImpl.invoke0(Native Method)
	at sun.reflect.NativeMethodAccessorImpl.invoke(NativeMethodAccessorImpl.java:57)
	at sun.reflect.DelegatingMethodAccessorImpl.invoke(DelegatingMethodAccessorImpl.java:43)
	at java.lang.reflect.Method.invoke(Method.java:601)
	at org.codehaus.plexus.classworlds.launcher.Launcher.launchEnhanced(Launcher.java:289)
	at org.codehaus.plexus.classworlds.launcher.Launcher.launch(Launcher.java:229)
	at org.codehaus.plexus.classworlds.launcher.Launcher.mainWithExitCode(Launcher.java:415)
	at org.codehaus.plexus.classworlds.launcher.Launcher.main(Launcher.java:356)
Caused by: org.apache.maven.plugin.MojoFailureException: There are test failures.

Please refer to F:\ws\m3-its\core-integration-testing-trunk\core-it-suite\target\surefire-reports
for the individual test results.
	at org.apache.maven.plugin.surefire.SurefireHelper.reportExecution(SurefireHelper.java:82)
	at org.apache.maven.plugin.surefire.SurefirePlugin.handleSummary(SurefirePlugin.java:254)
	at org.apache.maven.plugin.surefire.AbstractSurefireMojo.executeAfterPreconditionsChecked(AbstractSurefireMojo.java:854)
	at org.apache.maven.plugin.surefire.AbstractSurefireMojo.execute(AbstractSurefireMojo.java:722)
	at org.apache.maven.plugin.DefaultBuildPluginManager.executeMojo(DefaultBuildPluginManager.java:134)
	at org.apache.maven.lifecycle.internal.MojoExecutor.execute(MojoExecutor.java:208)
	... 20 more
[ERROR] 
[ERROR] Re-run Maven using the -X switch to enable full debug logging.
[ERROR] 
[ERROR] For more information about the errors and possible solutions, please read the following
articles:
[ERROR] [Help 1] http://cwiki.apache.org/confluence/display/MAVEN/MojoFailureException
[ERROR] 
[ERROR] After correcting the problems, you can resume the build with the command
[ERROR]   mvn <goals> -rf :core-it-suite
Build step 'Invoke top-level Maven targets' marked build as failure
Recording test results

Mime
View raw message