maven-notifications mailing list archives

Site index · List index
Message view « Date » · « Thread »
Top « Date » · « Thread »
From Apache Jenkins Server <jenk...@builds.apache.org>
Subject Build failed in Jenkins: maven-plugins » Apache Maven Assembly Plugin #4970
Date Fri, 01 Jan 2016 20:44:52 GMT
See <https://builds.apache.org/job/maven-plugins/org.apache.maven.plugins$maven-assembly-plugin/4970/changes>

Changes:

[Robert Scholte] Switch to maven-artifact-transfer resolvers

------------------------------------------
[INFO]                                                                         
[INFO] ------------------------------------------------------------------------
[INFO] Building Apache Maven Assembly Plugin 3.0-SNAPSHOT
[INFO] ------------------------------------------------------------------------
[INFO] Downloading: http://repo.maven.apache.org/maven2/org/apache/maven/shared/file-management/3.0.0/file-management-3.0.0.pom
[INFO] Downloaded: http://repo.maven.apache.org/maven2/org/apache/maven/shared/file-management/3.0.0/file-management-3.0.0.pom
(5 KB at 30.9 KB/sec)
[INFO] Downloading: http://repo.maven.apache.org/maven2/org/apache/maven/shared/maven-shared-io/3.0.0/maven-shared-io-3.0.0.pom
[INFO] Downloaded: http://repo.maven.apache.org/maven2/org/apache/maven/shared/maven-shared-io/3.0.0/maven-shared-io-3.0.0.pom
(5 KB at 76.6 KB/sec)
[INFO] Downloading: http://repo.maven.apache.org/maven2/org/apache/maven/shared/file-management/3.0.0/file-management-3.0.0.jar
[INFO] Downloading: http://repo.maven.apache.org/maven2/org/apache/maven/shared/maven-shared-io/3.0.0/maven-shared-io-3.0.0.jar
[INFO] Downloaded: http://repo.maven.apache.org/maven2/org/apache/maven/shared/file-management/3.0.0/file-management-3.0.0.jar
(35 KB at 459.9 KB/sec)
[INFO] Downloaded: http://repo.maven.apache.org/maven2/org/apache/maven/shared/maven-shared-io/3.0.0/maven-shared-io-3.0.0.jar
(41 KB at 404.9 KB/sec)
[INFO] 
[INFO] --- maven-clean-plugin:2.5:clean (default-clean) @ maven-assembly-plugin ---
[INFO] Deleting <https://builds.apache.org/job/maven-plugins/org.apache.maven.plugins$maven-assembly-plugin/ws/target>
[INFO] 
[INFO] --- maven-enforcer-plugin:1.3.1:enforce (enforce-bytecode-version) @ maven-assembly-plugin
---
[INFO] 
[INFO] --- maven-enforcer-plugin:1.3.1:enforce (ban-known-bad-maven-versions) @ maven-assembly-plugin
---
[INFO] 
[INFO] --- maven-enforcer-plugin:1.3.1:enforce (ensure-no-container-api) @ maven-assembly-plugin
---
[INFO] 
[INFO] --- apache-rat-plugin:0.11:check (rat-check) @ maven-assembly-plugin ---
[INFO] 51 implicit excludes (use -debug for more details).
[INFO] Exclude: src/it/projects/basic-features/outputFileNameMapping-withArtifactBaseVersion/repository/org/codehaus/plexus/plexus-utils/**
[INFO] Exclude: src/functional-tests/remote-repo/assembly/dependency-artifact/**
[INFO] Exclude: src/it/projects/repositories/repo-with-snapshot-parents/child/remote-repository/org/codehaus/plexus/plexus-utils/1.4.3-SNAPSHOT/plexus-utils-1.4.3-SNAPSHOT.pom
[INFO] Exclude: src/it/projects/container-descriptors/metaInf-services-aggregation/**/*
[INFO] Exclude: src/it/projects/container-descriptors/metaInf-spring-aggregation/**/*
[INFO] Exclude: src/it/**/*.txt
[INFO] Exclude: src/it/**/*.file
[INFO] Exclude: src/it/projects/filtering-feature/filters-defined-in-build/src/main/config/**
[INFO] Exclude: src/it/projects/bugs/massembly-731/**
[INFO] Exclude: DEPENDENCIES
[INFO] 1134 resources included (use -debug for more details)
[INFO] Rat check: Summary of files. Unapproved: 0 unknown: 0 generated: 0 approved: 1124 licence.
[INFO] 
[INFO] --- maven-plugin-plugin:3.4:helpmojo (generate-helpmojo) @ maven-assembly-plugin ---
[INFO] Using 'UTF-8' encoding to read mojo metadata.
[INFO] Mojo extractor with id: java-annotations found 0 mojo descriptors.
[INFO] Mojo extractor with id: java-javadoc found 0 mojo descriptors.
[INFO] 
[INFO] --- modello-maven-plugin:1.8.3:xpp3-reader (mdo) @ maven-assembly-plugin ---
[INFO] outputDirectory: <https://builds.apache.org/job/maven-plugins/org.apache.maven.plugins$maven-assembly-plugin/ws/target/generated-sources/modello>
[INFO] Working on model: src/main/mdo/descriptor.mdo
[INFO] Generating current version: 1.1.3
[INFO] Working on model: src/main/mdo/component.mdo
[INFO] Generating current version: 1.1.3
[INFO] 
[INFO] --- modello-maven-plugin:1.8.3:xpp3-writer (mdo) @ maven-assembly-plugin ---
[INFO] outputDirectory: <https://builds.apache.org/job/maven-plugins/org.apache.maven.plugins$maven-assembly-plugin/ws/target/generated-sources/modello>
[INFO] Working on model: src/main/mdo/descriptor.mdo
[INFO] Generating current version: 1.1.3
[INFO] Working on model: src/main/mdo/component.mdo
[INFO] Generating current version: 1.1.3
[INFO] 
[INFO] --- modello-maven-plugin:1.8.3:java (mdo) @ maven-assembly-plugin ---
[INFO] outputDirectory: <https://builds.apache.org/job/maven-plugins/org.apache.maven.plugins$maven-assembly-plugin/ws/target/generated-sources/modello>
[INFO] Working on model: src/main/mdo/descriptor.mdo
[INFO] Generating current version: 1.1.3
[INFO] Working on model: src/main/mdo/component.mdo
[INFO] Generating current version: 1.1.3
[INFO] 
[INFO] --- modello-maven-plugin:1.8.3:xsd (mdo) @ maven-assembly-plugin ---
[INFO] outputDirectory: <https://builds.apache.org/job/maven-plugins/org.apache.maven.plugins$maven-assembly-plugin/ws/target/generated-site/resources/xsd>
[INFO] Working on model: src/main/mdo/descriptor.mdo
[INFO] Generating current version: 1.1.3
[INFO] Working on model: src/main/mdo/component.mdo
[INFO] Generating current version: 1.1.3
[INFO] 
[INFO] --- maven-remote-resources-plugin:1.5:process (default) @ maven-assembly-plugin ---
[INFO] 
[INFO] --- maven-resources-plugin:2.6:resources (default-resources) @ maven-assembly-plugin
---
[INFO] Using 'UTF-8' encoding to copy filtered resources.
[INFO] Copying 5 resources
[INFO] skip non existing resourceDirectory <https://builds.apache.org/job/maven-plugins/org.apache.maven.plugins$maven-assembly-plugin/ws/target/generated-resources/plexus>
[INFO] Copying 3 resources
[INFO] 
[INFO] --- maven-compiler-plugin:3.2:compile (default-compile) @ maven-assembly-plugin ---
[INFO] Changes detected - recompiling the module!
[INFO] Compiling 89 source files to <https://builds.apache.org/job/maven-plugins/org.apache.maven.plugins$maven-assembly-plugin/ws/target/classes>
[INFO] Some input files use or override a deprecated API.
[INFO] Recompile with -Xlint:deprecation for details.
[INFO] Some input files use unchecked or unsafe operations.
[INFO] Recompile with -Xlint:unchecked for details.
[INFO] 
[INFO] --- maven-plugin-plugin:3.4:descriptor (default-descriptor) @ maven-assembly-plugin
---
[INFO] Using 'UTF-8' encoding to read mojo metadata.
[INFO] Mojo extractor with id: java-annotations found 2 mojo descriptors.
[INFO] Mojo extractor with id: java-javadoc found 0 mojo descriptors.
[INFO] 
[INFO] --- plexus-component-metadata:1.6:generate-metadata (descriptors) @ maven-assembly-plugin
---
[INFO] Discovered 13 component descriptors(s)
[INFO] 
[INFO] --- maven-resources-plugin:2.6:testResources (default-testResources) @ maven-assembly-plugin
---
[INFO] Using 'UTF-8' encoding to copy filtered resources.
[INFO] Copying 1 resource
[INFO] Copying 3 resources
[INFO] 
[INFO] --- maven-compiler-plugin:3.2:testCompile (default-testCompile) @ maven-assembly-plugin
---
[INFO] Changes detected - recompiling the module!
[INFO] Compiling 35 source files to <https://builds.apache.org/job/maven-plugins/org.apache.maven.plugins$maven-assembly-plugin/ws/target/test-classes>
[INFO] Some input files use or override a deprecated API.
[INFO] Recompile with -Xlint:deprecation for details.
[INFO] Some input files use unchecked or unsafe operations.
[INFO] Recompile with -Xlint:unchecked for details.
[INFO] 
[INFO] --- plexus-component-metadata:1.6:generate-test-metadata (descriptors) @ maven-assembly-plugin
---
[INFO] 
[INFO] --- maven-surefire-plugin:2.18.1:test (default-test) @ maven-assembly-plugin ---
[INFO] Surefire report directory: <https://builds.apache.org/job/maven-plugins/org.apache.maven.plugins$maven-assembly-plugin/ws/target/surefire-reports>

-------------------------------------------------------
 T E S T S
-------------------------------------------------------
Running org.apache.maven.plugins.assembly.filter.ComponentsXmlArchiverFileFilterTest
Tests run: 7, Failures: 0, Errors: 0, Skipped: 0, Time elapsed: 0.343 sec - in org.apache.maven.plugins.assembly.filter.ComponentsXmlArchiverFileFilterTest
Running org.apache.maven.plugins.assembly.artifact.DefaultDependencyResolverTest
Tests run: 4, Failures: 0, Errors: 0, Skipped: 0, Time elapsed: 1.321 sec - in org.apache.maven.plugins.assembly.artifact.DefaultDependencyResolverTest
Running org.apache.maven.plugins.assembly.artifact.ResolutionManagementInfoTest
Tests run: 3, Failures: 0, Errors: 0, Skipped: 0, Time elapsed: 0 sec - in org.apache.maven.plugins.assembly.artifact.ResolutionManagementInfoTest
Running org.apache.maven.plugins.assembly.format.ReaderFormatterTest
Tests run: 3, Failures: 0, Errors: 0, Skipped: 0, Time elapsed: 0 sec - in org.apache.maven.plugins.assembly.format.ReaderFormatterTest
Running org.apache.maven.plugins.assembly.archive.ManifestCreationFinalizerTest
Tests run: 4, Failures: 0, Errors: 0, Skipped: 0, Time elapsed: 0.074 sec - in org.apache.maven.plugins.assembly.archive.ManifestCreationFinalizerTest
Running org.apache.maven.plugins.assembly.archive.DefaultAssemblyArchiverTest
Tests run: 13, Failures: 0, Errors: 0, Skipped: 0, Time elapsed: 1.215 sec - in org.apache.maven.plugins.assembly.archive.DefaultAssemblyArchiverTest
Running org.apache.maven.plugins.assembly.archive.phase.DependencySetAssemblyPhaseTest
Tests run: 2, Failures: 0, Errors: 0, Skipped: 0, Time elapsed: 0.126 sec - in org.apache.maven.plugins.assembly.archive.phase.DependencySetAssemblyPhaseTest
Running org.apache.maven.plugins.assembly.archive.phase.RepositoryAssemblyPhaseTest
Tests run: 2, Failures: 0, Errors: 0, Skipped: 0, Time elapsed: 0.049 sec - in org.apache.maven.plugins.assembly.archive.phase.RepositoryAssemblyPhaseTest
Running org.apache.maven.plugins.assembly.archive.phase.AssemblyArchiverPhaseComparatorTest
Tests run: 1, Failures: 0, Errors: 0, Skipped: 0, Time elapsed: 0 sec - in org.apache.maven.plugins.assembly.archive.phase.AssemblyArchiverPhaseComparatorTest
Running org.apache.maven.plugins.assembly.archive.phase.ModuleSetAssemblyPhaseTest
Tests run: 24, Failures: 0, Errors: 0, Skipped: 0, Time elapsed: 0.389 sec - in org.apache.maven.plugins.assembly.archive.phase.ModuleSetAssemblyPhaseTest
Running org.apache.maven.plugins.assembly.archive.phase.FileItemAssemblyPhaseTest
Tests run: 6, Failures: 0, Errors: 0, Skipped: 0, Time elapsed: 0.281 sec - in org.apache.maven.plugins.assembly.archive.phase.FileItemAssemblyPhaseTest
Running org.apache.maven.plugins.assembly.archive.phase.FileSetAssemblyPhaseTest
Tests run: 2, Failures: 0, Errors: 0, Skipped: 0, Time elapsed: 0.042 sec - in org.apache.maven.plugins.assembly.archive.phase.FileSetAssemblyPhaseTest
Running org.apache.maven.plugins.assembly.archive.archiver.AssemblyProxyArchiverTest
Tests run: 4, Failures: 0, Errors: 0, Skipped: 0, Time elapsed: 0.162 sec - in org.apache.maven.plugins.assembly.archive.archiver.AssemblyProxyArchiverTest
Running org.apache.maven.plugins.assembly.archive.task.AddDependencySetsTaskTest
Tests run: 8, Failures: 0, Errors: 0, Skipped: 0, Time elapsed: 0.018 sec - in org.apache.maven.plugins.assembly.archive.task.AddDependencySetsTaskTest
Running org.apache.maven.plugins.assembly.archive.task.AddDirectoryTaskTest
Tests run: 4, Failures: 0, Errors: 0, Skipped: 0, Time elapsed: 0.062 sec - in org.apache.maven.plugins.assembly.archive.task.AddDirectoryTaskTest
Running org.apache.maven.plugins.assembly.archive.task.AddArtifactTaskTest
Tests run: 5, Failures: 0, Errors: 0, Skipped: 0, Time elapsed: 0.007 sec - in org.apache.maven.plugins.assembly.archive.task.AddArtifactTaskTest
Running org.apache.maven.plugins.assembly.archive.task.AddFileSetsTaskTest
Tests run: 9, Failures: 0, Errors: 0, Skipped: 0, Time elapsed: 0.311 sec - in org.apache.maven.plugins.assembly.archive.task.AddFileSetsTaskTest
Running org.apache.maven.plugins.assembly.interpolation.AssemblyInterpolatorTest
Tests run: 7, Failures: 0, Errors: 0, Skipped: 0, Time elapsed: 0.02 sec - in org.apache.maven.plugins.assembly.interpolation.AssemblyInterpolatorTest
Running org.apache.maven.plugins.assembly.interpolation.AssemblyExpressionEvaluatorTest
Tests run: 5, Failures: 0, Errors: 0, Skipped: 0, Time elapsed: 0.001 sec - in org.apache.maven.plugins.assembly.interpolation.AssemblyExpressionEvaluatorTest
Running org.apache.maven.plugins.assembly.utils.WindowsLineFeedInputStreamTest
Tests run: 7, Failures: 0, Errors: 0, Skipped: 0, Time elapsed: 0.001 sec - in org.apache.maven.plugins.assembly.utils.WindowsLineFeedInputStreamTest
Running org.apache.maven.plugins.assembly.utils.FilterUtilsTest
Tests run: 12, Failures: 0, Errors: 0, Skipped: 0, Time elapsed: 0.007 sec - in org.apache.maven.plugins.assembly.utils.FilterUtilsTest
Running org.apache.maven.plugins.assembly.utils.LineEndingsUtilsTest
Tests run: 24, Failures: 0, Errors: 0, Skipped: 0, Time elapsed: 0.012 sec - in org.apache.maven.plugins.assembly.utils.LineEndingsUtilsTest
Running org.apache.maven.plugins.assembly.utils.TypeConversionUtilsTest
Tests run: 6, Failures: 0, Errors: 0, Skipped: 0, Time elapsed: 0 sec - in org.apache.maven.plugins.assembly.utils.TypeConversionUtilsTest
Running org.apache.maven.plugins.assembly.utils.LinuxLineFeedInputStreamTest
Tests run: 7, Failures: 0, Errors: 0, Skipped: 0, Time elapsed: 0 sec - in org.apache.maven.plugins.assembly.utils.LinuxLineFeedInputStreamTest
Running org.apache.maven.plugins.assembly.utils.AssemblyFileUtilsTest
Tests run: 1, Failures: 0, Errors: 0, Skipped: 0, Time elapsed: 0.023 sec - in org.apache.maven.plugins.assembly.utils.AssemblyFileUtilsTest
Running org.apache.maven.plugins.assembly.utils.AssemblyFormatUtilsTest
Tests run: 69, Failures: 0, Errors: 0, Skipped: 0, Time elapsed: 0.052 sec - in org.apache.maven.plugins.assembly.utils.AssemblyFormatUtilsTest
Running org.apache.maven.plugins.assembly.utils.ProjectUtilsTest
Tests run: 5, Failures: 0, Errors: 0, Skipped: 0, Time elapsed: 0.001 sec - in org.apache.maven.plugins.assembly.utils.ProjectUtilsTest
Running org.apache.maven.plugins.assembly.io.DefaultAssemblyReaderTest
Tests run: 24, Failures: 0, Errors: 0, Skipped: 0, Time elapsed: 0.398 sec - in org.apache.maven.plugins.assembly.io.DefaultAssemblyReaderTest
Running org.apache.maven.plugins.assembly.io.PrefixedClasspathLocatorStrategyTest
Tests run: 4, Failures: 0, Errors: 0, Skipped: 0, Time elapsed: 0 sec - in org.apache.maven.plugins.assembly.io.PrefixedClasspathLocatorStrategyTest

Results :

Tests run: 272, Failures: 0, Errors: 0, Skipped: 0

[JENKINS] Recording test results
[INFO] 
[INFO] --- maven-jar-plugin:2.5:jar (default-jar) @ maven-assembly-plugin ---
[INFO] Building jar: <https://builds.apache.org/job/maven-plugins/org.apache.maven.plugins$maven-assembly-plugin/ws/target/maven-assembly-plugin-3.0-SNAPSHOT.jar>
[INFO] 
[INFO] --- maven-plugin-plugin:3.4:addPluginArtifactMetadata (default-addPluginArtifactMetadata)
@ maven-assembly-plugin ---
[INFO] 
[INFO] --- maven-checkstyle-plugin:2.15:check (checkstyle-check) @ maven-assembly-plugin ---
[INFO] There are 9 errors reported by Checkstyle 6.1.1 with config/maven_checks.xml ruleset.
[ERROR] src/main/java/org/apache/maven/plugins/assembly/repository/DefaultRepositoryAssembler.java[34:8]
(imports) UnusedImports: Unused import - org.apache.maven.artifact.resolver.ArtifactNotFoundException.
[ERROR] src/main/java/org/apache/maven/plugins/assembly/repository/DefaultRepositoryAssembler.java[35:8]
(imports) UnusedImports: Unused import - org.apache.maven.artifact.resolver.ArtifactResolutionException.
[ERROR] src/main/java/org/apache/maven/plugins/assembly/repository/DefaultRepositoryAssembler.java[38:8]
(imports) UnusedImports: Unused import - org.apache.maven.artifact.resolver.filter.ExcludesArtifactFilter.
[ERROR] src/main/java/org/apache/maven/plugins/assembly/repository/DefaultRepositoryAssembler.java[39:8]
(imports) UnusedImports: Unused import - org.apache.maven.artifact.versioning.InvalidVersionSpecificationException.
[ERROR] src/main/java/org/apache/maven/plugins/assembly/repository/DefaultRepositoryAssembler.java[40:8]
(imports) UnusedImports: Unused import - org.apache.maven.artifact.versioning.VersionRange.
[ERROR] src/main/java/org/apache/maven/plugins/assembly/repository/DefaultRepositoryAssembler.java[42:8]
(imports) UnusedImports: Unused import - org.apache.maven.model.DependencyManagement.
[ERROR] src/main/java/org/apache/maven/plugins/assembly/repository/DefaultRepositoryAssembler.java[43:8]
(imports) UnusedImports: Unused import - org.apache.maven.model.Exclusion.
[ERROR] src/main/java/org/apache/maven/plugins/assembly/repository/DefaultRepositoryAssembler.java[78:8]
(imports) UnusedImports: Unused import - java.util.Collections.
[ERROR] src/main/java/org/apache/maven/plugins/assembly/repository/DefaultRepositoryAssembler.java[198]
(sizes) LineLength: Line is longer than 120 characters (found 139).

Mime
View raw message