maven-notifications mailing list archives

Site index · List index
Message view « Date » · « Thread »
Top « Date » · « Thread »
From Apache Jenkins Server <jenk...@builds.apache.org>
Subject Build failed in Jenkins: maven-plugins-ITs-m3-windows #1381
Date Sat, 02 Jan 2016 13:41:21 GMT
See <https://builds.apache.org/job/maven-plugins-ITs-m3-windows/1381/changes>

Changes:

[hboutemy] [MSITE-326] made file encoding default to platform encoding (instead of ISO-8859-1), with warning (only on site rendering goals)

------------------------------------------
[...truncated 3625 lines...]
[INFO] 
[INFO] --- maven-plugin-plugin:3.4:addPluginArtifactMetadata (default-addPluginArtifactMetadata) @ maven-remote-resources-plugin ---
[INFO] 
[INFO] --- maven-invoker-plugin:2.0.0:install (integration-test) @ maven-remote-resources-plugin ---
[INFO] Installing F:\jenkins\jenkins-slave\workspace\maven-plugins-ITs-m3-windows\maven-acr-plugin\pom.xml to F:\jenkins\jenkins-slave\workspace\maven-plugins-ITs-m3-windows\maven-remote-resources-plugin\target\local-repo\org\apache\maven\plugins\maven-acr-plugin\1.2-SNAPSHOT\maven-acr-plugin-1.2-SNAPSHOT.pom
[INFO] Installing F:\jenkins\jenkins-slave\workspace\maven-plugins-ITs-m3-windows\maven-ant-plugin\pom.xml to F:\jenkins\jenkins-slave\workspace\maven-plugins-ITs-m3-windows\maven-remote-resources-plugin\target\local-repo\org\apache\maven\plugins\maven-ant-plugin\2.5-SNAPSHOT\maven-ant-plugin-2.5-SNAPSHOT.pom
[INFO] Installing F:\jenkins\jenkins-slave\workspace\maven-plugins-ITs-m3-windows\maven-ant-plugin\target\maven-ant-plugin-2.5-SNAPSHOT.jar to F:\jenkins\jenkins-slave\workspace\maven-plugins-ITs-m3-windows\maven-remote-resources-plugin\target\local-repo\org\apache\maven\plugins\maven-ant-plugin\2.5-SNAPSHOT\maven-ant-plugin-2.5-SNAPSHOT.jar
[INFO] Installing F:\jenkins\jenkins-slave\workspace\maven-plugins-ITs-m3-windows\maven-ant-plugin\pom.xml to F:\jenkins\jenkins-slave\workspace\maven-plugins-ITs-m3-windows\maven-remote-resources-plugin\target\local-repo\org\apache\maven\plugins\maven-ant-plugin\2.5-SNAPSHOT\maven-ant-plugin-2.5-SNAPSHOT.pom
[INFO] Installing F:\jenkins\jenkins-slave\workspace\maven-plugins-ITs-m3-windows\maven-antrun-plugin\pom.xml to F:\jenkins\jenkins-slave\workspace\maven-plugins-ITs-m3-windows\maven-remote-resources-plugin\target\local-repo\org\apache\maven\plugins\maven-antrun-plugin\1.9-SNAPSHOT\maven-antrun-plugin-1.9-SNAPSHOT.pom
[INFO] Installing F:\jenkins\jenkins-slave\workspace\maven-plugins-ITs-m3-windows\maven-antrun-plugin\target\maven-antrun-plugin-1.9-SNAPSHOT.jar to F:\jenkins\jenkins-slave\workspace\maven-plugins-ITs-m3-windows\maven-remote-resources-plugin\target\local-repo\org\apache\maven\plugins\maven-antrun-plugin\1.9-SNAPSHOT\maven-antrun-plugin-1.9-SNAPSHOT.jar
[INFO] Installing F:\jenkins\jenkins-slave\workspace\maven-plugins-ITs-m3-windows\maven-antrun-plugin\pom.xml to F:\jenkins\jenkins-slave\workspace\maven-plugins-ITs-m3-windows\maven-remote-resources-plugin\target\local-repo\org\apache\maven\plugins\maven-antrun-plugin\1.9-SNAPSHOT\maven-antrun-plugin-1.9-SNAPSHOT.pom
[INFO] Installing F:\jenkins\jenkins-slave\workspace\maven-plugins-ITs-m3-windows\maven-changelog-plugin\pom.xml to F:\jenkins\jenkins-slave\workspace\maven-plugins-ITs-m3-windows\maven-remote-resources-plugin\target\local-repo\org\apache\maven\plugins\maven-changelog-plugin\2.4-SNAPSHOT\maven-changelog-plugin-2.4-SNAPSHOT.pom
[INFO] Installing F:\jenkins\jenkins-slave\workspace\maven-plugins-ITs-m3-windows\maven-changelog-plugin\target\maven-changelog-plugin-2.4-SNAPSHOT.jar to F:\jenkins\jenkins-slave\workspace\maven-plugins-ITs-m3-windows\maven-remote-resources-plugin\target\local-repo\org\apache\maven\plugins\maven-changelog-plugin\2.4-SNAPSHOT\maven-changelog-plugin-2.4-SNAPSHOT.jar
[INFO] Installing F:\jenkins\jenkins-slave\workspace\maven-plugins-ITs-m3-windows\maven-changelog-plugin\pom.xml to F:\jenkins\jenkins-slave\workspace\maven-plugins-ITs-m3-windows\maven-remote-resources-plugin\target\local-repo\org\apache\maven\plugins\maven-changelog-plugin\2.4-SNAPSHOT\maven-changelog-plugin-2.4-SNAPSHOT.pom
[INFO] Installing F:\jenkins\jenkins-slave\workspace\maven-plugins-ITs-m3-windows\maven-changes-plugin\pom.xml to F:\jenkins\jenkins-slave\workspace\maven-plugins-ITs-m3-windows\maven-remote-resources-plugin\target\local-repo\org\apache\maven\plugins\maven-changes-plugin\2.12-SNAPSHOT\maven-changes-plugin-2.12-SNAPSHOT.pom
[INFO] Installing F:\jenkins\jenkins-slave\workspace\maven-plugins-ITs-m3-windows\maven-clean-plugin\pom.xml to F:\jenkins\jenkins-slave\workspace\maven-plugins-ITs-m3-windows\maven-remote-resources-plugin\target\local-repo\org\apache\maven\plugins\maven-clean-plugin\3.0.1-SNAPSHOT\maven-clean-plugin-3.0.1-SNAPSHOT.pom
[INFO] Installing F:\jenkins\jenkins-slave\workspace\maven-plugins-ITs-m3-windows\maven-compiler-plugin\pom.xml to F:\jenkins\jenkins-slave\workspace\maven-plugins-ITs-m3-windows\maven-remote-resources-plugin\target\local-repo\org\apache\maven\plugins\maven-compiler-plugin\3.5-SNAPSHOT\maven-compiler-plugin-3.5-SNAPSHOT.pom
[INFO] Installing F:\jenkins\jenkins-slave\workspace\maven-plugins-ITs-m3-windows\maven-deploy-plugin\pom.xml to F:\jenkins\jenkins-slave\workspace\maven-plugins-ITs-m3-windows\maven-remote-resources-plugin\target\local-repo\org\apache\maven\plugins\maven-deploy-plugin\3.0-SNAPSHOT\maven-deploy-plugin-3.0-SNAPSHOT.pom
[INFO] Installing F:\jenkins\jenkins-slave\workspace\maven-plugins-ITs-m3-windows\maven-docck-plugin\pom.xml to F:\jenkins\jenkins-slave\workspace\maven-plugins-ITs-m3-windows\maven-remote-resources-plugin\target\local-repo\org\apache\maven\plugins\maven-docck-plugin\1.2-SNAPSHOT\maven-docck-plugin-1.2-SNAPSHOT.pom
[INFO] Installing F:\jenkins\jenkins-slave\workspace\maven-plugins-ITs-m3-windows\maven-docck-plugin\target\maven-docck-plugin-1.2-SNAPSHOT.jar to F:\jenkins\jenkins-slave\workspace\maven-plugins-ITs-m3-windows\maven-remote-resources-plugin\target\local-repo\org\apache\maven\plugins\maven-docck-plugin\1.2-SNAPSHOT\maven-docck-plugin-1.2-SNAPSHOT.jar
[INFO] Installing F:\jenkins\jenkins-slave\workspace\maven-plugins-ITs-m3-windows\maven-docck-plugin\pom.xml to F:\jenkins\jenkins-slave\workspace\maven-plugins-ITs-m3-windows\maven-remote-resources-plugin\target\local-repo\org\apache\maven\plugins\maven-docck-plugin\1.2-SNAPSHOT\maven-docck-plugin-1.2-SNAPSHOT.pom
[INFO] Installing F:\jenkins\jenkins-slave\workspace\maven-plugins-ITs-m3-windows\maven-ear-plugin\pom.xml to F:\jenkins\jenkins-slave\workspace\maven-plugins-ITs-m3-windows\maven-remote-resources-plugin\target\local-repo\org\apache\maven\plugins\maven-ear-plugin\2.10.2-SNAPSHOT\maven-ear-plugin-2.10.2-SNAPSHOT.pom
[INFO] Installing F:\jenkins\jenkins-slave\workspace\maven-plugins-ITs-m3-windows\maven-ejb-plugin\pom.xml to F:\jenkins\jenkins-slave\workspace\maven-plugins-ITs-m3-windows\maven-remote-resources-plugin\target\local-repo\org\apache\maven\plugins\maven-ejb-plugin\2.5.2-SNAPSHOT\maven-ejb-plugin-2.5.2-SNAPSHOT.pom
[INFO] Installing F:\jenkins\jenkins-slave\workspace\maven-plugins-ITs-m3-windows\maven-help-plugin\pom.xml to F:\jenkins\jenkins-slave\workspace\maven-plugins-ITs-m3-windows\maven-remote-resources-plugin\target\local-repo\org\apache\maven\plugins\maven-help-plugin\2.2.1-SNAPSHOT\maven-help-plugin-2.2.1-SNAPSHOT.pom
[INFO] Installing F:\jenkins\jenkins-slave\workspace\maven-plugins-ITs-m3-windows\maven-install-plugin\pom.xml to F:\jenkins\jenkins-slave\workspace\maven-plugins-ITs-m3-windows\maven-remote-resources-plugin\target\local-repo\org\apache\maven\plugins\maven-install-plugin\3.0-SNAPSHOT\maven-install-plugin-3.0-SNAPSHOT.pom
[INFO] Installing F:\jenkins\jenkins-slave\workspace\maven-plugins-ITs-m3-windows\maven-jarsigner-plugin\pom.xml to F:\jenkins\jenkins-slave\workspace\maven-plugins-ITs-m3-windows\maven-remote-resources-plugin\target\local-repo\org\apache\maven\plugins\maven-jarsigner-plugin\1.5-SNAPSHOT\maven-jarsigner-plugin-1.5-SNAPSHOT.pom
[INFO] Installing F:\jenkins\jenkins-slave\workspace\maven-plugins-ITs-m3-windows\maven-javadoc-plugin\pom.xml to F:\jenkins\jenkins-slave\workspace\maven-plugins-ITs-m3-windows\maven-remote-resources-plugin\target\local-repo\org\apache\maven\plugins\maven-javadoc-plugin\2.10.4-SNAPSHOT\maven-javadoc-plugin-2.10.4-SNAPSHOT.pom
[INFO]                                                                         
[INFO] ------------------------------------------------------------------------
[INFO] Building Apache Maven Shade Plugin 2.4.3-SNAPSHOT
[INFO] ------------------------------------------------------------------------
Downloading: http://repo.maven.apache.org/maven2/org/vafer/jdependency/1.1/jdependency-1.1.pom
Downloading: http://repo.maven.apache.org/maven2/org/mockito/mockito-all/1.9.5/mockito-all-1.9.5.pom
[INFO]                                                                         
[INFO] ------------------------------------------------------------------------
[INFO] Building Apache Maven SCM Publish Plugin 1.2-SNAPSHOT
[INFO] ------------------------------------------------------------------------
[INFO] 
[INFO] --- maven-clean-plugin:2.5:clean (default-clean) @ maven-scm-publish-plugin ---
[INFO] 
[INFO] --- maven-enforcer-plugin:1.3.1:enforce (enforce-bytecode-version) @ maven-scm-publish-plugin ---
[INFO] 
[INFO] --- maven-enforcer-plugin:1.3.1:enforce (ban-known-bad-maven-versions) @ maven-scm-publish-plugin ---
[INFO] 
[INFO] --- maven-enforcer-plugin:1.3.1:enforce (ensure-no-container-api) @ maven-scm-publish-plugin ---
[INFO] 
[INFO] --- apache-rat-plugin:0.11:check (rat-check) @ maven-scm-publish-plugin ---
[INFO] 51 implicit excludes (use -debug for more details).
[INFO] Exclude: DEPENDENCIES
[INFO] 41 resources included (use -debug for more details)
[INFO] Rat check: Summary of files. Unapproved: 0 unknown: 0 generated: 0 approved: 39 licence.
[INFO] 
[INFO] --- maven-plugin-plugin:3.4:helpmojo (generate-helpmojo) @ maven-scm-publish-plugin ---
[INFO] Using 'UTF-8' encoding to read mojo metadata.
[INFO] Mojo extractor with id: java-annotations found 0 mojo descriptors.
[INFO] Mojo extractor with id: java-javadoc found 1 mojo descriptors.
[INFO] 
[INFO] --- maven-remote-resources-plugin:1.5:process (default) @ maven-scm-publish-plugin ---
[INFO] 
[INFO] --- maven-resources-plugin:2.7:resources (default-resources) @ maven-scm-publish-plugin ---
[INFO] Using 'UTF-8' encoding to copy filtered resources.
[INFO] Copying 2 resources
[INFO] Copying 3 resources
[INFO] 
[INFO] --- maven-compiler-plugin:3.2:compile (default-compile) @ maven-scm-publish-plugin ---
[INFO] Changes detected - recompiling the module!
[INFO] Compiling 4 source files to F:\jenkins\jenkins-slave\workspace\maven-plugins-ITs-m3-windows\maven-scm-publish-plugin\target\classes
[INFO] 
[INFO] --- maven-plugin-plugin:3.4:descriptor (default-descriptor) @ maven-scm-publish-plugin ---
[INFO] Using 'UTF-8' encoding to read mojo metadata.
[INFO] Mojo extractor with id: java-annotations found 2 mojo descriptors.
[INFO] Mojo extractor with id: java-javadoc found 1 mojo descriptors.
[INFO] 
[INFO] --- maven-resources-plugin:2.7:testResources (default-testResources) @ maven-scm-publish-plugin ---
[INFO] Using 'UTF-8' encoding to copy filtered resources.
[INFO] skip non existing resourceDirectory F:\jenkins\jenkins-slave\workspace\maven-plugins-ITs-m3-windows\maven-scm-publish-plugin\src\test\resources
[INFO] Copying 3 resources
[INFO] 
[INFO] --- maven-compiler-plugin:3.2:testCompile (default-testCompile) @ maven-scm-publish-plugin ---
[INFO] No sources to compile
[INFO] 
[INFO] --- maven-surefire-plugin:2.18.1:test (default-test) @ maven-scm-publish-plugin ---
[INFO] 
[INFO] --- maven-jar-plugin:2.5:jar (default-jar) @ maven-scm-publish-plugin ---
[INFO] Building jar: F:\jenkins\jenkins-slave\workspace\maven-plugins-ITs-m3-windows\maven-scm-publish-plugin\target\maven-scm-publish-plugin-1.2-SNAPSHOT.jar
[INFO] 
[INFO] --- maven-plugin-plugin:3.4:addPluginArtifactMetadata (default-addPluginArtifactMetadata) @ maven-scm-publish-plugin ---
[INFO] 
[INFO] --- maven-invoker-plugin:2.0.0:install (integration-test) @ maven-scm-publish-plugin ---
[INFO] Installing F:\jenkins\jenkins-slave\workspace\maven-plugins-ITs-m3-windows\maven-acr-plugin\pom.xml to F:\jenkins\jenkins-slave\workspace\maven-plugins-ITs-m3-windows\maven-scm-publish-plugin\target\local-repo\org\apache\maven\plugins\maven-acr-plugin\1.2-SNAPSHOT\maven-acr-plugin-1.2-SNAPSHOT.pom
[INFO] Installing F:\jenkins\jenkins-slave\workspace\maven-plugins-ITs-m3-windows\maven-ant-plugin\pom.xml to F:\jenkins\jenkins-slave\workspace\maven-plugins-ITs-m3-windows\maven-scm-publish-plugin\target\local-repo\org\apache\maven\plugins\maven-ant-plugin\2.5-SNAPSHOT\maven-ant-plugin-2.5-SNAPSHOT.pom
[INFO] Installing F:\jenkins\jenkins-slave\workspace\maven-plugins-ITs-m3-windows\maven-ant-plugin\target\maven-ant-plugin-2.5-SNAPSHOT.jar to F:\jenkins\jenkins-slave\workspace\maven-plugins-ITs-m3-windows\maven-scm-publish-plugin\target\local-repo\org\apache\maven\plugins\maven-ant-plugin\2.5-SNAPSHOT\maven-ant-plugin-2.5-SNAPSHOT.jar
[INFO] Installing F:\jenkins\jenkins-slave\workspace\maven-plugins-ITs-m3-windows\maven-ant-plugin\pom.xml to F:\jenkins\jenkins-slave\workspace\maven-plugins-ITs-m3-windows\maven-scm-publish-plugin\target\local-repo\org\apache\maven\plugins\maven-ant-plugin\2.5-SNAPSHOT\maven-ant-plugin-2.5-SNAPSHOT.pom
[INFO] Installing F:\jenkins\jenkins-slave\workspace\maven-plugins-ITs-m3-windows\maven-antrun-plugin\pom.xml to F:\jenkins\jenkins-slave\workspace\maven-plugins-ITs-m3-windows\maven-scm-publish-plugin\target\local-repo\org\apache\maven\plugins\maven-antrun-plugin\1.9-SNAPSHOT\maven-antrun-plugin-1.9-SNAPSHOT.pom
[INFO] Installing F:\jenkins\jenkins-slave\workspace\maven-plugins-ITs-m3-windows\maven-antrun-plugin\target\maven-antrun-plugin-1.9-SNAPSHOT.jar to F:\jenkins\jenkins-slave\workspace\maven-plugins-ITs-m3-windows\maven-scm-publish-plugin\target\local-repo\org\apache\maven\plugins\maven-antrun-plugin\1.9-SNAPSHOT\maven-antrun-plugin-1.9-SNAPSHOT.jar
[INFO] Installing F:\jenkins\jenkins-slave\workspace\maven-plugins-ITs-m3-windows\maven-antrun-plugin\pom.xml to F:\jenkins\jenkins-slave\workspace\maven-plugins-ITs-m3-windows\maven-scm-publish-plugin\target\local-repo\org\apache\maven\plugins\maven-antrun-plugin\1.9-SNAPSHOT\maven-antrun-plugin-1.9-SNAPSHOT.pom
[INFO] Installing F:\jenkins\jenkins-slave\workspace\maven-plugins-ITs-m3-windows\maven-changelog-plugin\pom.xml to F:\jenkins\jenkins-slave\workspace\maven-plugins-ITs-m3-windows\maven-scm-publish-plugin\target\local-repo\org\apache\maven\plugins\maven-changelog-plugin\2.4-SNAPSHOT\maven-changelog-plugin-2.4-SNAPSHOT.pom
[INFO] Installing F:\jenkins\jenkins-slave\workspace\maven-plugins-ITs-m3-windows\maven-changelog-plugin\target\maven-changelog-plugin-2.4-SNAPSHOT.jar to F:\jenkins\jenkins-slave\workspace\maven-plugins-ITs-m3-windows\maven-scm-publish-plugin\target\local-repo\org\apache\maven\plugins\maven-changelog-plugin\2.4-SNAPSHOT\maven-changelog-plugin-2.4-SNAPSHOT.jar
[INFO] Installing F:\jenkins\jenkins-slave\workspace\maven-plugins-ITs-m3-windows\maven-changelog-plugin\pom.xml to F:\jenkins\jenkins-slave\workspace\maven-plugins-ITs-m3-windows\maven-scm-publish-plugin\target\local-repo\org\apache\maven\plugins\maven-changelog-plugin\2.4-SNAPSHOT\maven-changelog-plugin-2.4-SNAPSHOT.pom
[INFO] Installing F:\jenkins\jenkins-slave\workspace\maven-plugins-ITs-m3-windows\maven-changes-plugin\pom.xml to F:\jenkins\jenkins-slave\workspace\maven-plugins-ITs-m3-windows\maven-scm-publish-plugin\target\local-repo\org\apache\maven\plugins\maven-changes-plugin\2.12-SNAPSHOT\maven-changes-plugin-2.12-SNAPSHOT.pom
[INFO] Installing F:\jenkins\jenkins-slave\workspace\maven-plugins-ITs-m3-windows\maven-clean-plugin\pom.xml to F:\jenkins\jenkins-slave\workspace\maven-plugins-ITs-m3-windows\maven-scm-publish-plugin\target\local-repo\org\apache\maven\plugins\maven-clean-plugin\3.0.1-SNAPSHOT\maven-clean-plugin-3.0.1-SNAPSHOT.pom
[INFO] Installing F:\jenkins\jenkins-slave\workspace\maven-plugins-ITs-m3-windows\maven-compiler-plugin\pom.xml to F:\jenkins\jenkins-slave\workspace\maven-plugins-ITs-m3-windows\maven-scm-publish-plugin\target\local-repo\org\apache\maven\plugins\maven-compiler-plugin\3.5-SNAPSHOT\maven-compiler-plugin-3.5-SNAPSHOT.pom
[INFO] Installing F:\jenkins\jenkins-slave\workspace\maven-plugins-ITs-m3-windows\maven-deploy-plugin\pom.xml to F:\jenkins\jenkins-slave\workspace\maven-plugins-ITs-m3-windows\maven-scm-publish-plugin\target\local-repo\org\apache\maven\plugins\maven-deploy-plugin\3.0-SNAPSHOT\maven-deploy-plugin-3.0-SNAPSHOT.pom
[INFO] Installing F:\jenkins\jenkins-slave\workspace\maven-plugins-ITs-m3-windows\maven-docck-plugin\pom.xml to F:\jenkins\jenkins-slave\workspace\maven-plugins-ITs-m3-windows\maven-scm-publish-plugin\target\local-repo\org\apache\maven\plugins\maven-docck-plugin\1.2-SNAPSHOT\maven-docck-plugin-1.2-SNAPSHOT.pom
[INFO] Installing F:\jenkins\jenkins-slave\workspace\maven-plugins-ITs-m3-windows\maven-docck-plugin\target\maven-docck-plugin-1.2-SNAPSHOT.jar to F:\jenkins\jenkins-slave\workspace\maven-plugins-ITs-m3-windows\maven-scm-publish-plugin\target\local-repo\org\apache\maven\plugins\maven-docck-plugin\1.2-SNAPSHOT\maven-docck-plugin-1.2-SNAPSHOT.jar
[INFO] Installing F:\jenkins\jenkins-slave\workspace\maven-plugins-ITs-m3-windows\maven-docck-plugin\pom.xml to F:\jenkins\jenkins-slave\workspace\maven-plugins-ITs-m3-windows\maven-scm-publish-plugin\target\local-repo\org\apache\maven\plugins\maven-docck-plugin\1.2-SNAPSHOT\maven-docck-plugin-1.2-SNAPSHOT.pom
[INFO] Installing F:\jenkins\jenkins-slave\workspace\maven-plugins-ITs-m3-windows\maven-ear-plugin\pom.xml to F:\jenkins\jenkins-slave\workspace\maven-plugins-ITs-m3-windows\maven-scm-publish-plugin\target\local-repo\org\apache\maven\plugins\maven-ear-plugin\2.10.2-SNAPSHOT\maven-ear-plugin-2.10.2-SNAPSHOT.pom
[INFO] Installing F:\jenkins\jenkins-slave\workspace\maven-plugins-ITs-m3-windows\maven-ejb-plugin\pom.xml to F:\jenkins\jenkins-slave\workspace\maven-plugins-ITs-m3-windows\maven-scm-publish-plugin\target\local-repo\org\apache\maven\plugins\maven-ejb-plugin\2.5.2-SNAPSHOT\maven-ejb-plugin-2.5.2-SNAPSHOT.pom
[INFO] Installing F:\jenkins\jenkins-slave\workspace\maven-plugins-ITs-m3-windows\maven-help-plugin\pom.xml to F:\jenkins\jenkins-slave\workspace\maven-plugins-ITs-m3-windows\maven-scm-publish-plugin\target\local-repo\org\apache\maven\plugins\maven-help-plugin\2.2.1-SNAPSHOT\maven-help-plugin-2.2.1-SNAPSHOT.pom
[INFO] Installing F:\jenkins\jenkins-slave\workspace\maven-plugins-ITs-m3-windows\maven-install-plugin\pom.xml to F:\jenkins\jenkins-slave\workspace\maven-plugins-ITs-m3-windows\maven-scm-publish-plugin\target\local-repo\org\apache\maven\plugins\maven-install-plugin\3.0-SNAPSHOT\maven-install-plugin-3.0-SNAPSHOT.pom
[INFO] Installing F:\jenkins\jenkins-slave\workspace\maven-plugins-ITs-m3-windows\maven-jarsigner-plugin\pom.xml to F:\jenkins\jenkins-slave\workspace\maven-plugins-ITs-m3-windows\maven-scm-publish-plugin\target\local-repo\org\apache\maven\plugins\maven-jarsigner-plugin\1.5-SNAPSHOT\maven-jarsigner-plugin-1.5-SNAPSHOT.pom
[INFO] Installing F:\jenkins\jenkins-slave\workspace\maven-plugins-ITs-m3-windows\maven-javadoc-plugin\pom.xml to F:\jenkins\jenkins-slave\workspace\maven-plugins-ITs-m3-windows\maven-scm-publish-plugin\target\local-repo\org\apache\maven\plugins\maven-javadoc-plugin\2.10.4-SNAPSHOT\maven-javadoc-plugin-2.10.4-SNAPSHOT.pom
[INFO]                                                                         
[INFO] ------------------------------------------------------------------------
[INFO] Building Apache Maven Plugins Aggregator 1-SNAPSHOT
[INFO] ------------------------------------------------------------------------
[INFO] 
[INFO] --- maven-clean-plugin:2.5:clean (default-clean) @ maven-plugins-aggregator ---
[INFO] 
[INFO] --- maven-enforcer-plugin:1.3.1:enforce (enforce-bytecode-version) @ maven-plugins-aggregator ---
[INFO] 
[INFO] --- maven-enforcer-plugin:1.3.1:enforce (ban-known-bad-maven-versions) @ maven-plugins-aggregator ---
[INFO] 
[INFO] --- maven-remote-resources-plugin:1.5:process (default) @ maven-plugins-aggregator ---
[INFO] 
[INFO] --- maven-site-plugin:3.3:attach-descriptor (attach-descriptor) @ maven-plugins-aggregator ---
[INFO] 
[INFO] --- maven-install-plugin:2.5.1:install (default-install) @ maven-plugins-aggregator ---
[INFO] Installing <https://builds.apache.org/job/maven-plugins-ITs-m3-windows/ws/pom.xml> to C:\.m2\repository\org\apache\maven\plugins\maven-plugins-aggregator\1-SNAPSHOT\maven-plugins-aggregator-1-SNAPSHOT.pom
[INFO] ------------------------------------------------------------------------
[INFO] Reactor Summary:
[INFO] 
[INFO] Apache Maven ACR Plugin ........................... FAILURE [6.253s]
[INFO] Apache Maven Ant Plugin ........................... SUCCESS [2:56.521s]
[INFO] Apache Maven AntRun Plugin ........................ SUCCESS [1:35.209s]
[INFO] Apache Maven Changelog Plugin ..................... FAILURE [1:39.384s]
[INFO] Apache Maven Changes Plugin ....................... FAILURE [1.852s]
[INFO] Apache Maven Clean Plugin ......................... FAILURE [0.124s]
[INFO] Apache Maven Compiler Plugin ...................... FAILURE [7.640s]
[INFO] Apache Maven Deploy Plugin ........................ FAILURE [3.809s]
[INFO] Apache Maven Documentation Checker Plugin ......... FAILURE [9.446s]
[INFO] Apache Maven EAR Plugin ........................... FAILURE [0.147s]
[INFO] Apache Maven EJB Plugin ........................... FAILURE [0.731s]
[INFO] Apache Maven Help Plugin .......................... FAILURE [0.152s]
[INFO] Apache Maven Install Plugin ....................... FAILURE [0.124s]
[INFO] Apache Maven Jarsigner Plugin ..................... FAILURE [0.044s]
[INFO] Apache Maven Javadoc Plugin ....................... FAILURE [2:06.719s]
[INFO] Apache Maven Linkcheck Plugin ..................... FAILURE [3.705s]
[INFO] Apache Maven Patch Plugin ......................... FAILURE [0.812s]
[INFO] Apache Maven PDF Plugin ........................... FAILURE [22.422s]
[INFO] Apache Maven RAR Plugin ........................... FAILURE [0.111s]
[INFO] Apache Maven Repository Plugin .................... FAILURE [5.320s]
[INFO] Apache Maven Resources Plugin ..................... FAILURE [0.124s]
[INFO] Apache Maven Site Plugin .......................... FAILURE [2.978s]
[INFO] Apache Maven Source Plugin ........................ FAILURE [0.112s]
[INFO] Apache Maven Stage Plugin ......................... FAILURE [3.229s]
[INFO] Apache Maven Toolchains Plugin .................... FAILURE [1.744s]
[INFO] Apache Maven Verifier Plugin ...................... FAILURE [2.129s]
[INFO] Apache Maven WAR Plugin ........................... FAILURE [15.008s]
[INFO] Apache Maven DOAP Plugin .......................... FAILURE [13.242s]
[INFO] Apache Maven PMD Plugin ........................... FAILURE [0.347s]
[INFO] Apache Maven Invoker Plugin ....................... FAILURE [16.079s]
[INFO] Apache Maven JAR Plugin ........................... FAILURE [0.052s]
[INFO] Apache Maven Project Info Reports Plugin .......... FAILURE [0.652s]
[INFO] Apache Maven Remote Resources Plugin .............. FAILURE [7.575s]
[INFO] Apache Maven Shade Plugin ......................... FAILURE [0.242s]
[INFO] Apache Maven SCM Publish Plugin ................... FAILURE [6.952s]
[INFO] Apache Maven Plugins Aggregator ................... SUCCESS [0.456s]
[INFO] ------------------------------------------------------------------------
[INFO] BUILD FAILURE
[INFO] ------------------------------------------------------------------------
[INFO] Total time: 10:36.938s
[INFO] Finished at: Sat Jan 02 05:41:01 PST 2016
[INFO] Final Memory: 64M/154M
[INFO] ------------------------------------------------------------------------
[WARNING] The requested profile "apache.snapshots" could not be activated because it does not exist.
[ERROR] Failed to execute goal on project maven-acr-plugin: Could not resolve dependencies for project org.apache.maven.plugins:maven-acr-plugin:maven-plugin:1.2-SNAPSHOT: The following artifacts could not be resolved: org.apache.maven.shared:maven-shared-utils:jar:3.0.0, org.apache.maven.shared:maven-filtering:jar:3.0.0: Could not transfer artifact org.apache.maven.shared:maven-shared-utils:jar:3.0.0 from/to central (http://repo.maven.apache.org/maven2): GET request of: org/apache/maven/shared/maven-shared-utils/3.0.0/maven-shared-utils-3.0.0.jar from central failed: There is not enough space on the disk -> [Help 1]
[ERROR] Failed to execute goal org.apache.maven.plugins:maven-install-plugin:2.5.2:install (default-install) on project maven-changelog-plugin: Failed to install artifact org.apache.maven.plugins:maven-changelog-plugin:jar:2.4-SNAPSHOT: There is not enough space on the disk -> [Help 2]
[ERROR] Failed to execute goal on project maven-changes-plugin: Could not resolve dependencies for project org.apache.maven.plugins:maven-changes-plugin:maven-plugin:2.12-SNAPSHOT: Failed to collect dependencies for [org.apache.maven:maven-core:jar:2.2.1 (compile), org.apache.maven:maven-artifact:jar:2.2.1 (compile), org.apache.maven:maven-model:jar:2.2.1 (compile), org.apache.maven:maven-plugin-api:jar:2.2.1 (compile), org.apache.maven:maven-project:jar:2.2.1 (compile), org.apache.maven:maven-settings:jar:2.2.1 (compile), org.apache.maven.plugin-tools:maven-plugin-annotations:jar:3.4 (provided), org.apache.maven.reporting:maven-reporting-api:jar:3.0 (compile), org.apache.maven.reporting:maven-reporting-impl:jar:2.3 (compile), org.apache.maven.shared:maven-filtering:jar:1.3 (compile), org.codehaus.plexus:plexus-interpolation:jar:1.21 (compile), org.codehaus.plexus:plexus-mail-sender-api:jar:1.0-alpha-7 (compile), org.apache.geronimo.javamail:geronimo-javamail_1.4_provider:jar:1.7 (compile), org.apache.geronimo.specs:geronimo-javamail_1.4_spec:jar:1.7 (compile), org.apache.geronimo.javamail:geronimo-javamail_1.4_mail:jar:1.7 (compile), org.codehaus.plexus:plexus-mail-sender-javamail:jar:1.0-alpha-7 (compile), org.codehaus.plexus:plexus-mail-sender-simple:jar:1.0-alpha-7 (compile), org.codehaus.plexus:plexus-i18n:jar:1.0-beta-7 (compile), org.codehaus.plexus:plexus-utils:jar:3.0.22 (compile), org.codehaus.plexus:plexus-velocity:jar:1.1.8 (compile), commons-collections:commons-collections:jar:3.0 (compile), commons-httpclient:commons-httpclient:jar:3.0.1 (compile), commons-io:commons-io:jar:2.2 (compile), commons-lang:commons-lang:jar:2.6 (compile), commons-logging:commons-logging:jar:1.1.1 (compile), org.apache.maven.doxia:doxia-core:jar:1.4 (compile), org.apache.maven.doxia:doxia-module-xhtml:jar:1.4 (compile), org.apache.maven.doxia:doxia-sink-api:jar:1.4 (compile), org.apache.maven.doxia:doxia-decoration-model:jar:1.4 (compile), org.apache.maven.doxia:doxia-site-renderer:jar:1.4 (compile), org.apache.cxf:cxf-rt-frontend-jaxrs:jar:2.6.3 (compile), com.fasterxml.jackson.core:jackson-core:jar:2.1.0 (compile), com.fasterxml.jackson.core:jackson-databind:jar:2.1.0 (compile), org.apache.velocity:velocity:jar:1.7 (compile), org.apache.velocity:velocity-tools:jar:2.0 (compile), xml-apis:xml-apis:jar:1.3.04 (compile), xerces:xercesImpl:jar:2.9.1 (compile), org.apache.xmlrpc:xmlrpc-client:jar:3.0 (compile), org.eclipse.mylyn.github:org.eclipse.egit.github.core:jar:2.1.5 (compile), org.apache.httpcomponents:httpcore:jar:4.1.2 (compile), org.apache.httpcomponents:httpclient:jar:4.1.2 (compile), rome:rome:jar:1.0 (compile), junit:junit:jar:3.8.2 (test), org.apache.maven.plugin-testing:maven-plugin-testing-harness:jar:1.2 (test)]: Failed to read artifact descriptor for com.sun.xml.bind:jaxb-impl:jar:2.1.13: Could not transfer artifact com.sun.xml.bind:jaxb-impl:pom:2.1.13 from/to central (http://repo.maven.apache.org/maven2): Specified destination directory cannot be created: C:\.m2\repository\com\sun\xml\bind\jaxb-impl\2.1.13 -> [Help 1]
[ERROR] Failed to execute goal on project maven-clean-plugin: Could not resolve dependencies for project org.apache.maven.plugins:maven-clean-plugin:maven-plugin:3.0.1-SNAPSHOT: Failure to transfer org.apache.maven.shared:maven-shared-utils:jar:3.0.0 from http://repo.maven.apache.org/maven2 was cached in the local repository, resolution will not be reattempted until the update interval of central has elapsed or updates are forced. Original error: Could not transfer artifact org.apache.maven.shared:maven-shared-utils:jar:3.0.0 from/to central (http://repo.maven.apache.org/maven2): GET request of: org/apache/maven/shared/maven-shared-utils/3.0.0/maven-shared-utils-3.0.0.jar from central failed -> [Help 1]
[ERROR] Failed to execute goal on project maven-compiler-plugin: Could not resolve dependencies for project org.apache.maven.plugins:maven-compiler-plugin:maven-plugin:3.5-SNAPSHOT: Failure to transfer org.apache.maven.shared:maven-shared-utils:jar:3.0.0 from http://repo.maven.apache.org/maven2 was cached in the local repository, resolution will not be reattempted until the update interval of central has elapsed or updates are forced. Original error: Could not transfer artifact org.apache.maven.shared:maven-shared-utils:jar:3.0.0 from/to central (http://repo.maven.apache.org/maven2): GET request of: org/apache/maven/shared/maven-shared-utils/3.0.0/maven-shared-utils-3.0.0.jar from central failed -> [Help 1]
[ERROR] Failed to execute goal on project maven-deploy-plugin: Could not resolve dependencies for project org.apache.maven.plugins:maven-deploy-plugin:maven-plugin:3.0-SNAPSHOT: Failed to collect dependencies for [org.apache.maven:maven-plugin-api:jar:3.0 (compile), org.apache.maven:maven-core:jar:3.0 (compile), org.apache.maven:maven-model:jar:3.0 (compile), org.apache.maven:maven-artifact:jar:3.0 (compile), org.apache.maven.shared:maven-artifact-transfer:jar:3.0-SNAPSHOT (compile), org.apache.maven.plugin-tools:maven-plugin-annotations:jar:3.4 (provided), org.codehaus.plexus:plexus-utils:jar:3.0.20 (compile), org.apache.maven.plugin-testing:maven-plugin-testing-harness:jar:2.1 (test), org.apache.maven:maven-compat:jar:3.0 (test), org.mockito:mockito-core:jar:1.9.5 (test), junit:junit:jar:4.11 (test), org.sonatype.aether:aether-connector-file:jar:1.7 (test)]: Failed to read artifact descriptor for org.sonatype.aether:aether-connector-file:jar:1.7: Could not transfer artifact org.sonatype.aether:aether-connector-file:pom:1.7 from/to central (http://repo.maven.apache.org/maven2): GET request of: org/sonatype/aether/aether-connector-file/1.7/aether-connector-file-1.7.pom from central failed: There is not enough space on the disk -> [Help 1]
[ERROR] Failed to execute goal org.apache.maven.plugins:maven-install-plugin:2.5.2:install (default-install) on project maven-docck-plugin: Failed to install artifact org.apache.maven.plugins:maven-docck-plugin:jar:1.2-SNAPSHOT: There is not enough space on the disk -> [Help 2]
[ERROR] Failed to execute goal on project maven-ear-plugin: Could not resolve dependencies for project org.apache.maven.plugins:maven-ear-plugin:maven-plugin:2.10.2-SNAPSHOT: The following artifacts could not be resolved: org.apache.maven.shared:maven-shared-utils:jar:3.0.0, org.apache.maven.shared:maven-filtering:jar:3.0.0: Failure to transfer org.apache.maven.shared:maven-shared-utils:jar:3.0.0 from http://repo.maven.apache.org/maven2 was cached in the local repository, resolution will not be reattempted until the update interval of central has elapsed or updates are forced. Original error: Could not transfer artifact org.apache.maven.shared:maven-shared-utils:jar:3.0.0 from/to central (http://repo.maven.apache.org/maven2): GET request of: org/apache/maven/shared/maven-shared-utils/3.0.0/maven-shared-utils-3.0.0.jar from central failed -> [Help 1]
[ERROR] Failed to execute goal on project maven-ejb-plugin: Could not resolve dependencies for project org.apache.maven.plugins:maven-ejb-plugin:maven-plugin:2.5.2-SNAPSHOT: Failed to collect dependencies for [org.apache.maven:maven-plugin-api:jar:3.0 (compile), org.apache.maven:maven-core:jar:3.0 (compile), org.apache.maven:maven-artifact:jar:3.0 (compile), org.apache.maven:maven-archiver:jar:3.0.0 (compile), org.apache.maven.plugin-tools:maven-plugin-annotations:jar:3.4 (provided), org.apache.maven.shared:maven-filtering:jar:3.0.0 (compile), org.codehaus.plexus:plexus-utils:jar:3.0.20 (compile), org.codehaus.plexus:plexus-archiver:jar:3.0.1 (compile), org.codehaus.plexus:plexus-interpolation:jar:1.21 (compile), commons-io:commons-io:jar:2.4 (compile), junit:junit:jar:4.11 (test), org.assertj:assertj-core:jar:1.7.1 (test), org.apache.maven:maven-compat:jar:3.0 (test), org.apache.maven.plugin-testing:maven-plugin-testing-harness:jar:2.1 (test)]: Failed to read artifact descriptor for org.assertj:assertj-core:jar:1.7.1: Could not transfer artifact org.assertj:assertj-core:pom:1.7.1 from/to central (http://repo.maven.apache.org/maven2): GET request of: org/assertj/assertj-core/1.7.1/assertj-core-1.7.1.pom from central failed: There is not enough space on the disk -> [Help 1]
[ERROR] Failed to execute goal on project maven-help-plugin: Could not resolve dependencies for project org.apache.maven.plugins:maven-help-plugin:maven-plugin:2.2.1-SNAPSHOT: Failed to collect dependencies for [org.apache.maven:maven-artifact:jar:2.2.1 (compile), org.apache.maven:maven-core:jar:2.2.1 (compile), org.apache.maven:maven-model:jar:2.2.1 (compile), org.apache.maven:maven-plugin-api:jar:2.2.1 (compile), org.apache.maven:maven-plugin-descriptor:jar:2.2.1 (compile), org.apache.maven:maven-project:jar:2.2.1 (compile), org.apache.maven:maven-settings:jar:2.2.1 (compile), org.apache.maven:maven-profile:jar:2.2.1 (compile), org.apache.maven:maven-plugin-parameter-documenter:jar:2.2.1 (compile), org.apache.maven.plugin-tools:maven-plugin-tools-api:jar:2.4.3 (compile), org.apache.maven.plugin-tools:maven-plugin-annotations:jar:3.4 (provided), org.codehaus.plexus:plexus-component-annotations:jar:1.5.5 (provided), org.codehaus.plexus:plexus-interactivity-api:jar:1.0-alpha-4 (compile), org.codehaus.plexus:plexus-utils:jar:3.0.20 (compile), jdom:jdom:jar:1.0 (compile), com.thoughtworks.xstream:xstream:jar:1.4.3 (compile), org.apache.commons:commons-lang3:jar:3.4 (compile), junit:junit:jar:3.8.2 (test), org.apache.maven.plugin-testing:maven-plugin-testing-harness:jar:1.3 (test), junit-addons:junit-addons:jar:1.4 (test)]: Failed to read artifact descriptor for org.apache.commons:commons-lang3:jar:3.4: Could not transfer artifact org.apache.commons:commons-lang3:pom:3.4 from/to central (http://repo.maven.apache.org/maven2): Specified destination directory cannot be created: C:\.m2\repository\org\apache\commons\commons-lang3\3.4 -> [Help 1]
[ERROR] Failed to execute goal on project maven-install-plugin: Could not resolve dependencies for project org.apache.maven.plugins:maven-install-plugin:maven-plugin:3.0-SNAPSHOT: Failure to transfer org.apache.maven.shared:maven-shared-utils:jar:3.0.0 from http://repo.maven.apache.org/maven2 was cached in the local repository, resolution will not be reattempted until the update interval of central has elapsed or updates are forced. Original error: Could not transfer artifact org.apache.maven.shared:maven-shared-utils:jar:3.0.0 from/to central (http://repo.maven.apache.org/maven2): GET request of: org/apache/maven/shared/maven-shared-utils/3.0.0/maven-shared-utils-3.0.0.jar from central failed -> [Help 1]
[ERROR] Failed to execute goal on project maven-jarsigner-plugin: Could not resolve dependencies for project org.apache.maven.plugins:maven-jarsigner-plugin:maven-plugin:1.5-SNAPSHOT: Failure to transfer org.apache.maven.shared:maven-shared-utils:jar:3.0.0 from http://repo.maven.apache.org/maven2 was cached in the local repository, resolution will not be reattempted until the update interval of central has elapsed or updates are forced. Original error: Could not transfer artifact org.apache.maven.shared:maven-shared-utils:jar:3.0.0 from/to central (http://repo.maven.apache.org/maven2): GET request of: org/apache/maven/shared/maven-shared-utils/3.0.0/maven-shared-utils-3.0.0.jar from central failed -> [Help 1]
[ERROR] Failed to execute goal org.apache.maven.plugins:maven-surefire-plugin:2.18.1:test (default-test) on project maven-javadoc-plugin: There are test failures.
[ERROR] 
[ERROR] Please refer to F:\jenkins\jenkins-slave\workspace\maven-plugins-ITs-m3-windows\maven-javadoc-plugin\target\surefire-reports for the individual test results.
[ERROR] -> [Help 3]
[ERROR] Failed to execute goal org.apache.maven.plugins:maven-invoker-plugin:2.0.0:install (integration-test) on project maven-linkcheck-plugin: Failed to install project dependencies: MavenProject: org.apache.maven.plugins:maven-linkcheck-plugin:1.3-SNAPSHOT @ F:\jenkins\jenkins-slave\workspace\maven-plugins-ITs-m3-windows\maven-linkcheck-plugin\pom.xml: Failed to install project artifacts: MavenProject: org.apache.maven.plugins:maven-javadoc-plugin:2.10.4-SNAPSHOT @ F:\jenkins\jenkins-slave\workspace\maven-plugins-ITs-m3-windows\maven-javadoc-plugin\pom.xml: Failed to install artifact: org.apache.maven.plugins:maven-javadoc-plugin:maven-plugin:2.10.4-SNAPSHOT: Artifact is not fully assembled: F:\jenkins\jenkins-slave\workspace\maven-plugins-ITs-m3-windows\maven-javadoc-plugin\target\classes -> [Help 2]
[ERROR] Failed to execute goal org.apache.maven.plugins:maven-invoker-plugin:2.0.0:install (integration-test) on project maven-patch-plugin: Failed to install project dependencies: MavenProject: org.apache.maven.plugins:maven-patch-plugin:1.3-SNAPSHOT @ F:\jenkins\jenkins-slave\workspace\maven-plugins-ITs-m3-windows\maven-patch-plugin\pom.xml: Failed to install project artifacts: MavenProject: org.apache.maven.plugins:maven-javadoc-plugin:2.10.4-SNAPSHOT @ F:\jenkins\jenkins-slave\workspace\maven-plugins-ITs-m3-windows\maven-javadoc-plugin\pom.xml: Failed to install artifact: org.apache.maven.plugins:maven-javadoc-plugin:maven-plugin:2.10.4-SNAPSHOT: Artifact is not fully assembled: F:\jenkins\jenkins-slave\workspace\maven-plugins-ITs-m3-windows\maven-javadoc-plugin\target\classes -> [Help 2]
[ERROR] Failed to execute goal org.apache.maven.plugins:maven-invoker-plugin:2.0.0:install (integration-test) on project maven-pdf-plugin: Failed to install project dependencies: MavenProject: org.apache.maven.plugins:maven-pdf-plugin:1.4-SNAPSHOT @ F:\jenkins\jenkins-slave\workspace\maven-plugins-ITs-m3-windows\maven-pdf-plugin\pom.xml: Failed to install project artifacts: MavenProject: org.apache.maven.plugins:maven-javadoc-plugin:2.10.4-SNAPSHOT @ F:\jenkins\jenkins-slave\workspace\maven-plugins-ITs-m3-windows\maven-javadoc-plugin\pom.xml: Failed to install artifact: org.apache.maven.plugins:maven-javadoc-plugin:maven-plugin:2.10.4-SNAPSHOT: Artifact is not fully assembled: F:\jenkins\jenkins-slave\workspace\maven-plugins-ITs-m3-windows\maven-javadoc-plugin\target\classes -> [Help 2]
[ERROR] Failed to execute goal on project maven-rar-plugin: Could not resolve dependencies for project org.apache.maven.plugins:maven-rar-plugin:maven-plugin:2.5-SNAPSHOT: The following artifacts could not be resolved: org.apache.maven.shared:maven-filtering:jar:3.0.0, org.apache.maven.shared:maven-shared-utils:jar:3.0.0: Failure to transfer org.apache.maven.shared:maven-filtering:jar:3.0.0 from http://repo.maven.apache.org/maven2 was cached in the local repository, resolution will not be reattempted until the update interval of central has elapsed or updates are forced. Original error: Could not transfer artifact org.apache.maven.shared:maven-filtering:jar:3.0.0 from/to central (http://repo.maven.apache.org/maven2): GET request of: org/apache/maven/shared/maven-filtering/3.0.0/maven-filtering-3.0.0.jar from central failed -> [Help 1]
[ERROR] Failed to execute goal org.apache.maven.plugins:maven-invoker-plugin:2.0.0:install (integration-test) on project maven-repository-plugin: Failed to install project dependencies: MavenProject: org.apache.maven.plugins:maven-repository-plugin:2.5-SNAPSHOT @ F:\jenkins\jenkins-slave\workspace\maven-plugins-ITs-m3-windows\maven-repository-plugin\pom.xml: Failed to install project artifacts: MavenProject: org.apache.maven.plugins:maven-javadoc-plugin:2.10.4-SNAPSHOT @ F:\jenkins\jenkins-slave\workspace\maven-plugins-ITs-m3-windows\maven-javadoc-plugin\pom.xml: Failed to install artifact: org.apache.maven.plugins:maven-javadoc-plugin:maven-plugin:2.10.4-SNAPSHOT: Artifact is not fully assembled: F:\jenkins\jenkins-slave\workspace\maven-plugins-ITs-m3-windows\maven-javadoc-plugin\target\classes -> [Help 2]
[ERROR] Failed to execute goal on project maven-resources-plugin: Could not resolve dependencies for project org.apache.maven.plugins:maven-resources-plugin:maven-plugin:2.8-SNAPSHOT: The following artifacts could not be resolved: org.apache.maven.shared:maven-filtering:jar:3.0.0, org.apache.maven.shared:maven-shared-utils:jar:3.0.0: Failure to transfer org.apache.maven.shared:maven-filtering:jar:3.0.0 from http://repo.maven.apache.org/maven2 was cached in the local repository, resolution will not be reattempted until the update interval of central has elapsed or updates are forced. Original error: Could not transfer artifact org.apache.maven.shared:maven-filtering:jar:3.0.0 from/to central (http://repo.maven.apache.org/maven2): GET request of: org/apache/maven/shared/maven-filtering/3.0.0/maven-filtering-3.0.0.jar from central failed -> [Help 1]
[ERROR] Failed to execute goal on project maven-site-plugin: Could not resolve dependencies for project org.apache.maven.plugins:maven-site-plugin:maven-plugin:3.5-SNAPSHOT: The following artifacts could not be resolved: org.apache.maven.doxia:doxia-sink-api:jar:1.7-SNAPSHOT, org.apache.maven.doxia:doxia-core:jar:1.7-SNAPSHOT: Could not transfer artifact org.apache.maven.doxia:doxia-sink-api:jar:1.7-20151221.225931-50 from/to apache.snapshots (http://repository.apache.org/snapshots): GET request of: org/apache/maven/doxia/doxia-sink-api/1.7-SNAPSHOT/doxia-sink-api-1.7-20151221.225931-50.jar from apache.snapshots failed: There is not enough space on the disk -> [Help 1]
[ERROR] Failed to execute goal on project maven-source-plugin: Could not resolve dependencies for project org.apache.maven.plugins:maven-source-plugin:maven-plugin:3.0.0-SNAPSHOT: Failure to transfer org.apache.maven.shared:maven-shared-utils:jar:3.0.0 from http://repo.maven.apache.org/maven2 was cached in the local repository, resolution will not be reattempted until the update interval of central has elapsed or updates are forced. Original error: Could not transfer artifact org.apache.maven.shared:maven-shared-utils:jar:3.0.0 from/to central (http://repo.maven.apache.org/maven2): GET request of: org/apache/maven/shared/maven-shared-utils/3.0.0/maven-shared-utils-3.0.0.jar from central failed -> [Help 1]
[ERROR] Failed to execute goal org.apache.maven.plugins:maven-invoker-plugin:2.0.0:install (integration-test) on project maven-stage-plugin: Failed to install project dependencies: MavenProject: org.apache.maven.plugins:maven-stage-plugin:1.1-SNAPSHOT @ F:\jenkins\jenkins-slave\workspace\maven-plugins-ITs-m3-windows\maven-stage-plugin\pom.xml: Failed to install project artifacts: MavenProject: org.apache.maven.plugins:maven-javadoc-plugin:2.10.4-SNAPSHOT @ F:\jenkins\jenkins-slave\workspace\maven-plugins-ITs-m3-windows\maven-javadoc-plugin\pom.xml: Failed to install artifact: org.apache.maven.plugins:maven-javadoc-plugin:maven-plugin:2.10.4-SNAPSHOT: Artifact is not fully assembled: F:\jenkins\jenkins-slave\workspace\maven-plugins-ITs-m3-windows\maven-javadoc-plugin\target\classes -> [Help 2]
[ERROR] Failed to execute goal org.apache.maven.plugins:maven-invoker-plugin:2.0.0:install (integration-test) on project maven-toolchains-plugin: Failed to install project dependencies: MavenProject: org.apache.maven.plugins:maven-toolchains-plugin:1.2-SNAPSHOT @ F:\jenkins\jenkins-slave\workspace\maven-plugins-ITs-m3-windows\maven-toolchains-plugin\pom.xml: Failed to install project artifacts: MavenProject: org.apache.maven.plugins:maven-javadoc-plugin:2.10.4-SNAPSHOT @ F:\jenkins\jenkins-slave\workspace\maven-plugins-ITs-m3-windows\maven-javadoc-plugin\pom.xml: Failed to install artifact: org.apache.maven.plugins:maven-javadoc-plugin:maven-plugin:2.10.4-SNAPSHOT: Artifact is not fully assembled: F:\jenkins\jenkins-slave\workspace\maven-plugins-ITs-m3-windows\maven-javadoc-plugin\target\classes -> [Help 2]
[ERROR] Failed to execute goal org.apache.maven.plugins:maven-invoker-plugin:2.0.0:install (integration-test) on project maven-verifier-plugin: Failed to install project dependencies: MavenProject: org.apache.maven.plugins:maven-verifier-plugin:3.0.0-SNAPSHOT @ F:\jenkins\jenkins-slave\workspace\maven-plugins-ITs-m3-windows\maven-verifier-plugin\pom.xml: Failed to install project artifacts: MavenProject: org.apache.maven.plugins:maven-javadoc-plugin:2.10.4-SNAPSHOT @ F:\jenkins\jenkins-slave\workspace\maven-plugins-ITs-m3-windows\maven-javadoc-plugin\pom.xml: Failed to install artifact: org.apache.maven.plugins:maven-javadoc-plugin:maven-plugin:2.10.4-SNAPSHOT: Artifact is not fully assembled: F:\jenkins\jenkins-slave\workspace\maven-plugins-ITs-m3-windows\maven-javadoc-plugin\target\classes -> [Help 2]
[ERROR] Failed to execute goal org.apache.maven.plugins:maven-invoker-plugin:1.10:install (integration-test) on project maven-war-plugin: Failed to install project dependencies: MavenProject: org.apache.maven.plugins:maven-war-plugin:2.7-SNAPSHOT @ F:\jenkins\jenkins-slave\workspace\maven-plugins-ITs-m3-windows\maven-war-plugin\pom.xml: Failed to install project artifacts: MavenProject: org.apache.maven.plugins:maven-javadoc-plugin:2.10.4-SNAPSHOT @ F:\jenkins\jenkins-slave\workspace\maven-plugins-ITs-m3-windows\maven-javadoc-plugin\pom.xml: Failed to install artifact: org.apache.maven.plugins:maven-javadoc-plugin:maven-plugin:2.10.4-SNAPSHOT: Artifact is not fully assembled: F:\jenkins\jenkins-slave\workspace\maven-plugins-ITs-m3-windows\maven-javadoc-plugin\target\classes -> [Help 2]
[ERROR] Failed to execute goal org.apache.maven.plugins:maven-invoker-plugin:2.0.0:install (integration-test) on project maven-doap-plugin: Failed to install project dependencies: MavenProject: org.apache.maven.plugins:maven-doap-plugin:1.3-SNAPSHOT @ F:\jenkins\jenkins-slave\workspace\maven-plugins-ITs-m3-windows\maven-doap-plugin\pom.xml: Failed to install project artifacts: MavenProject: org.apache.maven.plugins:maven-javadoc-plugin:2.10.4-SNAPSHOT @ F:\jenkins\jenkins-slave\workspace\maven-plugins-ITs-m3-windows\maven-javadoc-plugin\pom.xml: Failed to install artifact: org.apache.maven.plugins:maven-javadoc-plugin:maven-plugin:2.10.4-SNAPSHOT: Artifact is not fully assembled: F:\jenkins\jenkins-slave\workspace\maven-plugins-ITs-m3-windows\maven-javadoc-plugin\target\classes -> [Help 2]
[ERROR] Plugin org.codehaus.mojo:animal-sniffer-maven-plugin:1.12 or one of its dependencies could not be resolved: Failed to read artifact descriptor for org.codehaus.mojo:animal-sniffer-maven-plugin:jar:1.12: Could not transfer artifact org.codehaus.mojo:animal-sniffer-maven-plugin:pom:1.12 from/to central (http://repo.maven.apache.org/maven2): GET request of: org/codehaus/mojo/animal-sniffer-maven-plugin/1.12/animal-sniffer-maven-plugin-1.12.pom from central failed: There is not enough space on the disk -> [Help 4]
[ERROR] Failed to execute goal org.apache.maven.plugins:maven-invoker-plugin:1.9:install (integration-test) on project maven-invoker-plugin: Failed to install project dependencies: MavenProject: org.apache.maven.plugins:maven-invoker-plugin:2.0.1-SNAPSHOT @ F:\jenkins\jenkins-slave\workspace\maven-plugins-ITs-m3-windows\maven-invoker-plugin\pom.xml: Failed to install project artifacts: MavenProject: org.apache.maven.plugins:maven-javadoc-plugin:2.10.4-SNAPSHOT @ F:\jenkins\jenkins-slave\workspace\maven-plugins-ITs-m3-windows\maven-javadoc-plugin\pom.xml: Failed to install artifact: org.apache.maven.plugins:maven-javadoc-plugin:maven-plugin:2.10.4-SNAPSHOT: Artifact is not fully assembled: F:\jenkins\jenkins-slave\workspace\maven-plugins-ITs-m3-windows\maven-javadoc-plugin\target\classes -> [Help 2]
[ERROR] Failed to execute goal on project maven-jar-plugin: Could not resolve dependencies for project org.apache.maven.plugins:maven-jar-plugin:maven-plugin:3.0.0-SNAPSHOT: Failure to transfer org.apache.maven.shared:maven-shared-utils:jar:3.0.0 from http://repo.maven.apache.org/maven2 was cached in the local repository, resolution will not be reattempted until the update interval of central has elapsed or updates are forced. Original error: Could not transfer artifact org.apache.maven.shared:maven-shared-utils:jar:3.0.0 from/to central (http://repo.maven.apache.org/maven2): GET request of: org/apache/maven/shared/maven-shared-utils/3.0.0/maven-shared-utils-3.0.0.jar from central failed -> [Help 1]
[ERROR] Failed to execute goal on project maven-project-info-reports-plugin: Could not resolve dependencies for project org.apache.maven.plugins:maven-project-info-reports-plugin:maven-plugin:2.8.2-SNAPSHOT: Could not find artifact org.apache.maven.shared:maven-shared-jar:jar:1.2-SNAPSHOT in apache.snapshots (http://repository.apache.org/snapshots) -> [Help 1]
[ERROR] Failed to execute goal org.apache.maven.plugins:maven-invoker-plugin:2.0.0:install (integration-test) on project maven-remote-resources-plugin: Failed to install project dependencies: MavenProject: org.apache.maven.plugins:maven-remote-resources-plugin:1.6-SNAPSHOT @ F:\jenkins\jenkins-slave\workspace\maven-plugins-ITs-m3-windows\maven-remote-resources-plugin\pom.xml: Failed to install project artifacts: MavenProject: org.apache.maven.plugins:maven-javadoc-plugin:2.10.4-SNAPSHOT @ F:\jenkins\jenkins-slave\workspace\maven-plugins-ITs-m3-windows\maven-javadoc-plugin\pom.xml: Failed to install artifact: org.apache.maven.plugins:maven-javadoc-plugin:maven-plugin:2.10.4-SNAPSHOT: Artifact is not fully assembled: F:\jenkins\jenkins-slave\workspace\maven-plugins-ITs-m3-windows\maven-javadoc-plugin\target\classes -> [Help 2]
[ERROR] Failed to execute goal on project maven-shade-plugin: Could not resolve dependencies for project org.apache.maven.plugins:maven-shade-plugin:maven-plugin:2.4.3-SNAPSHOT: Failed to collect dependencies for [org.apache.maven:maven-plugin-api:jar:3.0 (compile), org.apache.maven:maven-model:jar:3.0 (compile), org.apache.maven:maven-core:jar:3.0 (compile), org.apache.maven:maven-compat:jar:3.0 (compile), org.apache.maven:maven-artifact:jar:3.0 (compile), org.apache.maven.plugin-tools:maven-plugin-annotations:jar:3.4 (provided), org.codehaus.plexus:plexus-utils:jar:3.0.22 (compile), org.ow2.asm:asm:jar:5.0.2 (compile), org.ow2.asm:asm-commons:jar:5.0.2 (compile), org.jdom:jdom:jar:1.1 (compile), org.apache.maven.shared:maven-dependency-tree:jar:2.2 (compile), commons-io:commons-io:jar:2.2 (compile), org.vafer:jdependency:jar:1.1 (compile), org.codehaus.plexus:plexus-component-annotations:jar:1.5.5 (provided), junit:junit:jar:4.10 (test), xmlunit:xmlunit:jar:1.3 (test), com.google.guava:guava:jar:11.0.2 (compile), org.mockito:mockito-all:jar:1.9.5 (test)]: Failed to read artifact descriptor for org.vafer:jdependency:jar:1.1: Could not transfer artifact org.vafer:jdependency:pom:1.1 from/to central (http://repo.maven.apache.org/maven2): GET request of: org/vafer/jdependency/1.1/jdependency-1.1.pom from central failed: There is not enough space on the disk -> [Help 1]
[ERROR] Failed to execute goal org.apache.maven.plugins:maven-invoker-plugin:2.0.0:install (integration-test) on project maven-scm-publish-plugin: Failed to install project dependencies: MavenProject: org.apache.maven.plugins:maven-scm-publish-plugin:1.2-SNAPSHOT @ F:\jenkins\jenkins-slave\workspace\maven-plugins-ITs-m3-windows\maven-scm-publish-plugin\pom.xml: Failed to install project artifacts: MavenProject: org.apache.maven.plugins:maven-javadoc-plugin:2.10.4-SNAPSHOT @ F:\jenkins\jenkins-slave\workspace\maven-plugins-ITs-m3-windows\maven-javadoc-plugin\pom.xml: Failed to install artifact: org.apache.maven.plugins:maven-javadoc-plugin:maven-plugin:2.10.4-SNAPSHOT: Artifact is not fully assembled: F:\jenkins\jenkins-slave\workspace\maven-plugins-ITs-m3-windows\maven-javadoc-plugin\target\classes -> [Help 2]
[ERROR] 
[ERROR] To see the full stack trace of the errors, re-run Maven with the -e switch.
[ERROR] Re-run Maven using the -X switch to enable full debug logging.
[ERROR] 
[ERROR] For more information about the errors and possible solutions, please read the following articles:
[ERROR] [Help 1] http://cwiki.apache.org/confluence/display/MAVEN/DependencyResolutionException
[ERROR] [Help 2] http://cwiki.apache.org/confluence/display/MAVEN/MojoExecutionException
[ERROR] [Help 3] http://cwiki.apache.org/confluence/display/MAVEN/MojoFailureException
[ERROR] [Help 4] http://cwiki.apache.org/confluence/display/MAVEN/PluginResolutionException
Build step 'Invoke top-level Maven targets' marked build as failure
Deleting 1 temporary files
Recording test results
ERROR: Unable to send to address: dantran@QBServer.(none)
javax.mail.internet.AddressException: Domain ends with dot in string ``dantran@QBServer.''
	at javax.mail.internet.InternetAddress.checkAddress(InternetAddress.java:1277)
	at javax.mail.internet.InternetAddress.parse(InternetAddress.java:1091)
	at javax.mail.internet.InternetAddress.parse(InternetAddress.java:633)
	at javax.mail.internet.InternetAddress.<init>(InternetAddress.java:111)
	at hudson.tasks.Mailer.StringToAddress(Mailer.java:180)
	at jenkins.plugins.mailer.tasks.MimeMessageBuilder.toNormalizedAddress(MimeMessageBuilder.java:262)
	at jenkins.plugins.mailer.tasks.MimeMessageBuilder.addRecipients(MimeMessageBuilder.java:141)
	at jenkins.plugins.mailer.tasks.MimeMessageBuilder.addRecipients(MimeMessageBuilder.java:133)
	at hudson.tasks.MailSender.createEmptyMail(MailSender.java:380)
	at hudson.tasks.MailSender.createFailureMail(MailSender.java:260)
	at hudson.tasks.MailSender.createMail(MailSender.java:178)
	at hudson.tasks.MailSender.run(MailSender.java:107)
	at hudson.tasks.Mailer.perform(Mailer.java:141)
	at hudson.tasks.BuildStepCompatibilityLayer.perform(BuildStepCompatibilityLayer.java:74)
	at hudson.tasks.BuildStepMonitor$1.perform(BuildStepMonitor.java:20)
	at hudson.model.AbstractBuild$AbstractBuildExecution.perform(AbstractBuild.java:776)
	at hudson.model.AbstractBuild$AbstractBuildExecution.performAllBuildSteps(AbstractBuild.java:723)
	at hudson.model.Build$BuildExecution.post2(Build.java:183)
	at hudson.model.AbstractBuild$AbstractBuildExecution.post(AbstractBuild.java:670)
	at hudson.model.Run.execute(Run.java:1763)
	at hudson.model.FreeStyleBuild.run(FreeStyleBuild.java:43)
	at hudson.model.ResourceController.execute(ResourceController.java:98)
	at hudson.model.Executor.run(Executor.java:381)

Mime
View raw message