maven-notifications mailing list archives

Site index · List index
Message view « Date » · « Thread »
Top « Date » · « Thread »
From Apache Jenkins Server <jenk...@builds.apache.org>
Subject Build failed in Jenkins: core-it-maven-3-win #1093
Date Wed, 27 Jan 2016 06:24:04 GMT
See <https://builds.apache.org/job/core-it-maven-3-win/1093/changes>

Changes:

[schulte] [MNG-5607] Don't use M2_HOME anymore in mvn shell/batch file anymore

[schulte] [MNG-5607] Don't use M2_HOME anymore in mvn shell/batch file anymore

------------------------------------------
[...truncated 10385 lines...]
0135EjbLifecycle(it0135)....................................OK (3.4 s)
0134WarLifecycle(it0134)....................................OK (3.5 s)
0133JarLifecycle(it0133)....................................OK (3.4 s)
0132PomLifecycle(it0132)....................................OK (2.9 s)
0131SiteLifecycle(it0131)...................................OK (2.7 s)
0130CleanLifecycle(it0130)..................................OK (2.7 s)
0113ServerAuthzAvailableToWagonMgrInPlugin(it0113)..........OK (3.1 s)
0090EnvVarInterpolation(it0090).............................OK (2.7 s)
0087PluginRealmWithProjectLevelDeps(it0087).................OK (3.0 s)
0086PluginRealm(it0086).....................................OK (3.8 s)
0085TransitiveSystemScope(it0085)...........................OK (3.1 s)
0072InterpolationWithDottedProperty(it0072).................OK (2.6 s)
0071PluginConfigWithDottedProperty(it0071)..................OK (2.8 s)
0064MojoConfigViaSetters(it0064)............................OK (2.8 s)
0063SystemScopeDependency(it0063)...........................OK (3.4 s)
0056MultipleGoalExecutions(it0056)..........................OK (2.6 s)
0052ReleaseProfile(it0052)..................................OK (3.0 s)
0051ReleaseProfile(it0051)..................................FAILURE (2.4 s)
0041ArtifactTypeFromPluginExtension(it0041).................OK (5.1 s)
0040PackagingFromPluginExtension(it0040)....................OK (2.6 s)
0039ReleasePomInReactor(it0039).............................SKIPPED - Maven version 3.4.0-SNAPSHOT
not in range [2.0,3.0-alpha-1)
0038AlternatePomFileDifferentDir(it0038)....................OK (2.9 s)
0037AlternatePomFileSameDir(it0037).........................OK (2.8 s)
0036ReleasePom(it0036)......................................SKIPPED - Maven version 3.4.0-SNAPSHOT
not in range (2.0,3.0-alpha-1)
0032MavenPrerequisite(it0032)...............................OK (2.3 s)
0030DepPomDepMngtInheritance(it0030)........................OK (7.7 s)
0025MultipleExecutionLevelConfigs(it0025)...................OK (3.2 s)
0024MultipleGoalExecutions(it0024)..........................OK (2.6 s)
0023SettingsProfile(it0023).................................OK (2.7 s)
0021PomProfile(it0021)......................................OK (3.0 s)
0019PluginVersionMngtBySuperPom(it0019).....................OK (4.1 s)
0018DependencyManagement(it0018)............................OK (3.2 s)
0012PomInterpolation(it0012)................................OK (2.7 s)
0011DefaultVersionByDependencyManagement(it0011)............OK (2.9 s)
0010DependencyClosureResolution(it0010).....................OK (3.1 s)
0009GoalConfiguration(it0009)...............................OK (2.8 s)
0008SimplePlugin(it0008)....................................OK (3.0 s)
Tests run: 772, Failures: 1, Errors: 1, Skipped: 0, Time elapsed: 2,957.677 sec <<<
FAILURE! - in org.apache.maven.it.IntegrationTestSuite
testitModel(org.apache.maven.it.MavenITmng4600DependencyOptionalFlagManagementTest)  Time
elapsed: 2.598 sec  <<< FAILURE!
junit.framework.ComparisonFailure: null expected:<[fals]e> but was:<[tru]e>
	at junit.framework.Assert.assertEquals(Assert.java:81)
	at junit.framework.Assert.assertEquals(Assert.java:87)
	at org.apache.maven.it.MavenITmng4600DependencyOptionalFlagManagementTest.testitModel(MavenITmng4600DependencyOptionalFlagManagementTest.java:61)

testit0051(org.apache.maven.it.MavenIT0051ReleaseProfileTest)  Time elapsed: 2.375 sec  <<<
ERROR!
org.apache.maven.it.VerificationException: Exit code was non-zero: 1; command line and log
= 
<https://builds.apache.org/job/core-it-maven-3-win/ws/apache-maven-3-SNAPSHOT\bin\mvn>
--global-settings F:\ws\m3-its\core-integration-testing-trunk\core-it-suite\target\test-classes\settings.xml
-DperformRelease=true -e --batch-mode -Dmaven.repo.local=<https://builds.apache.org/job/core-it-maven-3-win/ws/it-local-repo>
package
[INFO] Error stacktraces are turned on.
[INFO] Scanning for projects...
[WARNING] 
[WARNING] Some problems were encountered while building the effective model for org.apache.maven.its.it0051:maven-it-it0051:jar:1.0
[WARNING] 'build.plugins.plugin.version' for org.apache.maven.plugins:maven-deploy-plugin
is missing.
[WARNING] 
[WARNING] It is highly recommended to fix these problems because they threaten the stability
of your build.
[WARNING] 
[WARNING] For this reason, future Maven versions might no longer support building such malformed
projects.
[WARNING] 
[INFO]                                                                         
[INFO] ------------------------------------------------------------------------
[INFO] Building Maven Integration Test :: it0051 1.0
[INFO] ------------------------------------------------------------------------
[INFO] ------------------------------------------------------------------------
[INFO] BUILD FAILURE
[INFO] ------------------------------------------------------------------------
[INFO] Total time: 0.218 s
[INFO] Finished at: 2016-01-26T22:22:10-08:00
[INFO] Final Memory: 20M/742M
[INFO] ------------------------------------------------------------------------
[ERROR] Could not find goal 'jar-no-fork' in plugin org.apache.maven.plugins:maven-source-plugin:0.1-stub-SNAPSHOT
among available goals jar -> [Help 1]
org.apache.maven.plugin.MojoNotFoundException: Could not find goal 'jar-no-fork' in plugin
org.apache.maven.plugins:maven-source-plugin:0.1-stub-SNAPSHOT among available goals jar
	at org.apache.maven.plugin.internal.DefaultMavenPluginManager.getMojoDescriptor(DefaultMavenPluginManager.java:290)
	at org.apache.maven.plugin.DefaultBuildPluginManager.getMojoDescriptor(DefaultBuildPluginManager.java:241)
	at org.apache.maven.lifecycle.internal.DefaultLifecycleMappingDelegate.calculateLifecycleMappings(DefaultLifecycleMappingDelegate.java:110)
	at org.apache.maven.lifecycle.internal.DefaultLifecycleExecutionPlanCalculator.calculateLifecycleMappings(DefaultLifecycleExecutionPlanCalculator.java:266)
	at org.apache.maven.lifecycle.internal.DefaultLifecycleExecutionPlanCalculator.calculateMojoExecutions(DefaultLifecycleExecutionPlanCalculator.java:217)
	at org.apache.maven.lifecycle.internal.DefaultLifecycleExecutionPlanCalculator.calculateExecutionPlan(DefaultLifecycleExecutionPlanCalculator.java:127)
	at org.apache.maven.lifecycle.internal.DefaultLifecycleExecutionPlanCalculator.calculateExecutionPlan(DefaultLifecycleExecutionPlanCalculator.java:145)
	at org.apache.maven.lifecycle.internal.builder.BuilderCommon.resolveBuildPlan(BuilderCommon.java:96)
	at org.apache.maven.lifecycle.internal.LifecycleModuleBuilder.buildProject(LifecycleModuleBuilder.java:109)
	at org.apache.maven.lifecycle.internal.LifecycleModuleBuilder.buildProject(LifecycleModuleBuilder.java:80)
	at org.apache.maven.lifecycle.internal.builder.singlethreaded.SingleThreadedBuilder.build(SingleThreadedBuilder.java:51)
	at org.apache.maven.lifecycle.internal.LifecycleStarter.execute(LifecycleStarter.java:128)
	at org.apache.maven.DefaultMaven.doExecute(DefaultMaven.java:307)
	at org.apache.maven.DefaultMaven.doExecute(DefaultMaven.java:193)
	at org.apache.maven.DefaultMaven.execute(DefaultMaven.java:106)
	at org.apache.maven.cli.MavenCli.execute(MavenCli.java:865)
	at org.apache.maven.cli.MavenCli.doMain(MavenCli.java:288)
	at org.apache.maven.cli.MavenCli.main(MavenCli.java:199)
	at sun.reflect.NativeMethodAccessorImpl.invoke0(Native Method)
	at sun.reflect.NativeMethodAccessorImpl.invoke(NativeMethodAccessorImpl.java:57)
	at sun.reflect.DelegatingMethodAccessorImpl.invoke(DelegatingMethodAccessorImpl.java:43)
	at java.lang.reflect.Method.invoke(Method.java:601)
	at org.codehaus.plexus.classworlds.launcher.Launcher.launchEnhanced(Launcher.java:289)
	at org.codehaus.plexus.classworlds.launcher.Launcher.launch(Launcher.java:229)
	at org.codehaus.plexus.classworlds.launcher.Launcher.mainWithExitCode(Launcher.java:415)
	at org.codehaus.plexus.classworlds.launcher.Launcher.main(Launcher.java:356)
[ERROR] 
[ERROR] Re-run Maven using the -X switch to enable full debug logging.
[ERROR] 
[ERROR] For more information about the errors and possible solutions, please read the following
articles:
[ERROR] [Help 1] http://cwiki.apache.org/confluence/display/MAVEN/MojoNotFoundException

	at org.apache.maven.it.Verifier.executeGoals(Verifier.java:1369)
	at org.apache.maven.it.Verifier.executeGoal(Verifier.java:1254)
	at org.apache.maven.it.Verifier.executeGoal(Verifier.java:1248)
	at org.apache.maven.it.MavenIT0051ReleaseProfileTest.testit0051(MavenIT0051ReleaseProfileTest.java:48)


Results :

Failed tests: 
  MavenITmng4600DependencyOptionalFlagManagementTest>AbstractMavenIntegrationTestCase.runTest:219->testitModel:61
null expected:<[fals]e> but was:<[tru]e>
Tests in error: 
  MavenIT0051ReleaseProfileTest>AbstractMavenIntegrationTestCase.runTest:219->testit0051:48
ยป Verification

Tests run: 772, Failures: 1, Errors: 1, Skipped: 0

[INFO] ------------------------------------------------------------------------
[INFO] Reactor Summary:
[INFO] 
[INFO] Maven Core ITs ..................................... SUCCESS [01:49 min]
[INFO] Maven IT Support ................................... SUCCESS [  0.995 s]
[INFO] Maven IT :: Plugins ................................ SUCCESS [  0.691 s]
[INFO] Maven IT Plugin :: Active Collection ............... SUCCESS [ 21.601 s]
[INFO] Maven IT Plugin :: Ant-Based ....................... SUCCESS [ 17.457 s]
[INFO] Maven IT Plugin :: Artifact ........................ SUCCESS [  5.570 s]
[INFO] Maven IT Plugin :: Class Loader :: Dependency A .... SUCCESS [  0.557 s]
[INFO] Maven IT Plugin :: Class Loader :: Dependency B .... SUCCESS [  0.810 s]
[INFO] Maven IT Plugin :: Class Loader :: Dependency C .... SUCCESS [  0.489 s]
[INFO] Maven IT Plugin :: Class Loader .................... SUCCESS [  2.891 s]
[INFO] Maven IT Plugin :: Class Loader :: Aggregator ...... SUCCESS [  0.443 s]
[INFO] Maven IT Plugin :: Configuration ................... SUCCESS [  1.198 s]
[INFO] Maven IT Plugin :: Context Passing ................. SUCCESS [  0.554 s]
[INFO] Maven ITs :: Core Plugin Stubs ..................... SUCCESS [  0.463 s]
[INFO] Maven IT Clean Plugin Stub ......................... SUCCESS [  1.136 s]
[INFO] Maven IT Compiler Plugin Stub ...................... SUCCESS [  1.444 s]
[INFO] Maven IT Deploy Plugin Stub ........................ SUCCESS [  0.868 s]
[INFO] Maven IT EAR Plugin Stub ........................... SUCCESS [  0.739 s]
[INFO] Maven IT EJB Plugin Stub ........................... SUCCESS [  0.772 s]
[INFO] Maven IT Install Plugin Stub ....................... SUCCESS [  0.652 s]
[INFO] Maven IT JAR Plugin Stub ........................... SUCCESS [  0.794 s]
[INFO] Maven IT Javadoc Plugin Stub ....................... SUCCESS [  1.205 s]
[INFO] Maven IT Plugin Plugin Stub ........................ SUCCESS [  0.740 s]
[INFO] Maven IT RAR Plugin Stub ........................... SUCCESS [  0.764 s]
[INFO] Maven IT Resources Plugin Stub ..................... SUCCESS [  0.660 s]
[INFO] Maven IT Site Plugin Stub .......................... SUCCESS [  0.867 s]
[INFO] Maven IT Source Plugin Stub ........................ SUCCESS [  0.778 s]
[INFO] Maven IT Surefire Plugin Stub ...................... SUCCESS [  0.759 s]
[INFO] Maven IT WAR Plugin Stub ........................... SUCCESS [  0.813 s]
[INFO] Maven IT Plugin :: Dependency Collection ........... SUCCESS [  0.711 s]
[INFO] Maven IT Plugin :: Dependency Resolution ........... SUCCESS [ 11.147 s]
[INFO] Maven IT Plugin :: Expression ...................... SUCCESS [  1.213 s]
[INFO] Maven IT Plugin :: Error Mojos ..................... SUCCESS [  2.879 s]
[INFO] Maven IT Component ................................. SUCCESS [  0.450 s]
[INFO] Maven IT Plugin :: Extension Consumer .............. SUCCESS [  0.552 s]
[INFO] Maven IT Plugin :: Extension Provider .............. SUCCESS [  0.529 s]
[INFO] Maven IT Plugin :: Fork ............................ SUCCESS [  0.677 s]
[INFO] Maven IT Plugin :: Invalid Descriptor .............. SUCCESS [  0.528 s]
[INFO] Maven IT Plugin :: Log File ........................ SUCCESS [  0.582 s]
[INFO] Maven IT Helper Library ............................ SUCCESS [  2.611 s]
[INFO] Maven IT Plugin :: Model Interpolation ............. SUCCESS [  1.443 s]
[INFO] Maven IT Plugin :: No Default Component ............ SUCCESS [  0.580 s]
[INFO] Maven IT Plugin :: No Project ...................... SUCCESS [  0.535 s]
[INFO] Maven IT Plugin :: Online .......................... SUCCESS [  0.502 s]
[INFO] Maven IT Plugin :: Optional Mojos .................. SUCCESS [  0.623 s]
[INFO] Maven IT Plugin :: Packaging ....................... SUCCESS [  0.718 s]
[INFO] Maven IT Plugin :: Parameter Implementation ........ SUCCESS [  0.482 s]
[INFO] Maven IT Plugin :: Plugin Dependency ............... SUCCESS [  0.500 s]
[INFO] Maven IT Plugin :: Project ......................... SUCCESS [  1.022 s]
[INFO] Maven IT Plugin :: Project Interpolation ........... SUCCESS [  1.205 s]
[INFO] Maven IT Plugin :: Setter .......................... SUCCESS [  0.473 s]
[INFO] Maven IT Plugin :: Singleton Component ............. SUCCESS [  0.838 s]
[INFO] Maven IT Plugin :: Site ............................ SUCCESS [  5.105 s]
[INFO] Maven IT Plugin :: Toolchain ....................... SUCCESS [ 11.966 s]
[INFO] Maven IT Plugin :: Touch ........................... SUCCESS [  1.245 s]
[INFO] Maven IT Plugin :: Uses Properties Plugin .......... SUCCESS [  0.499 s]
[INFO] Maven IT Plugin :: Uses Wagon Plugin ............... SUCCESS [  6.078 s]
[INFO] Maven IT Plugin :: This plugin should contain the mojos needed by all tests. SUCCESS
[  0.464 s]
[INFO] Maven IT Plugin :: Plexus Utils 1.1 ................ SUCCESS [  1.215 s]
[INFO] Maven IT Plugin :: Plexus Utils New ................ SUCCESS [  0.633 s]
[INFO] Maven IT Plugin :: Plexus Component API ............ SUCCESS [  2.252 s]
[INFO] Maven IT Plugin :: Log4J Client .................... SUCCESS [  1.422 s]
[INFO] Maven IT Plugin :: Extension 1 ..................... SUCCESS [  0.711 s]
[INFO] Maven IT Plugin :: Extension 2 ..................... SUCCESS [  0.515 s]
[INFO] Maven IT Plugin :: Plexus Lifecycle ................ SUCCESS [  2.062 s]
[INFO] Maven IT Plugin :: Settings ........................ SUCCESS [  0.934 s]
[INFO] Maven IT Plugin :: mng-5805 extension .............. SUCCESS [  0.398 s]
[INFO] Maven IT Plugin :: mng-5805 plugin ................. SUCCESS [  1.190 s]
[INFO] Maven IT Plugin :: mng-5805 plugin-dep ............. SUCCESS [  0.451 s]
[INFO] Maven IT Toolchain ................................. SUCCESS [  1.427 s]
[INFO] Maven IT Wagon ..................................... SUCCESS [  0.844 s]
[INFO] Maven IT Support Artifacts ......................... SUCCESS [  4.059 s]
[INFO] Maven IT Extension ................................. SUCCESS [  0.483 s]
[INFO] Maven ITs .......................................... FAILURE [49:44 min]
[INFO] ------------------------------------------------------------------------
[INFO] BUILD FAILURE
[INFO] ------------------------------------------------------------------------
[INFO] Total time: 54:01 min
[INFO] Finished at: 2016-01-26T22:23:07-08:00
[INFO] Final Memory: 60M/742M
[INFO] ------------------------------------------------------------------------
[ERROR] Failed to execute goal org.apache.maven.plugins:maven-surefire-plugin:2.18.1:test
(default-test) on project core-it-suite: There are test failures.
[ERROR] 
[ERROR] Please refer to F:\ws\m3-its\core-integration-testing-trunk\core-it-suite\target\surefire-reports
for the individual test results.
[ERROR] -> [Help 1]
org.apache.maven.lifecycle.LifecycleExecutionException: Failed to execute goal org.apache.maven.plugins:maven-surefire-plugin:2.18.1:test
(default-test) on project core-it-suite: There are test failures.

Please refer to F:\ws\m3-its\core-integration-testing-trunk\core-it-suite\target\surefire-reports
for the individual test results.
	at org.apache.maven.lifecycle.internal.MojoExecutor.execute(MojoExecutor.java:212)
	at org.apache.maven.lifecycle.internal.MojoExecutor.execute(MojoExecutor.java:153)
	at org.apache.maven.lifecycle.internal.MojoExecutor.execute(MojoExecutor.java:145)
	at org.apache.maven.lifecycle.internal.LifecycleModuleBuilder.buildProject(LifecycleModuleBuilder.java:116)
	at org.apache.maven.lifecycle.internal.LifecycleModuleBuilder.buildProject(LifecycleModuleBuilder.java:80)
	at org.apache.maven.lifecycle.internal.builder.singlethreaded.SingleThreadedBuilder.build(SingleThreadedBuilder.java:51)
	at org.apache.maven.lifecycle.internal.LifecycleStarter.execute(LifecycleStarter.java:128)
	at org.apache.maven.DefaultMaven.doExecute(DefaultMaven.java:307)
	at org.apache.maven.DefaultMaven.doExecute(DefaultMaven.java:193)
	at org.apache.maven.DefaultMaven.execute(DefaultMaven.java:106)
	at org.apache.maven.cli.MavenCli.execute(MavenCli.java:862)
	at org.apache.maven.cli.MavenCli.doMain(MavenCli.java:286)
	at org.apache.maven.cli.MavenCli.main(MavenCli.java:197)
	at sun.reflect.NativeMethodAccessorImpl.invoke0(Native Method)
	at sun.reflect.NativeMethodAccessorImpl.invoke(NativeMethodAccessorImpl.java:57)
	at sun.reflect.DelegatingMethodAccessorImpl.invoke(DelegatingMethodAccessorImpl.java:43)
	at java.lang.reflect.Method.invoke(Method.java:601)
	at org.codehaus.plexus.classworlds.launcher.Launcher.launchEnhanced(Launcher.java:289)
	at org.codehaus.plexus.classworlds.launcher.Launcher.launch(Launcher.java:229)
	at org.codehaus.plexus.classworlds.launcher.Launcher.mainWithExitCode(Launcher.java:415)
	at org.codehaus.plexus.classworlds.launcher.Launcher.main(Launcher.java:356)
Caused by: org.apache.maven.plugin.MojoFailureException: There are test failures.

Please refer to F:\ws\m3-its\core-integration-testing-trunk\core-it-suite\target\surefire-reports
for the individual test results.
	at org.apache.maven.plugin.surefire.SurefireHelper.reportExecution(SurefireHelper.java:82)
	at org.apache.maven.plugin.surefire.SurefirePlugin.handleSummary(SurefirePlugin.java:254)
	at org.apache.maven.plugin.surefire.AbstractSurefireMojo.executeAfterPreconditionsChecked(AbstractSurefireMojo.java:854)
	at org.apache.maven.plugin.surefire.AbstractSurefireMojo.execute(AbstractSurefireMojo.java:722)
	at org.apache.maven.plugin.DefaultBuildPluginManager.executeMojo(DefaultBuildPluginManager.java:134)
	at org.apache.maven.lifecycle.internal.MojoExecutor.execute(MojoExecutor.java:208)
	... 20 more
[ERROR] 
[ERROR] Re-run Maven using the -X switch to enable full debug logging.
[ERROR] 
[ERROR] For more information about the errors and possible solutions, please read the following
articles:
[ERROR] [Help 1] http://cwiki.apache.org/confluence/display/MAVEN/MojoFailureException
[ERROR] 
[ERROR] After correcting the problems, you can resume the build with the command
[ERROR]   mvn <goals> -rf :core-it-suite
Build step 'Invoke top-level Maven targets' marked build as failure
Recording test results

Mime
View raw message