maven-notifications mailing list archives

Site index · List index
Message view « Date » · « Thread »
Top « Date » · « Thread »
From Apache Jenkins Server <jenk...@builds.apache.org>
Subject Build failed in Jenkins: dist-tool-plugin #1171
Date Wed, 20 Jan 2016 09:56:34 GMT
See <https://builds.apache.org/job/dist-tool-plugin/1171/>

------------------------------------------
[...truncated 2909 lines...]
[WARNING] javadoc: warning - Error fetching URL: http://junit.org/javadoc/4.10/package-list
[INFO] Generating "FindBugs" report             --- findbugs-maven-plugin:2.5.5:findbugs
[INFO] Locale is en
[INFO] Fork Value is true
     [java] Jan 20, 2016 9:55:25 AM java.util.prefs.FileSystemPreferences$1 run
     [java] INFO: Created user preferences directory.
     [java] Warnings generated: 12
[INFO] Done FindBugs Analysis....
[INFO] Generating "Sonar" report                --- maven-report:0.1:report
[INFO] Generating "Dist Tool> Check Sites" report --- dist-tool-plugin:1.0-SNAPSHOT:check-site
Downloading: https://repo.maven.apache.org/maven2/org/apache/maven/maven-ant-tasks/2.1.3/maven-ant-tasks-2.1.3.pom
Downloaded: https://repo.maven.apache.org/maven2/org/apache/maven/maven-ant-tasks/2.1.3/maven-ant-tasks-2.1.3.pom
(13 KB at 171.2 KB/sec)
Downloading: https://repo.maven.apache.org/maven2/org/apache/maven/archetype/maven-archetype/2.4/maven-archetype-2.4.pom
Downloaded: https://repo.maven.apache.org/maven2/org/apache/maven/archetype/maven-archetype/2.4/maven-archetype-2.4.pom
(13 KB at 368.3 KB/sec)
Downloading: https://repo.maven.apache.org/maven2/org/apache/maven/doxia/doxia-converter/1.2/doxia-converter-1.2.pom
Downloaded: https://repo.maven.apache.org/maven2/org/apache/maven/doxia/doxia-converter/1.2/doxia-converter-1.2.pom
(6 KB at 155.5 KB/sec)
Downloading: https://repo.maven.apache.org/maven2/org/apache/maven/doxia/doxia-tools/1.2/doxia-tools-1.2.pom
Downloaded: https://repo.maven.apache.org/maven2/org/apache/maven/doxia/doxia-tools/1.2/doxia-tools-1.2.pom
(9 KB at 298.0 KB/sec)
Downloading: https://repo.maven.apache.org/maven2/org/apache/maven/doxia/doxia-linkcheck/1.2/doxia-linkcheck-1.2.pom
Downloaded: https://repo.maven.apache.org/maven2/org/apache/maven/doxia/doxia-linkcheck/1.2/doxia-linkcheck-1.2.pom
(4 KB at 146.2 KB/sec)
Downloading: https://repo.maven.apache.org/maven2/org/apache/maven/enforcer/enforcer/1.4.1/enforcer-1.4.1.pom
Downloaded: https://repo.maven.apache.org/maven2/org/apache/maven/enforcer/enforcer/1.4.1/enforcer-1.4.1.pom
(8 KB at 306.0 KB/sec)
Downloading: https://repo.maven.apache.org/maven2/org/apache/maven/indexer/maven-indexer/5.1.1/maven-indexer-5.1.1.pom
Downloaded: https://repo.maven.apache.org/maven2/org/apache/maven/indexer/maven-indexer/5.1.1/maven-indexer-5.1.1.pom
(13 KB at 501.7 KB/sec)
Downloading: https://repo.maven.apache.org/maven2/org/apache/maven/apache-maven/3.0.5/apache-maven-3.0.5.pom
Downloaded: https://repo.maven.apache.org/maven2/org/apache/maven/apache-maven/3.0.5/apache-maven-3.0.5.pom
(6 KB at 140.0 KB/sec)
Downloading: https://repo.maven.apache.org/maven2/org/apache/maven/maven/3.0.5/maven-3.0.5.pom
Downloaded: https://repo.maven.apache.org/maven2/org/apache/maven/maven/3.0.5/maven-3.0.5.pom
(22 KB at 754.7 KB/sec)
Downloading: https://repo.maven.apache.org/maven2/org/apache/maven/apache-maven/3.1.1/apache-maven-3.1.1.pom
Downloaded: https://repo.maven.apache.org/maven2/org/apache/maven/apache-maven/3.1.1/apache-maven-3.1.1.pom
(7 KB at 214.1 KB/sec)
Downloading: https://repo.maven.apache.org/maven2/org/apache/maven/maven/3.1.1/maven-3.1.1.pom
Downloaded: https://repo.maven.apache.org/maven2/org/apache/maven/maven/3.1.1/maven-3.1.1.pom
(22 KB at 674.3 KB/sec)
Downloading: https://repo.maven.apache.org/maven2/org/apache/maven/apache-maven/3.3.9/apache-maven-3.3.9.pom
Downloaded: https://repo.maven.apache.org/maven2/org/apache/maven/apache-maven/3.3.9/apache-maven-3.3.9.pom
(7 KB at 214.6 KB/sec)
Downloading: https://repo.maven.apache.org/maven2/org/apache/maven/maven/3.3.9/maven-3.3.9.pom
Downloaded: https://repo.maven.apache.org/maven2/org/apache/maven/maven/3.3.9/maven-3.3.9.pom
(24 KB at 973.7 KB/sec)
Downloading: https://repo.maven.apache.org/maven2/org/apache/maven/plugin-testing/maven-plugin-testing/3.3.0/maven-plugin-testing-3.3.0.pom
Downloaded: https://repo.maven.apache.org/maven2/org/apache/maven/plugin-testing/maven-plugin-testing/3.3.0/maven-plugin-testing-3.3.0.pom
(11 KB at 432.2 KB/sec)
Downloading: https://repo.maven.apache.org/maven2/org/apache/maven/plugins/maven-plugins/28/maven-plugins-28.pom
Downloaded: https://repo.maven.apache.org/maven2/org/apache/maven/plugins/maven-plugins/28/maven-plugins-28.pom
(12 KB at 559.5 KB/sec)
Downloading: https://repo.maven.apache.org/maven2/org/apache/maven/plugins/maven-acr-plugin/1.1/maven-acr-plugin-1.1.pom
Downloaded: https://repo.maven.apache.org/maven2/org/apache/maven/plugins/maven-acr-plugin/1.1/maven-acr-plugin-1.1.pom
(6 KB at 128.4 KB/sec)
Downloading: https://repo.maven.apache.org/maven2/org/apache/maven/plugins/maven-ant-plugin/2.4/maven-ant-plugin-2.4.pom
Downloaded: https://repo.maven.apache.org/maven2/org/apache/maven/plugins/maven-ant-plugin/2.4/maven-ant-plugin-2.4.pom
(6 KB at 236.6 KB/sec)
Downloading: https://repo.maven.apache.org/maven2/org/apache/maven/plugins/maven-antrun-plugin/1.8/maven-antrun-plugin-1.8.pom
Downloaded: https://repo.maven.apache.org/maven2/org/apache/maven/plugins/maven-antrun-plugin/1.8/maven-antrun-plugin-1.8.pom
(4 KB at 154.1 KB/sec)
Downloading: https://repo.maven.apache.org/maven2/org/apache/maven/plugins/maven-assembly-plugin/2.6/maven-assembly-plugin-2.6.pom
Downloaded: https://repo.maven.apache.org/maven2/org/apache/maven/plugins/maven-assembly-plugin/2.6/maven-assembly-plugin-2.6.pom
(17 KB at 670.9 KB/sec)
Downloading: https://repo.maven.apache.org/maven2/org/apache/maven/plugins/maven-changelog-plugin/2.3/maven-changelog-plugin-2.3.pom
Downloaded: https://repo.maven.apache.org/maven2/org/apache/maven/plugins/maven-changelog-plugin/2.3/maven-changelog-plugin-2.3.pom
(14 KB at 576.4 KB/sec)
Downloading: https://repo.maven.apache.org/maven2/org/apache/maven/plugins/maven-changes-plugin/2.11/maven-changes-plugin-2.11.pom
Downloaded: https://repo.maven.apache.org/maven2/org/apache/maven/plugins/maven-changes-plugin/2.11/maven-changes-plugin-2.11.pom
(19 KB at 806.4 KB/sec)
Downloading: https://repo.maven.apache.org/maven2/org/apache/maven/plugins/maven-checkstyle-plugin/2.17/maven-checkstyle-plugin-2.17.pom
Downloaded: https://repo.maven.apache.org/maven2/org/apache/maven/plugins/maven-checkstyle-plugin/2.17/maven-checkstyle-plugin-2.17.pom
(14 KB at 482.8 KB/sec)
Downloading: https://repo.maven.apache.org/maven2/org/apache/maven/plugins/maven-clean-plugin/3.0.0/maven-clean-plugin-3.0.0.pom
Downloaded: https://repo.maven.apache.org/maven2/org/apache/maven/plugins/maven-clean-plugin/3.0.0/maven-clean-plugin-3.0.0.pom
(5 KB at 222.0 KB/sec)
Downloading: https://repo.maven.apache.org/maven2/org/apache/maven/plugins/maven-compiler-plugin/3.5/maven-compiler-plugin-3.5.pom
Downloaded: https://repo.maven.apache.org/maven2/org/apache/maven/plugins/maven-compiler-plugin/3.5/maven-compiler-plugin-3.5.pom
(10 KB at 430.4 KB/sec)
Downloading: https://repo.maven.apache.org/maven2/org/apache/maven/plugins/maven-dependency-plugin/2.10/maven-dependency-plugin-2.10.pom
Downloaded: https://repo.maven.apache.org/maven2/org/apache/maven/plugins/maven-dependency-plugin/2.10/maven-dependency-plugin-2.10.pom
(12 KB at 532.2 KB/sec)
Downloading: https://repo.maven.apache.org/maven2/org/apache/maven/plugins/maven-doap-plugin/1.2/maven-doap-plugin-1.2.pom
Downloaded: https://repo.maven.apache.org/maven2/org/apache/maven/plugins/maven-doap-plugin/1.2/maven-doap-plugin-1.2.pom
(8 KB at 297.4 KB/sec)
Downloading: https://repo.maven.apache.org/maven2/org/apache/maven/plugins/maven-docck-plugin/1.1/maven-docck-plugin-1.1.pom
Downloaded: https://repo.maven.apache.org/maven2/org/apache/maven/plugins/maven-docck-plugin/1.1/maven-docck-plugin-1.1.pom
(6 KB at 275.3 KB/sec)
Downloading: https://repo.maven.apache.org/maven2/org/apache/maven/plugins/maven-ear-plugin/2.10.1/maven-ear-plugin-2.10.1.pom
Downloaded: https://repo.maven.apache.org/maven2/org/apache/maven/plugins/maven-ear-plugin/2.10.1/maven-ear-plugin-2.10.1.pom
(10 KB at 426.4 KB/sec)
Downloading: https://repo.maven.apache.org/maven2/org/apache/maven/plugins/maven-ejb-plugin/2.5.1/maven-ejb-plugin-2.5.1.pom
Downloaded: https://repo.maven.apache.org/maven2/org/apache/maven/plugins/maven-ejb-plugin/2.5.1/maven-ejb-plugin-2.5.1.pom
(6 KB at 233.1 KB/sec)
Downloading: https://repo.maven.apache.org/maven2/org/apache/maven/plugins/maven-help-plugin/2.2/maven-help-plugin-2.2.pom
Downloaded: https://repo.maven.apache.org/maven2/org/apache/maven/plugins/maven-help-plugin/2.2/maven-help-plugin-2.2.pom
(9 KB at 387.1 KB/sec)
Downloading: https://repo.maven.apache.org/maven2/org/apache/maven/plugins/maven-invoker-plugin/2.0.0/maven-invoker-plugin-2.0.0.pom
Downloaded: https://repo.maven.apache.org/maven2/org/apache/maven/plugins/maven-invoker-plugin/2.0.0/maven-invoker-plugin-2.0.0.pom
(11 KB at 488.8 KB/sec)
Downloading: https://repo.maven.apache.org/maven2/org/apache/maven/plugins/maven-jar-plugin/2.6/maven-jar-plugin-2.6.pom
Downloaded: https://repo.maven.apache.org/maven2/org/apache/maven/plugins/maven-jar-plugin/2.6/maven-jar-plugin-2.6.pom
(6 KB at 274.1 KB/sec)
Downloading: https://repo.maven.apache.org/maven2/org/apache/maven/plugins/maven-jarsigner-plugin/1.4/maven-jarsigner-plugin-1.4.pom
Downloaded: https://repo.maven.apache.org/maven2/org/apache/maven/plugins/maven-jarsigner-plugin/1.4/maven-jarsigner-plugin-1.4.pom
(5 KB at 209.3 KB/sec)
Downloading: https://repo.maven.apache.org/maven2/org/apache/maven/plugins/maven-javadoc-plugin/2.10.3/maven-javadoc-plugin-2.10.3.pom
Downloaded: https://repo.maven.apache.org/maven2/org/apache/maven/plugins/maven-javadoc-plugin/2.10.3/maven-javadoc-plugin-2.10.3.pom
(16 KB at 691.5 KB/sec)
Downloading: https://repo.maven.apache.org/maven2/org/apache/maven/plugins/maven-jdeps-plugin/3.0.0/maven-jdeps-plugin-3.0.0.pom
Downloaded: https://repo.maven.apache.org/maven2/org/apache/maven/plugins/maven-jdeps-plugin/3.0.0/maven-jdeps-plugin-3.0.0.pom
(4 KB at 160.1 KB/sec)
Downloading: https://repo.maven.apache.org/maven2/org/apache/maven/plugins/maven-linkcheck-plugin/1.2/maven-linkcheck-plugin-1.2.pom
Downloaded: https://repo.maven.apache.org/maven2/org/apache/maven/plugins/maven-linkcheck-plugin/1.2/maven-linkcheck-plugin-1.2.pom
(8 KB at 264.8 KB/sec)
Downloading: https://repo.maven.apache.org/maven2/org/apache/maven/plugins/maven-patch-plugin/1.2/maven-patch-plugin-1.2.pom
Downloaded: https://repo.maven.apache.org/maven2/org/apache/maven/plugins/maven-patch-plugin/1.2/maven-patch-plugin-1.2.pom
(5 KB at 175.1 KB/sec)
Downloading: https://repo.maven.apache.org/maven2/org/apache/maven/plugins/maven-pdf-plugin/1.3/maven-pdf-plugin-1.3.pom
Downloaded: https://repo.maven.apache.org/maven2/org/apache/maven/plugins/maven-pdf-plugin/1.3/maven-pdf-plugin-1.3.pom
(12 KB at 520.3 KB/sec)
Downloading: https://repo.maven.apache.org/maven2/org/apache/maven/plugins/maven-pmd-plugin/3.6/maven-pmd-plugin-3.6.pom
Downloaded: https://repo.maven.apache.org/maven2/org/apache/maven/plugins/maven-pmd-plugin/3.6/maven-pmd-plugin-3.6.pom
(13 KB at 547.4 KB/sec)
Downloading: https://repo.maven.apache.org/maven2/org/apache/maven/plugins/maven-rar-plugin/2.4/maven-rar-plugin-2.4.pom
Downloaded: https://repo.maven.apache.org/maven2/org/apache/maven/plugins/maven-rar-plugin/2.4/maven-rar-plugin-2.4.pom
(7 KB at 282.3 KB/sec)
Downloading: https://repo.maven.apache.org/maven2/org/apache/maven/plugins/maven-repository-plugin/2.4/maven-repository-plugin-2.4.pom
Downloaded: https://repo.maven.apache.org/maven2/org/apache/maven/plugins/maven-repository-plugin/2.4/maven-repository-plugin-2.4.pom
(10 KB at 392.5 KB/sec)
Downloading: https://repo.maven.apache.org/maven2/org/apache/maven/plugins/maven-shade-plugin/2.4.3/maven-shade-plugin-2.4.3.pom
Downloaded: https://repo.maven.apache.org/maven2/org/apache/maven/plugins/maven-shade-plugin/2.4.3/maven-shade-plugin-2.4.3.pom
(9 KB at 345.4 KB/sec)
Downloading: https://repo.maven.apache.org/maven2/org/apache/maven/plugins/maven-stage-plugin/1.0/maven-stage-plugin-1.0.pom
Downloaded: https://repo.maven.apache.org/maven2/org/apache/maven/plugins/maven-stage-plugin/1.0/maven-stage-plugin-1.0.pom
(7 KB at 170.5 KB/sec)
Downloading: https://repo.maven.apache.org/maven2/org/apache/maven/plugins/maven-verifier-plugin/1.1/maven-verifier-plugin-1.1.pom
Downloaded: https://repo.maven.apache.org/maven2/org/apache/maven/plugins/maven-verifier-plugin/1.1/maven-verifier-plugin-1.1.pom
(5 KB at 212.3 KB/sec)
Downloading: https://repo.maven.apache.org/maven2/org/apache/maven/plugins/maven-war-plugin/2.6/maven-war-plugin-2.6.pom
Downloaded: https://repo.maven.apache.org/maven2/org/apache/maven/plugins/maven-war-plugin/2.6/maven-war-plugin-2.6.pom
(9 KB at 349.2 KB/sec)
Downloading: https://repo.maven.apache.org/maven2/org/apache/maven/release/maven-release/2.5.3/maven-release-2.5.3.pom
Downloaded: https://repo.maven.apache.org/maven2/org/apache/maven/release/maven-release/2.5.3/maven-release-2.5.3.pom
(5 KB at 213.2 KB/sec)
Downloading: https://repo.maven.apache.org/maven2/org/apache/maven/reporting/maven-reporting-impl/2.4/maven-reporting-impl-2.4.pom
Downloaded: https://repo.maven.apache.org/maven2/org/apache/maven/reporting/maven-reporting-impl/2.4/maven-reporting-impl-2.4.pom
(6 KB at 236.4 KB/sec)
Downloading: https://repo.maven.apache.org/maven2/org/apache/apache/resources/apache-resource-bundles/5/apache-resource-bundles-5.pom
Downloaded: https://repo.maven.apache.org/maven2/org/apache/apache/resources/apache-resource-bundles/5/apache-resource-bundles-5.pom
(3 KB at 102.1 KB/sec)
Downloading: https://repo.maven.apache.org/maven2/org/apache/apache/resources/apache-source-release-assembly-descriptor/1.0.5/apache-source-release-assembly-descriptor-1.0.5.pom
Downloaded: https://repo.maven.apache.org/maven2/org/apache/apache/resources/apache-source-release-assembly-descriptor/1.0.5/apache-source-release-assembly-descriptor-1.0.5.pom
(8 KB at 209.9 KB/sec)
Downloading: https://repo.maven.apache.org/maven2/org/apache/apache-incubator-disclaimer-resource-bundle/1.1/apache-incubator-disclaimer-resource-bundle-1.1.pom
[WARNING] Checksum validation failed, expected da39a3ee5e6b4b0d3255bfef95601890afd80709 but
is 6e0b74ff3d2da9bfe1126608f7e937537e628a5f for https://repo.maven.apache.org/maven2/org/apache/apache-incubator-disclaimer-resource-bundle/1.1/apache-incubator-disclaimer-resource-bundle-1.1.pom
[WARNING] Checksum validation failed, expected da39a3ee5e6b4b0d3255bfef95601890afd80709 but
is 6e0b74ff3d2da9bfe1126608f7e937537e628a5f for https://repo.maven.apache.org/maven2/org/apache/apache-incubator-disclaimer-resource-bundle/1.1/apache-incubator-disclaimer-resource-bundle-1.1.pom
Downloaded: https://repo.maven.apache.org/maven2/org/apache/apache-incubator-disclaimer-resource-bundle/1.1/apache-incubator-disclaimer-resource-bundle-1.1.pom
(722 B at 12.6 KB/sec)
Downloading: https://repo.maven.apache.org/maven2/org/apache/apache-resource-bundles/2/apache-resource-bundles-2.pom
[WARNING] Checksum validation failed, expected da39a3ee5e6b4b0d3255bfef95601890afd80709 but
is bfadc7db5b215805d531144732c80692de9780e1 for https://repo.maven.apache.org/maven2/org/apache/apache-resource-bundles/2/apache-resource-bundles-2.pom
[WARNING] Checksum validation failed, expected da39a3ee5e6b4b0d3255bfef95601890afd80709 but
is bfadc7db5b215805d531144732c80692de9780e1 for https://repo.maven.apache.org/maven2/org/apache/apache-resource-bundles/2/apache-resource-bundles-2.pom
Downloaded: https://repo.maven.apache.org/maven2/org/apache/apache-resource-bundles/2/apache-resource-bundles-2.pom
(2 KB at 46.9 KB/sec)
Downloading: https://repo.maven.apache.org/maven2/org/apache/apache-jar-resource-bundle/1.4/apache-jar-resource-bundle-1.4.pom
Downloaded: https://repo.maven.apache.org/maven2/org/apache/apache-jar-resource-bundle/1.4/apache-jar-resource-bundle-1.4.pom
(2 KB at 49.5 KB/sec)
Downloading: https://repo.maven.apache.org/maven2/org/apache/apache-license-header-resource-bundle/1.1/apache-license-header-resource-bundle-1.1.pom
[WARNING] Checksum validation failed, expected da39a3ee5e6b4b0d3255bfef95601890afd80709 but
is 923c05b225d7a5a8a614b5fca846b1776e18b98a for https://repo.maven.apache.org/maven2/org/apache/apache-license-header-resource-bundle/1.1/apache-license-header-resource-bundle-1.1.pom
[WARNING] Checksum validation failed, expected da39a3ee5e6b4b0d3255bfef95601890afd80709 but
is 923c05b225d7a5a8a614b5fca846b1776e18b98a for https://repo.maven.apache.org/maven2/org/apache/apache-license-header-resource-bundle/1.1/apache-license-header-resource-bundle-1.1.pom
Downloaded: https://repo.maven.apache.org/maven2/org/apache/apache-license-header-resource-bundle/1.1/apache-license-header-resource-bundle-1.1.pom
(694 B at 12.1 KB/sec)
Downloading: https://repo.maven.apache.org/maven2/org/apache/maven/scm/maven-scm/1.9.4/maven-scm-1.9.4.pom
Downloaded: https://repo.maven.apache.org/maven2/org/apache/maven/scm/maven-scm/1.9.4/maven-scm-1.9.4.pom
(22 KB at 981.4 KB/sec)
Downloading: https://repo.maven.apache.org/maven2/org/apache/maven/shared/maven-shared-components/22/maven-shared-components-22.pom
Downloaded: https://repo.maven.apache.org/maven2/org/apache/maven/shared/maven-shared-components/22/maven-shared-components-22.pom
(5 KB at 172.2 KB/sec)
Downloading: https://repo.maven.apache.org/maven2/org/apache/maven/shared/file-management/3.0.0/file-management-3.0.0.pom
Downloaded: https://repo.maven.apache.org/maven2/org/apache/maven/shared/file-management/3.0.0/file-management-3.0.0.pom
(5 KB at 199.0 KB/sec)
Downloading: https://repo.maven.apache.org/maven2/org/apache/maven/shared/maven-common-artifact-filters/3.0.0/maven-common-artifact-filters-3.0.0.pom
Downloaded: https://repo.maven.apache.org/maven2/org/apache/maven/shared/maven-common-artifact-filters/3.0.0/maven-common-artifact-filters-3.0.0.pom
(5 KB at 204.3 KB/sec)
Downloading: https://repo.maven.apache.org/maven2/org/apache/maven/shared/maven-dependency-analyzer/1.6/maven-dependency-analyzer-1.6.pom
Downloaded: https://repo.maven.apache.org/maven2/org/apache/maven/shared/maven-dependency-analyzer/1.6/maven-dependency-analyzer-1.6.pom
(6 KB at 241.8 KB/sec)
Downloading: https://repo.maven.apache.org/maven2/org/apache/maven/shared/maven-dependency-tree/3.0/maven-dependency-tree-3.0.pom
Downloaded: https://repo.maven.apache.org/maven2/org/apache/maven/shared/maven-dependency-tree/3.0/maven-dependency-tree-3.0.pom
(8 KB at 312.9 KB/sec)
Downloading: https://repo.maven.apache.org/maven2/org/apache/maven/shared/maven-filtering/3.0.0/maven-filtering-3.0.0.pom
Downloaded: https://repo.maven.apache.org/maven2/org/apache/maven/shared/maven-filtering/3.0.0/maven-filtering-3.0.0.pom
(6 KB at 247.4 KB/sec)
Downloading: https://repo.maven.apache.org/maven2/org/apache/maven/shared/maven-invoker/2.2/maven-invoker-2.2.pom
Downloaded: https://repo.maven.apache.org/maven2/org/apache/maven/shared/maven-invoker/2.2/maven-invoker-2.2.pom
(6 KB at 272.2 KB/sec)
Downloading: https://repo.maven.apache.org/maven2/org/apache/maven/shared/maven-jarsigner/1.4/maven-jarsigner-1.4.pom
Downloaded: https://repo.maven.apache.org/maven2/org/apache/maven/shared/maven-jarsigner/1.4/maven-jarsigner-1.4.pom
(4 KB at 164.5 KB/sec)
Downloading: https://repo.maven.apache.org/maven2/org/apache/maven/shared/maven-mapping/3.0.0/maven-mapping-3.0.0.pom
Downloaded: https://repo.maven.apache.org/maven2/org/apache/maven/shared/maven-mapping/3.0.0/maven-mapping-3.0.0.pom
(5 KB at 106.3 KB/sec)
Downloading: https://repo.maven.apache.org/maven2/org/apache/maven/shared/maven-repository-builder/1.0/maven-repository-builder-1.0.pom
Downloaded: https://repo.maven.apache.org/maven2/org/apache/maven/shared/maven-repository-builder/1.0/maven-repository-builder-1.0.pom
(5 KB at 171.0 KB/sec)
Downloading: https://repo.maven.apache.org/maven2/org/apache/maven/shared/maven-runtime/1.0-alpha-3/maven-runtime-1.0-alpha-3.pom
Downloaded: https://repo.maven.apache.org/maven2/org/apache/maven/shared/maven-runtime/1.0-alpha-3/maven-runtime-1.0-alpha-3.pom
(6 KB at 244.4 KB/sec)
Downloading: https://repo.maven.apache.org/maven2/org/apache/maven/shared/maven-script-interpreter/1.1/maven-script-interpreter-1.1.pom
Downloaded: https://repo.maven.apache.org/maven2/org/apache/maven/shared/maven-script-interpreter/1.1/maven-script-interpreter-1.1.pom
(4 KB at 172.6 KB/sec)
Downloading: https://repo.maven.apache.org/maven2/org/apache/maven/shared/maven-shared-jar/1.2/maven-shared-jar-1.2.pom
Downloaded: https://repo.maven.apache.org/maven2/org/apache/maven/shared/maven-shared-jar/1.2/maven-shared-jar-1.2.pom
(5 KB at 187.2 KB/sec)
Downloading: https://repo.maven.apache.org/maven2/org/apache/maven/shared/maven-shared-utils/3.0.0/maven-shared-utils-3.0.0.pom
Downloaded: https://repo.maven.apache.org/maven2/org/apache/maven/shared/maven-shared-utils/3.0.0/maven-shared-utils-3.0.0.pom
(6 KB at 259.7 KB/sec)
Downloading: https://repo.maven.apache.org/maven2/org/apache/maven/shared/maven-shared-io/3.0.0/maven-shared-io-3.0.0.pom
Downloaded: https://repo.maven.apache.org/maven2/org/apache/maven/shared/maven-shared-io/3.0.0/maven-shared-io-3.0.0.pom
(5 KB at 184.5 KB/sec)
Downloading: https://repo.maven.apache.org/maven2/org/apache/maven/shared/maven-verifier/1.6/maven-verifier-1.6.pom
Downloaded: https://repo.maven.apache.org/maven2/org/apache/maven/shared/maven-verifier/1.6/maven-verifier-1.6.pom
(4 KB at 132.2 KB/sec)
Downloading: https://repo.maven.apache.org/maven2/org/apache/maven/maven-archiver/3.0.0/maven-archiver-3.0.0.pom
Downloaded: https://repo.maven.apache.org/maven2/org/apache/maven/maven-archiver/3.0.0/maven-archiver-3.0.0.pom
(5 KB at 125.4 KB/sec)
Downloading: https://repo.maven.apache.org/maven2/org/apache/maven/skins/maven-skins/10/maven-skins-10.pom
Downloaded: https://repo.maven.apache.org/maven2/org/apache/maven/skins/maven-skins/10/maven-skins-10.pom
(4 KB at 140.7 KB/sec)
Downloading: https://repo.maven.apache.org/maven2/org/apache/maven/skins/maven-default-skin/1.1/maven-default-skin-1.1.pom
Downloaded: https://repo.maven.apache.org/maven2/org/apache/maven/skins/maven-default-skin/1.1/maven-default-skin-1.1.pom
(5 KB at 129.0 KB/sec)
Downloading: https://repo.maven.apache.org/maven2/org/apache/maven/skins/maven-skins/6/maven-skins-6.pom
Downloaded: https://repo.maven.apache.org/maven2/org/apache/maven/skins/maven-skins/6/maven-skins-6.pom
(4 KB at 105.8 KB/sec)
Downloading: https://repo.maven.apache.org/maven2/org/apache/maven/skins/maven-fluido-skin/1.4/maven-fluido-skin-1.4.pom
Downloaded: https://repo.maven.apache.org/maven2/org/apache/maven/skins/maven-fluido-skin/1.4/maven-fluido-skin-1.4.pom
(27 KB at 1160.6 KB/sec)
Downloading: https://repo.maven.apache.org/maven2/org/apache/maven/surefire/surefire/2.19.1/surefire-2.19.1.pom
Downloaded: https://repo.maven.apache.org/maven2/org/apache/maven/surefire/surefire/2.19.1/surefire-2.19.1.pom
(19 KB at 819.1 KB/sec)
Downloading: https://repo.maven.apache.org/maven2/org/apache/maven/wagon/wagon/2.10/wagon-2.10.pom
Downloaded: https://repo.maven.apache.org/maven2/org/apache/maven/wagon/wagon/2.10/wagon-2.10.pom
(21 KB at 910.7 KB/sec)
[INFO] Generating "Dist Tool> Check Source Release" report --- dist-tool-plugin:1.0-SNAPSHOT:check-source-release
[WARNING] Missing file for doxia-linkcheck in https://repo.maven.apache.org/maven2/org/apache/maven/doxia/doxia-linkcheck/1.2/
[WARNING]  > doxia-linkcheck-1.2-source-release.zip <
[WARNING]  > doxia-linkcheck-1.2-source-release.zip.asc <
[WARNING]  > doxia-linkcheck-1.2-source-release.zip.md5 <
[WARNING] Missing file for doxia-linkcheck in http://www.apache.org/dist/maven/doxia
[WARNING]  > doxia-linkcheck-1.2-source-release.zip <
[WARNING]  > doxia-linkcheck-1.2-source-release.zip.asc <
[WARNING]  > doxia-linkcheck-1.2-source-release.zip.md5 <
[ERROR] Missing file for maven-compiler-plugin in http://www.apache.org/dist/maven/plugins
[ERROR]  > maven-compiler-plugin-3.5-source-release.zip <
[ERROR]  > maven-compiler-plugin-3.5-source-release.zip.asc <
[ERROR]  > maven-compiler-plugin-3.5-source-release.zip.md5 <
[ERROR] Different version than 3.5 for maven-compiler-plugin available in http://www.apache.org/dist/maven/plugins
[ERROR]  > maven-compiler-plugin-3.3-source-release.zip <
[ERROR]  > maven-compiler-plugin-3.3-source-release.zip.asc <
[ERROR]  > maven-compiler-plugin-3.3-source-release.zip.md5 <
[WARNING] Missing file for apache-incubator-disclaimer-resource-bundle in https://repo.maven.apache.org/maven2/org/apache/apache-incubator-disclaimer-resource-bundle/1.1/
[WARNING]  > apache-incubator-disclaimer-resource-bundle-1.1-source-release.zip <
[WARNING]  > apache-incubator-disclaimer-resource-bundle-1.1-source-release.zip.asc <
[WARNING]  > apache-incubator-disclaimer-resource-bundle-1.1-source-release.zip.md5 <
[WARNING] Missing file for apache-incubator-disclaimer-resource-bundle in http://www.apache.org/dist/maven/resources
[WARNING]  > apache-incubator-disclaimer-resource-bundle-1.1-source-release.zip <
[WARNING]  > apache-incubator-disclaimer-resource-bundle-1.1-source-release.zip.asc <
[WARNING]  > apache-incubator-disclaimer-resource-bundle-1.1-source-release.zip.md5 <
[WARNING] Missing file for apache-jar-resource-bundle in https://repo.maven.apache.org/maven2/org/apache/apache-jar-resource-bundle/1.4/
[WARNING]  > apache-jar-resource-bundle-1.4-source-release.zip <
[WARNING]  > apache-jar-resource-bundle-1.4-source-release.zip.asc <
[WARNING]  > apache-jar-resource-bundle-1.4-source-release.zip.md5 <
[WARNING] Missing file for apache-jar-resource-bundle in http://www.apache.org/dist/maven/resources
[WARNING]  > apache-jar-resource-bundle-1.4-source-release.zip <
[WARNING]  > apache-jar-resource-bundle-1.4-source-release.zip.asc <
[WARNING]  > apache-jar-resource-bundle-1.4-source-release.zip.md5 <
[WARNING] Missing file for apache-license-header-resource-bundle in https://repo.maven.apache.org/maven2/org/apache/apache-license-header-resource-bundle/1.1/
[WARNING]  > apache-license-header-resource-bundle-1.1-source-release.zip <
[WARNING]  > apache-license-header-resource-bundle-1.1-source-release.zip.asc <
[WARNING]  > apache-license-header-resource-bundle-1.1-source-release.zip.md5 <
[WARNING] Missing file for apache-license-header-resource-bundle in http://www.apache.org/dist/maven/resources
[WARNING]  > apache-license-header-resource-bundle-1.1-source-release.zip <
[WARNING]  > apache-license-header-resource-bundle-1.1-source-release.zip.asc <
[WARNING]  > apache-license-header-resource-bundle-1.1-source-release.zip.md5 <
[INFO] Generating "Dist Tool> Check Index Pages" report --- dist-tool-plugin:1.0-SNAPSHOT:check-index-page
[ERROR] maven-compiler-plugin: found 3.3 instead of 3.5 in http://maven.apache.org/plugins/
[INFO] Generating "Dist Tool> Check Errors" report --- dist-tool-plugin:1.0-SNAPSHOT:check-errors
[INFO] Generating "Dist Tool> List Plugins Prerequisites" report --- dist-tool-plugin:1.0-SNAPSHOT:list-plugins-prerequisites
[INFO] Generating "Dist Tool> Failure Hack" report --- dist-tool-plugin:1.0-SNAPSHOT:failure-report
[ERROR] check-source-release.log error log not empty:
Missing file for maven-compiler-plugin in http://www.apache.org/dist/maven/plugins
 > maven-compiler-plugin-3.5-source-release.zip <
 > maven-compiler-plugin-3.5-source-release.zip.asc <
 > maven-compiler-plugin-3.5-source-release.zip.md5 <
Different version than 3.5 for maven-compiler-plugin available in http://www.apache.org/dist/maven/plugins
 > maven-compiler-plugin-3.3-source-release.zip <
 > maven-compiler-plugin-3.3-source-release.zip.asc <
 > maven-compiler-plugin-3.3-source-release.zip.md5 <

[ERROR] check-index-page.log error log not empty:
maven-compiler-plugin: found 3.3 instead of 3.5 in http://maven.apache.org/plugins/

[JENKINS] Archiving site from <https://builds.apache.org/job/dist-tool-plugin/ws/target/site>
to /x1/jenkins/jenkins-home/jobs/dist-tool-plugin/site
[INFO] ------------------------------------------------------------------------
[INFO] BUILD FAILURE
[INFO] ------------------------------------------------------------------------
[INFO] Total time: 3:23.517s
[INFO] Finished at: Wed Jan 20 09:56:38 UTC 2016
[INFO] Final Memory: 74M/757M
[INFO] ------------------------------------------------------------------------
[WARNING] The requested profile "apache.snapshots" could not be activated because it does
not exist.
Waiting for Jenkins to finish collecting data
[ERROR] Failed to execute goal org.apache.maven.plugins:maven-site-plugin:3.4:site (default-site)
on project dist-tool-plugin: Error generating dist-tool-plugin:1.0-SNAPSHOT:failure-report:
Dist Tool> Checks found inconsistencies in some released artifacts, see https://builds.apache.org/job/dist-tool-plugin/site/dist-tool-check-errors.html
for more information -> [Help 1]
[ERROR] 
[ERROR] To see the full stack trace of the errors, re-run Maven with the -e switch.
[ERROR] Re-run Maven using the -X switch to enable full debug logging.
[ERROR] 
[ERROR] For more information about the errors and possible solutions, please read the following
articles:
[ERROR] [Help 1] http://cwiki.apache.org/confluence/display/MAVEN/MojoExecutionException
[JENKINS] Archiving <https://builds.apache.org/job/dist-tool-plugin/ws/pom.xml> to org.apache.maven.dist.tools/dist-tool-plugin/1.0-SNAPSHOT/dist-tool-plugin-1.0-SNAPSHOT.pom
[JENKINS] Archiving <https://builds.apache.org/job/dist-tool-plugin/ws/target/dist-tool-plugin-1.0-SNAPSHOT.jar>
to org.apache.maven.dist.tools/dist-tool-plugin/1.0-SNAPSHOT/dist-tool-plugin-1.0-SNAPSHOT.jar
channel stopped

Mime
View raw message