maven-notifications mailing list archives

Site index · List index
Message view « Date » · « Thread »
Top « Date » · « Thread »
From Apache Jenkins Server <jenk...@builds.apache.org>
Subject Build failed in Jenkins: core-it-maven-3-win #1075
Date Fri, 01 Jan 2016 17:19:44 GMT
See <https://builds.apache.org/job/core-it-maven-3-win/1075/changes>

Changes:

[hboutemy] fixed little mistake in c09aaa35

------------------------------------------
[...truncated 10428 lines...]
[INFO] Total time: 0.544 s
[INFO] Finished at: 2016-01-01T08:48:57-08:00
[INFO] Final Memory: 21M/742M
[INFO] ------------------------------------------------------------------------
[ERROR] Failed to execute goal org.apache.maven.its.plugins:maven-it-plugin-ant-based:2.1-SNAPSHOT:touch
(test) on project test: Execution test of goal org.apache.maven.its.plugins:maven-it-plugin-ant-based:2.1-SNAPSHOT:touch
failed: Unable to load the mojo 'touch' (or one of its required components) from the plugin
'org.apache.maven.its.plugins:maven-it-plugin-ant-based:2.1-SNAPSHOT': com.google.inject.ProvisionException:
Unable to provision, see the following errors:
[ERROR] 
[ERROR] 1) Error in ComponentFactory:ant-mojo
[ERROR] at ClassRealm[plugin>org.apache.maven.its.plugins:maven-it-plugin-ant-based:2.1-SNAPSHOT,
parent: sun.misc.Launcher$AppClassLoader@642ddc4c] (via modules: org.eclipse.sisu.wire.WireModule
-> org.eclipse.sisu.plexus.PlexusBindingModule)
[ERROR] while locating org.apache.maven.plugin.Mojo annotated with @com.google.inject.name.Named(value=org.apache.maven.its.plugins:maven-it-plugin-ant-based:2.1-SNAPSHOT:touch)
[ERROR] 
[ERROR] 1 error
[ERROR] role: org.apache.maven.plugin.Mojo
[ERROR] roleHint: org.apache.maven.its.plugins:maven-it-plugin-ant-based:2.1-SNAPSHOT:touch:
Failed to extract Ant script for: role: 'org.apache.maven.plugin.Mojo', implementation: '/touch.build.xml:touch',
role hint: 'org.apache.maven.its.plugins:maven-it-plugin-ant-based:2.1-SNAPSHOT:touch': There
is not enough space on the disk
[ERROR] -> [Help 1]
org.apache.maven.lifecycle.LifecycleExecutionException: Failed to execute goal org.apache.maven.its.plugins:maven-it-plugin-ant-based:2.1-SNAPSHOT:touch
(test) on project test: Execution test of goal org.apache.maven.its.plugins:maven-it-plugin-ant-based:2.1-SNAPSHOT:touch
failed: Unable to load the mojo 'touch' (or one of its required components) from the plugin
'org.apache.maven.its.plugins:maven-it-plugin-ant-based:2.1-SNAPSHOT'
	at org.apache.maven.lifecycle.internal.MojoExecutor.execute(MojoExecutor.java:214)
	at org.apache.maven.lifecycle.internal.MojoExecutor.execute(MojoExecutor.java:155)
	at org.apache.maven.lifecycle.internal.MojoExecutor.execute(MojoExecutor.java:147)
	at org.apache.maven.lifecycle.internal.LifecycleModuleBuilder.buildProject(LifecycleModuleBuilder.java:116)
	at org.apache.maven.lifecycle.internal.LifecycleModuleBuilder.buildProject(LifecycleModuleBuilder.java:80)
	at org.apache.maven.lifecycle.internal.builder.singlethreaded.SingleThreadedBuilder.build(SingleThreadedBuilder.java:51)
	at org.apache.maven.lifecycle.internal.LifecycleStarter.execute(LifecycleStarter.java:128)
	at org.apache.maven.DefaultMaven.doExecute(DefaultMaven.java:307)
	at org.apache.maven.DefaultMaven.doExecute(DefaultMaven.java:193)
	at org.apache.maven.DefaultMaven.execute(DefaultMaven.java:106)
	at org.apache.maven.cli.MavenCli.execute(MavenCli.java:865)
	at org.apache.maven.cli.MavenCli.doMain(MavenCli.java:288)
	at org.apache.maven.cli.MavenCli.main(MavenCli.java:199)
	at sun.reflect.NativeMethodAccessorImpl.invoke0(Native Method)
	at sun.reflect.NativeMethodAccessorImpl.invoke(NativeMethodAccessorImpl.java:57)
	at sun.reflect.DelegatingMethodAccessorImpl.invoke(DelegatingMethodAccessorImpl.java:43)
	at java.lang.reflect.Method.invoke(Method.java:601)
	at org.codehaus.plexus.classworlds.launcher.Launcher.launchEnhanced(Launcher.java:289)
	at org.codehaus.plexus.classworlds.launcher.Launcher.launch(Launcher.java:229)
	at org.codehaus.plexus.classworlds.launcher.Launcher.mainWithExitCode(Launcher.java:415)
	at org.codehaus.plexus.classworlds.launcher.Launcher.main(Launcher.java:356)
Caused by: org.apache.maven.plugin.PluginExecutionException: Execution test of goal org.apache.maven.its.plugins:maven-it-plugin-ant-based:2.1-SNAPSHOT:touch
failed: Unable to load the mojo 'touch' (or one of its required components) from the plugin
'org.apache.maven.its.plugins:maven-it-plugin-ant-based:2.1-SNAPSHOT'
	at org.apache.maven.plugin.DefaultBuildPluginManager.executeMojo(DefaultBuildPluginManager.java:153)
	at org.apache.maven.lifecycle.internal.MojoExecutor.execute(MojoExecutor.java:209)
	... 20 more
Caused by: org.apache.maven.plugin.PluginContainerException: Unable to load the mojo 'touch'
(or one of its required components) from the plugin 'org.apache.maven.its.plugins:maven-it-plugin-ant-based:2.1-SNAPSHOT'
	at org.apache.maven.plugin.internal.DefaultMavenPluginManager.getConfiguredMojo(DefaultMavenPluginManager.java:551)
	at org.apache.maven.plugin.DefaultBuildPluginManager.executeMojo(DefaultBuildPluginManager.java:121)
	... 21 more
Caused by: org.codehaus.plexus.component.repository.exception.ComponentLookupException: com.google.inject.ProvisionException:
Unable to provision, see the following errors:

1) Error in ComponentFactory:ant-mojo
  at ClassRealm[plugin>org.apache.maven.its.plugins:maven-it-plugin-ant-based:2.1-SNAPSHOT,
parent: sun.misc.Launcher$AppClassLoader@642ddc4c] (via modules: org.eclipse.sisu.wire.WireModule
-> org.eclipse.sisu.plexus.PlexusBindingModule)
  while locating org.apache.maven.plugin.Mojo annotated with @com.google.inject.name.Named(value=org.apache.maven.its.plugins:maven-it-plugin-ant-based:2.1-SNAPSHOT:touch)

1 error
      role: org.apache.maven.plugin.Mojo
  roleHint: org.apache.maven.its.plugins:maven-it-plugin-ant-based:2.1-SNAPSHOT:touch
	at org.codehaus.plexus.DefaultPlexusContainer.lookup(DefaultPlexusContainer.java:267)
	at org.codehaus.plexus.DefaultPlexusContainer.lookup(DefaultPlexusContainer.java:255)
	at org.apache.maven.plugin.internal.DefaultMavenPluginManager.getConfiguredMojo(DefaultMavenPluginManager.java:517)
	... 22 more
Caused by: com.google.inject.ProvisionException: Unable to provision, see the following errors:

1) Error in ComponentFactory:ant-mojo
  at ClassRealm[plugin>org.apache.maven.its.plugins:maven-it-plugin-ant-based:2.1-SNAPSHOT,
parent: sun.misc.Launcher$AppClassLoader@642ddc4c] (via modules: org.eclipse.sisu.wire.WireModule
-> org.eclipse.sisu.plexus.PlexusBindingModule)
  while locating org.apache.maven.plugin.Mojo annotated with @com.google.inject.name.Named(value=org.apache.maven.its.plugins:maven-it-plugin-ant-based:2.1-SNAPSHOT:touch)

1 error
	at com.google.inject.internal.InjectorImpl$2.get(InjectorImpl.java:1025)
	at org.eclipse.sisu.inject.Guice4$1.get(Guice4.java:162)
	at org.eclipse.sisu.inject.LazyBeanEntry.getValue(LazyBeanEntry.java:81)
	at org.eclipse.sisu.plexus.LazyPlexusBean.getValue(LazyPlexusBean.java:51)
	at org.codehaus.plexus.DefaultPlexusContainer.lookup(DefaultPlexusContainer.java:263)
	... 24 more
Caused by: org.codehaus.plexus.component.factory.ComponentInstantiationException: Failed to
extract Ant script for: role: 'org.apache.maven.plugin.Mojo', implementation: '/touch.build.xml:touch',
role hint: 'org.apache.maven.its.plugins:maven-it-plugin-ant-based:2.1-SNAPSHOT:touch'
	at org.codehaus.plexus.component.factory.ant.AntComponentFactory.newInstance(AntComponentFactory.java:24)
	at org.apache.maven.script.ant.AntMojoComponentFactory.newInstance(AntMojoComponentFactory.java:36)
	at org.codehaus.plexus.component.factory.AbstractComponentFactory.newInstance(AbstractComponentFactory.java:27)
	at org.eclipse.sisu.plexus.ComponentDescriptorBeanModule$DeferredFactoryClass.get(ComponentDescriptorBeanModule.java:191)
	at com.google.inject.internal.ProviderInternalFactory.provision(ProviderInternalFactory.java:81)
	at com.google.inject.internal.InternalFactoryToInitializableAdapter.provision(InternalFactoryToInitializableAdapter.java:53)
	at com.google.inject.internal.ProviderInternalFactory$1.call(ProviderInternalFactory.java:65)
	at com.google.inject.internal.ProvisionListenerStackCallback$Provision.provision(ProvisionListenerStackCallback.java:115)
	at org.eclipse.sisu.bean.BeanScheduler$Activator.onProvision(BeanScheduler.java:176)
	at com.google.inject.internal.ProvisionListenerStackCallback$Provision.provision(ProvisionListenerStackCallback.java:126)
	at com.google.inject.internal.ProvisionListenerStackCallback.provision(ProvisionListenerStackCallback.java:68)
	at com.google.inject.internal.ProviderInternalFactory.circularGet(ProviderInternalFactory.java:63)
	at com.google.inject.internal.InternalFactoryToInitializableAdapter.get(InternalFactoryToInitializableAdapter.java:45)
	at com.google.inject.internal.InjectorImpl$2$1.call(InjectorImpl.java:1016)
	at com.google.inject.internal.InjectorImpl.callInContext(InjectorImpl.java:1092)
	at com.google.inject.internal.InjectorImpl$2.get(InjectorImpl.java:1012)
	... 28 more
Caused by: java.io.IOException: There is not enough space on the disk
	at java.io.FileOutputStream.writeBytes(Native Method)
	at java.io.FileOutputStream.write(FileOutputStream.java:318)
	at org.codehaus.plexus.util.IOUtil.copy(IOUtil.java:190)
	at org.codehaus.plexus.util.IOUtil.copy(IOUtil.java:174)
	at org.codehaus.plexus.component.factory.ant.AntScriptInvoker.<init>(AntScriptInvoker.java:91)
	at org.codehaus.plexus.component.factory.ant.AntComponentFactory.newInstance(AntComponentFactory.java:20)
	... 43 more
[ERROR] 
[ERROR] Re-run Maven using the -X switch to enable full debug logging.
[ERROR] 
[ERROR] For more information about the errors and possible solutions, please read the following
articles:
[ERROR] [Help 1] http://cwiki.apache.org/confluence/display/MAVEN/PluginContainerException

	at org.apache.maven.it.Verifier.executeGoals(Verifier.java:1369)
	at org.apache.maven.it.Verifier.executeGoal(Verifier.java:1254)
	at org.apache.maven.it.Verifier.executeGoal(Verifier.java:1248)
	at org.apache.maven.it.MavenITmng4396AntBased20xMojoSupportTest.testit(MavenITmng4396AntBased20xMojoSupportTest.java:53)


Results :

Failed tests: 
  MavenITmng4919LifecycleMappingWithSameGoalTwiceTest>AbstractMavenIntegrationTestCase.runTest:219->testit:59
expected:<[check, check]> but was:<[check]>
Tests in error: 
  MavenITmng4396AntBased20xMojoSupportTest>AbstractMavenIntegrationTestCase.runTest:219->testit:53
ยป Verification

Tests run: 772, Failures: 1, Errors: 1, Skipped: 0

[INFO] ------------------------------------------------------------------------
[INFO] Reactor Summary:
[INFO] 
[INFO] Maven Core ITs ..................................... SUCCESS [ 48.871 s]
[INFO] Maven IT Support ................................... SUCCESS [  0.921 s]
[INFO] Maven IT :: Plugins ................................ SUCCESS [  0.757 s]
[INFO] Maven IT Plugin :: Active Collection ............... SUCCESS [ 11.468 s]
[INFO] Maven IT Plugin :: Ant-Based ....................... SUCCESS [  5.879 s]
[INFO] Maven IT Plugin :: Artifact ........................ SUCCESS [  2.824 s]
[INFO] Maven IT Plugin :: Class Loader :: Dependency A .... SUCCESS [  0.541 s]
[INFO] Maven IT Plugin :: Class Loader :: Dependency B .... SUCCESS [  0.873 s]
[INFO] Maven IT Plugin :: Class Loader :: Dependency C .... SUCCESS [  0.616 s]
[INFO] Maven IT Plugin :: Class Loader .................... SUCCESS [  2.778 s]
[INFO] Maven IT Plugin :: Class Loader :: Aggregator ...... SUCCESS [  0.432 s]
[INFO] Maven IT Plugin :: Configuration ................... SUCCESS [  1.191 s]
[INFO] Maven IT Plugin :: Context Passing ................. SUCCESS [  0.548 s]
[INFO] Maven ITs :: Core Plugin Stubs ..................... SUCCESS [  0.441 s]
[INFO] Maven IT Clean Plugin Stub ......................... SUCCESS [  1.044 s]
[INFO] Maven IT Compiler Plugin Stub ...................... SUCCESS [  0.951 s]
[INFO] Maven IT Deploy Plugin Stub ........................ SUCCESS [  0.962 s]
[INFO] Maven IT EAR Plugin Stub ........................... SUCCESS [  0.740 s]
[INFO] Maven IT EJB Plugin Stub ........................... SUCCESS [  0.670 s]
[INFO] Maven IT Install Plugin Stub ....................... SUCCESS [  0.649 s]
[INFO] Maven IT JAR Plugin Stub ........................... SUCCESS [  0.846 s]
[INFO] Maven IT Javadoc Plugin Stub ....................... SUCCESS [  0.627 s]
[INFO] Maven IT Plugin Plugin Stub ........................ SUCCESS [  0.710 s]
[INFO] Maven IT RAR Plugin Stub ........................... SUCCESS [  1.021 s]
[INFO] Maven IT Resources Plugin Stub ..................... SUCCESS [  0.675 s]
[INFO] Maven IT Site Plugin Stub .......................... SUCCESS [  0.792 s]
[INFO] Maven IT Source Plugin Stub ........................ SUCCESS [  0.818 s]
[INFO] Maven IT Surefire Plugin Stub ...................... SUCCESS [  0.672 s]
[INFO] Maven IT WAR Plugin Stub ........................... SUCCESS [  0.829 s]
[INFO] Maven IT Plugin :: Dependency Collection ........... SUCCESS [  0.818 s]
[INFO] Maven IT Plugin :: Dependency Resolution ........... SUCCESS [  8.667 s]
[INFO] Maven IT Plugin :: Expression ...................... SUCCESS [  1.606 s]
[INFO] Maven IT Plugin :: Error Mojos ..................... SUCCESS [  3.299 s]
[INFO] Maven IT Component ................................. SUCCESS [  0.451 s]
[INFO] Maven IT Plugin :: Extension Consumer .............. SUCCESS [  0.532 s]
[INFO] Maven IT Plugin :: Extension Provider .............. SUCCESS [  0.659 s]
[INFO] Maven IT Plugin :: Fork ............................ SUCCESS [  0.776 s]
[INFO] Maven IT Plugin :: Invalid Descriptor .............. SUCCESS [  0.946 s]
[INFO] Maven IT Plugin :: Log File ........................ SUCCESS [  1.085 s]
[INFO] Maven IT Helper Library ............................ SUCCESS [  1.896 s]
[INFO] Maven IT Plugin :: Model Interpolation ............. SUCCESS [  1.369 s]
[INFO] Maven IT Plugin :: No Default Component ............ SUCCESS [  0.885 s]
[INFO] Maven IT Plugin :: No Project ...................... SUCCESS [  0.452 s]
[INFO] Maven IT Plugin :: Online .......................... SUCCESS [  0.544 s]
[INFO] Maven IT Plugin :: Optional Mojos .................. SUCCESS [  0.804 s]
[INFO] Maven IT Plugin :: Packaging ....................... SUCCESS [  0.556 s]
[INFO] Maven IT Plugin :: Parameter Implementation ........ SUCCESS [  0.484 s]
[INFO] Maven IT Plugin :: Plugin Dependency ............... SUCCESS [  0.551 s]
[INFO] Maven IT Plugin :: Project ......................... SUCCESS [  0.984 s]
[INFO] Maven IT Plugin :: Project Interpolation ........... SUCCESS [  1.438 s]
[INFO] Maven IT Plugin :: Setter .......................... SUCCESS [  0.705 s]
[INFO] Maven IT Plugin :: Singleton Component ............. SUCCESS [  0.510 s]
[INFO] Maven IT Plugin :: Site ............................ SUCCESS [  2.842 s]
[INFO] Maven IT Plugin :: Toolchain ....................... SUCCESS [  7.253 s]
[INFO] Maven IT Plugin :: Touch ........................... SUCCESS [  1.872 s]
[INFO] Maven IT Plugin :: Uses Properties Plugin .......... SUCCESS [  0.507 s]
[INFO] Maven IT Plugin :: Uses Wagon Plugin ............... SUCCESS [  5.244 s]
[INFO] Maven IT Plugin :: This plugin should contain the mojos needed by all tests. SUCCESS
[  0.466 s]
[INFO] Maven IT Plugin :: Plexus Utils 1.1 ................ SUCCESS [  1.096 s]
[INFO] Maven IT Plugin :: Plexus Utils New ................ SUCCESS [  0.537 s]
[INFO] Maven IT Plugin :: Plexus Component API ............ SUCCESS [  1.752 s]
[INFO] Maven IT Plugin :: Log4J Client .................... SUCCESS [  0.679 s]
[INFO] Maven IT Plugin :: Extension 1 ..................... SUCCESS [  0.424 s]
[INFO] Maven IT Plugin :: Extension 2 ..................... SUCCESS [  0.483 s]
[INFO] Maven IT Plugin :: Plexus Lifecycle ................ SUCCESS [  1.999 s]
[INFO] Maven IT Plugin :: Settings ........................ SUCCESS [  0.613 s]
[INFO] Maven IT Plugin :: mng-5805 extension .............. SUCCESS [  0.441 s]
[INFO] Maven IT Plugin :: mng-5805 plugin ................. SUCCESS [  1.570 s]
[INFO] Maven IT Plugin :: mng-5805 plugin-dep ............. SUCCESS [  0.397 s]
[INFO] Maven IT Toolchain ................................. SUCCESS [  1.166 s]
[INFO] Maven IT Wagon ..................................... SUCCESS [  0.991 s]
[INFO] Maven IT Support Artifacts ......................... SUCCESS [  2.452 s]
[INFO] Maven IT Extension ................................. SUCCESS [  0.592 s]
[INFO] Maven ITs .......................................... FAILURE [47:01 min]
[INFO] ------------------------------------------------------------------------
[INFO] BUILD FAILURE
[INFO] ------------------------------------------------------------------------
[INFO] Total time: 49:40 min
[INFO] Finished at: 2016-01-01T09:19:28-08:00
[INFO] Final Memory: 60M/742M
[INFO] ------------------------------------------------------------------------
[ERROR] Failed to execute goal org.apache.maven.plugins:maven-surefire-plugin:2.18.1:test
(default-test) on project core-it-suite: There are test failures.
[ERROR] 
[ERROR] Please refer to F:\ws\m3-its\core-integration-testing-trunk\core-it-suite\target\surefire-reports
for the individual test results.
[ERROR] -> [Help 1]
org.apache.maven.lifecycle.LifecycleExecutionException: Failed to execute goal org.apache.maven.plugins:maven-surefire-plugin:2.18.1:test
(default-test) on project core-it-suite: There are test failures.

Please refer to F:\ws\m3-its\core-integration-testing-trunk\core-it-suite\target\surefire-reports
for the individual test results.
	at org.apache.maven.lifecycle.internal.MojoExecutor.execute(MojoExecutor.java:212)
	at org.apache.maven.lifecycle.internal.MojoExecutor.execute(MojoExecutor.java:153)
	at org.apache.maven.lifecycle.internal.MojoExecutor.execute(MojoExecutor.java:145)
	at org.apache.maven.lifecycle.internal.LifecycleModuleBuilder.buildProject(LifecycleModuleBuilder.java:116)
	at org.apache.maven.lifecycle.internal.LifecycleModuleBuilder.buildProject(LifecycleModuleBuilder.java:80)
	at org.apache.maven.lifecycle.internal.builder.singlethreaded.SingleThreadedBuilder.build(SingleThreadedBuilder.java:51)
	at org.apache.maven.lifecycle.internal.LifecycleStarter.execute(LifecycleStarter.java:128)
	at org.apache.maven.DefaultMaven.doExecute(DefaultMaven.java:307)
	at org.apache.maven.DefaultMaven.doExecute(DefaultMaven.java:193)
	at org.apache.maven.DefaultMaven.execute(DefaultMaven.java:106)
	at org.apache.maven.cli.MavenCli.execute(MavenCli.java:862)
	at org.apache.maven.cli.MavenCli.doMain(MavenCli.java:286)
	at org.apache.maven.cli.MavenCli.main(MavenCli.java:197)
	at sun.reflect.NativeMethodAccessorImpl.invoke0(Native Method)
	at sun.reflect.NativeMethodAccessorImpl.invoke(NativeMethodAccessorImpl.java:57)
	at sun.reflect.DelegatingMethodAccessorImpl.invoke(DelegatingMethodAccessorImpl.java:43)
	at java.lang.reflect.Method.invoke(Method.java:601)
	at org.codehaus.plexus.classworlds.launcher.Launcher.launchEnhanced(Launcher.java:289)
	at org.codehaus.plexus.classworlds.launcher.Launcher.launch(Launcher.java:229)
	at org.codehaus.plexus.classworlds.launcher.Launcher.mainWithExitCode(Launcher.java:415)
	at org.codehaus.plexus.classworlds.launcher.Launcher.main(Launcher.java:356)
Caused by: org.apache.maven.plugin.MojoFailureException: There are test failures.

Please refer to F:\ws\m3-its\core-integration-testing-trunk\core-it-suite\target\surefire-reports
for the individual test results.
	at org.apache.maven.plugin.surefire.SurefireHelper.reportExecution(SurefireHelper.java:82)
	at org.apache.maven.plugin.surefire.SurefirePlugin.handleSummary(SurefirePlugin.java:254)
	at org.apache.maven.plugin.surefire.AbstractSurefireMojo.executeAfterPreconditionsChecked(AbstractSurefireMojo.java:854)
	at org.apache.maven.plugin.surefire.AbstractSurefireMojo.execute(AbstractSurefireMojo.java:722)
	at org.apache.maven.plugin.DefaultBuildPluginManager.executeMojo(DefaultBuildPluginManager.java:134)
	at org.apache.maven.lifecycle.internal.MojoExecutor.execute(MojoExecutor.java:208)
	... 20 more
[ERROR] 
[ERROR] Re-run Maven using the -X switch to enable full debug logging.
[ERROR] 
[ERROR] For more information about the errors and possible solutions, please read the following
articles:
[ERROR] [Help 1] http://cwiki.apache.org/confluence/display/MAVEN/MojoFailureException
[ERROR] 
[ERROR] After correcting the problems, you can resume the build with the command
[ERROR]   mvn <goals> -rf :core-it-suite
Build step 'Invoke top-level Maven targets' marked build as failure
Recording test results

Mime
View raw message