maven-notifications mailing list archives

Site index · List index
Message view « Date » · « Thread »
Top « Date » · « Thread »
From Apache Jenkins Server <jenk...@builds.apache.org>
Subject Build failed in Jenkins: maven-plugins » Apache Maven Dependency Plugin #4928
Date Sun, 27 Dec 2015 18:32:20 GMT
See <https://builds.apache.org/job/maven-plugins/org.apache.maven.plugins$maven-dependency-plugin/4928/>

------------------------------------------
[INFO]                                                                         
[INFO] ------------------------------------------------------------------------
[INFO] Building Apache Maven Dependency Plugin 3.0-SNAPSHOT
[INFO] ------------------------------------------------------------------------
[INFO] 
[INFO] --- maven-clean-plugin:2.5:clean (default-clean) @ maven-dependency-plugin ---
[INFO] Deleting <https://builds.apache.org/job/maven-plugins/org.apache.maven.plugins$maven-dependency-plugin/ws/target>
[INFO] 
[INFO] --- maven-enforcer-plugin:1.3.1:enforce (enforce-bytecode-version) @ maven-dependency-plugin
---
[INFO] 
[INFO] --- maven-enforcer-plugin:1.3.1:enforce (ban-known-bad-maven-versions) @ maven-dependency-plugin
---
[INFO] 
[INFO] --- maven-enforcer-plugin:1.3.1:enforce (ensure-no-container-api) @ maven-dependency-plugin
---
[INFO] 
[INFO] --- apache-rat-plugin:0.11:check (rat-check) @ maven-dependency-plugin ---
[INFO] 51 implicit excludes (use -debug for more details).
[INFO] Exclude: src/it/projects/tree/expected.txt
[INFO] Exclude: src/it/projects/tree-includes/expected.txt
[INFO] Exclude: src/it/projects/tree-verbose/expected.txt
[INFO] Exclude: DEPENDENCIES
[INFO] 285 resources included (use -debug for more details)
[INFO] Rat check: Summary of files. Unapproved: 0 unknown: 0 generated: 0 approved: 284 licence.
[INFO] 
[INFO] --- maven-plugin-plugin:3.4:helpmojo (generate-helpmojo) @ maven-dependency-plugin
---
[INFO] Using 'UTF-8' encoding to read mojo metadata.
[INFO] Mojo extractor with id: java-annotations found 0 mojo descriptors.
[INFO] Mojo extractor with id: java-javadoc found 0 mojo descriptors.
[INFO] 
[INFO] --- maven-remote-resources-plugin:1.5:process (default) @ maven-dependency-plugin ---
[INFO] 
[INFO] --- maven-resources-plugin:2.7:resources (default-resources) @ maven-dependency-plugin
---
[INFO] Using 'UTF-8' encoding to copy filtered resources.
[INFO] Copying 6 resources
[INFO] Copying 3 resources
[INFO] 
[INFO] --- maven-compiler-plugin:3.2:compile (default-compile) @ maven-dependency-plugin ---
[INFO] Changes detected - recompiling the module!
[INFO] Compiling 48 source files to <https://builds.apache.org/job/maven-plugins/org.apache.maven.plugins$maven-dependency-plugin/ws/target/classes>
[INFO] <https://builds.apache.org/job/maven-plugins/org.apache.maven.plugins$maven-dependency-plugin/ws/src/main/java/org/apache/maven/plugins/dependency/resolvers/ResolvePluginsMojo.java>
uses or overrides a deprecated API.
[INFO] Recompile with -Xlint:deprecation for details.
[INFO] <https://builds.apache.org/job/maven-plugins/org.apache.maven.plugins$maven-dependency-plugin/ws/src/main/java/org/apache/maven/plugins/dependency/tree/TreeMojo.java>
uses unchecked or unsafe operations.
[INFO] Recompile with -Xlint:unchecked for details.
[INFO] -------------------------------------------------------------
[ERROR] COMPILATION ERROR : 
[INFO] -------------------------------------------------------------
[ERROR] <https://builds.apache.org/job/maven-plugins/org.apache.maven.plugins$maven-dependency-plugin/ws/src/main/java/org/apache/maven/plugins/dependency/fromDependencies/AbstractDependencyFilterMojo.java>:[52,51]
package org.apache.maven.shared.artifact.repository does not exist
[ERROR] <https://builds.apache.org/job/maven-plugins/org.apache.maven.plugins$maven-dependency-plugin/ws/src/main/java/org/apache/maven/plugins/dependency/fromDependencies/AbstractDependencyFilterMojo.java>:[72,13]
cannot find symbol
symbol  : class RepositoryManager
location: class org.apache.maven.plugins.dependency.fromDependencies.AbstractDependencyFilterMojo
[ERROR] <https://builds.apache.org/job/maven-plugins/org.apache.maven.plugins$maven-dependency-plugin/ws/src/main/java/org/apache/maven/plugins/dependency/fromDependencies/AbstractDependencyFilterMojo.java>:[527,21]
cannot find symbol
symbol  : class RepositoryManager
location: class org.apache.maven.plugins.dependency.fromDependencies.AbstractDependencyFilterMojo
[ERROR] <https://builds.apache.org/job/maven-plugins/org.apache.maven.plugins$maven-dependency-plugin/ws/src/main/java/org/apache/maven/plugins/dependency/resolvers/ListRepositoriesMojo.java>:[28,48]
package org.apache.maven.shared.artifact.collect does not exist
[ERROR] <https://builds.apache.org/job/maven-plugins/org.apache.maven.plugins$maven-dependency-plugin/ws/src/main/java/org/apache/maven/plugins/dependency/resolvers/ListRepositoriesMojo.java>:[29,48]
package org.apache.maven.shared.artifact.collect does not exist
[ERROR] <https://builds.apache.org/job/maven-plugins/org.apache.maven.plugins$maven-dependency-plugin/ws/src/main/java/org/apache/maven/plugins/dependency/resolvers/ListRepositoriesMojo.java>:[30,48]
package org.apache.maven.shared.artifact.collect does not exist
[ERROR] <https://builds.apache.org/job/maven-plugins/org.apache.maven.plugins$maven-dependency-plugin/ws/src/main/java/org/apache/maven/plugins/dependency/resolvers/ListRepositoriesMojo.java>:[48,13]
cannot find symbol
symbol  : class DependencyCollector
location: class org.apache.maven.plugins.dependency.resolvers.ListRepositoriesMojo
[ERROR] <https://builds.apache.org/job/maven-plugins/org.apache.maven.plugins$maven-dependency-plugin/ws/src/main/java/org/apache/maven/plugins/dependency/fromConfiguration/AbstractFromConfigurationMojo.java>:[39,51]
package org.apache.maven.shared.artifact.repository does not exist
[ERROR] <https://builds.apache.org/job/maven-plugins/org.apache.maven.plugins$maven-dependency-plugin/ws/src/main/java/org/apache/maven/plugins/dependency/fromConfiguration/AbstractFromConfigurationMojo.java>:[109,13]
cannot find symbol
symbol  : class RepositoryManager
location: class org.apache.maven.plugins.dependency.fromConfiguration.AbstractFromConfigurationMojo
[ERROR] <https://builds.apache.org/job/maven-plugins/org.apache.maven.plugins$maven-dependency-plugin/ws/src/main/java/org/apache/maven/plugins/dependency/fromDependencies/BuildClasspathMojo.java>:[32,51]
package org.apache.maven.shared.artifact.repository does not exist
[ERROR] <https://builds.apache.org/job/maven-plugins/org.apache.maven.plugins$maven-dependency-plugin/ws/src/main/java/org/apache/maven/plugins/dependency/fromDependencies/BuildClasspathMojo.java>:[163,13]
cannot find symbol
symbol  : class RepositoryManager
location: class org.apache.maven.plugins.dependency.fromDependencies.BuildClasspathMojo
[ERROR] <https://builds.apache.org/job/maven-plugins/org.apache.maven.plugins$maven-dependency-plugin/ws/src/main/java/org/apache/maven/plugins/dependency/resolvers/ListRepositoriesMojo.java>:[47,24]
cannot find symbol
symbol  : class DependencyCollector
location: class org.apache.maven.plugins.dependency.resolvers.ListRepositoriesMojo
[ERROR] <https://builds.apache.org/job/maven-plugins/org.apache.maven.plugins$maven-dependency-plugin/ws/src/main/java/org/apache/maven/plugins/dependency/fromConfiguration/ArtifactItem.java>:[38,8]
org.apache.maven.plugins.dependency.fromConfiguration.ArtifactItem is not abstract and does
not override abstract method getExtension() in org.apache.maven.shared.artifact.ArtifactCoordinate
[ERROR] <https://builds.apache.org/job/maven-plugins/org.apache.maven.plugins$maven-dependency-plugin/ws/src/main/java/org/apache/maven/plugins/dependency/PurgeLocalRepositoryMojo.java>:[486,60]
cannot find symbol
symbol  : method toArtifactCoordinate(org.apache.maven.project.MavenProject)
location: class org.apache.maven.shared.artifact.TransferUtils
[ERROR] <https://builds.apache.org/job/maven-plugins/org.apache.maven.plugins$maven-dependency-plugin/ws/src/main/java/org/apache/maven/plugins/dependency/fromDependencies/CopyDependenciesMojo.java>:[297,19]
cannot find symbol
symbol  : method setType(java.lang.String)
location: class org.apache.maven.shared.artifact.DefaultArtifactCoordinate
[ERROR] <https://builds.apache.org/job/maven-plugins/org.apache.maven.plugins$maven-dependency-plugin/ws/src/main/java/org/apache/maven/plugins/dependency/resolvers/ListRepositoriesMojo.java>:[61,13]
cannot find symbol
symbol  : class CollectorResult
location: class org.apache.maven.plugins.dependency.resolvers.ListRepositoriesMojo
[ERROR] <https://builds.apache.org/job/maven-plugins/org.apache.maven.plugins$maven-dependency-plugin/ws/src/main/java/org/apache/maven/plugins/dependency/resolvers/ListRepositoriesMojo.java>:[72,17]
cannot find symbol
symbol  : class DependencyCollectorException
location: class org.apache.maven.plugins.dependency.resolvers.ListRepositoriesMojo
[ERROR] <https://builds.apache.org/job/maven-plugins/org.apache.maven.plugins$maven-dependency-plugin/ws/src/main/java/org/apache/maven/plugins/dependency/GetMojo.java>:[169,27]
cannot find symbol
symbol  : method setType(java.lang.String)
location: class org.apache.maven.shared.artifact.DefaultArtifactCoordinate
[ERROR] <https://builds.apache.org/job/maven-plugins/org.apache.maven.plugins$maven-dependency-plugin/ws/src/main/java/org/apache/maven/plugins/dependency/GetMojo.java>:[218,33]
cannot find symbol
symbol  : method resolveDependencies(org.apache.maven.project.ProjectBuildingRequest,org.apache.maven.shared.artifact.DefaultArtifactCoordinate,<nulltype>)
location: interface org.apache.maven.shared.artifact.resolve.ArtifactResolver
[ERROR] <https://builds.apache.org/job/maven-plugins/org.apache.maven.plugins$maven-dependency-plugin/ws/src/main/java/org/apache/maven/plugins/dependency/GetMojo.java>:[300,22]
cannot find symbol
symbol  : method setType(java.lang.String)
location: class org.apache.maven.shared.artifact.DefaultArtifactCoordinate
[ERROR] <https://builds.apache.org/job/maven-plugins/org.apache.maven.plugins$maven-dependency-plugin/ws/src/main/java/org/apache/maven/plugins/dependency/resolvers/AbstractResolveMojo.java>:[162,34]
cannot find symbol
symbol  : method resolveDependencies(org.apache.maven.project.ProjectBuildingRequest,org.apache.maven.shared.artifact.ArtifactCoordinate,<nulltype>)
location: interface org.apache.maven.shared.artifact.resolve.ArtifactResolver
[ERROR] <https://builds.apache.org/job/maven-plugins/org.apache.maven.plugins$maven-dependency-plugin/ws/src/main/java/org/apache/maven/plugins/dependency/utils/translators/ClassifierTypeTranslator.java>:[97,23]
cannot find symbol
symbol  : method setType(java.lang.String)
location: class org.apache.maven.shared.artifact.DefaultArtifactCoordinate
[INFO] 22 errors 
[INFO] -------------------------------------------------------------

Mime
View raw message