maven-notifications mailing list archives

Site index · List index
Message view « Date » · « Thread »
Top « Date » · « Thread »
From Apache Jenkins Server <jenk...@builds.apache.org>
Subject Build failed in Jenkins: core-it-maven-3-win #1065
Date Sun, 20 Dec 2015 22:13:58 GMT
See <https://builds.apache.org/job/core-it-maven-3-win/1065/changes>

Changes:

[schulte] [MNG-5359] Declared execution in PluginMgmt gets bound to lifecycle

[schulte] [MNG-5359] Declared execution in PluginMgmt gets bound to lifecycle

------------------------------------------
[...truncated 10386 lines...]
0041ArtifactTypeFromPluginExtension(it0041).................OK (3.3 s)
0040PackagingFromPluginExtension(it0040)....................OK (2.4 s)
0039ReleasePomInReactor(it0039).............................SKIPPED - Maven version 3.4.0-SNAPSHOT
not in range [2.0,3.0-alpha-1)
0038AlternatePomFileDifferentDir(it0038)....................OK (2.4 s)
0037AlternatePomFileSameDir(it0037).........................OK (2.3 s)
0036ReleasePom(it0036)......................................SKIPPED - Maven version 3.4.0-SNAPSHOT
not in range (2.0,3.0-alpha-1)
0032MavenPrerequisite(it0032)...............................OK (2.1 s)
0030DepPomDepMngtInheritance(it0030)........................OK (6.1 s)
0025MultipleExecutionLevelConfigs(it0025)...................OK (2.4 s)
0024MultipleGoalExecutions(it0024)..........................OK (2.4 s)
0023SettingsProfile(it0023).................................OK (2.5 s)
0021PomProfile(it0021)......................................OK (2.7 s)
0019PluginVersionMngtBySuperPom(it0019).....................OK (2.7 s)
0018DependencyManagement(it0018)............................OK (2.6 s)
0012PomInterpolation(it0012)................................OK (2.4 s)
0011DefaultVersionByDependencyManagement(it0011)............OK (2.6 s)
0010DependencyClosureResolution(it0010).....................OK (2.6 s)
0009GoalConfiguration(it0009)...............................OK (2.5 s)
0008SimplePlugin(it0008)....................................OK (2.8 s)
Tests run: 772, Failures: 1, Errors: 2, Skipped: 0, Time elapsed: 2,438.65 sec <<<
FAILURE! - in org.apache.maven.it.IntegrationTestSuite
testit(org.apache.maven.it.MavenITmng5359CleanPluginExecutionDeclarationInPluginMgmtTest)
 Time elapsed: 2.282 sec  <<< ERROR!
org.apache.maven.it.VerificationException: Exit code was non-zero: 1; command line and log
= 
<https://builds.apache.org/job/core-it-maven-3-win/ws/apache-maven-3-SNAPSHOT\bin\mvn>
--global-settings F:\ws\m3-its\core-integration-testing-trunk\core-it-suite\target\test-classes\settings.xml
-e --batch-mode -Dmaven.repo.local=<https://builds.apache.org/job/core-it-maven-3-win/ws/it-local-repo>
install
[INFO] Error stacktraces are turned on.
[INFO] Scanning for projects...
[INFO]                                                                         
[INFO] ------------------------------------------------------------------------
[INFO] Building Maven Integration Test :: MNG-5359 0.1-SNAPSHOT
[INFO] ------------------------------------------------------------------------
[INFO] Downloading: file:target/null/org/apache/maven/plugins/maven-compiler-plugin/2.5.1/maven-compiler-plugin-2.5.1.pom
[WARNING] The POM for org.apache.maven.plugins:maven-compiler-plugin:jar:2.5.1 is missing,
no dependency information available
[INFO] Downloading: file:target/null/org/apache/maven/plugins/maven-compiler-plugin/2.5.1/maven-compiler-plugin-2.5.1.jar
[INFO] ------------------------------------------------------------------------
[INFO] BUILD FAILURE
[INFO] ------------------------------------------------------------------------
[INFO] Total time: 0.278 s
[INFO] Finished at: 2015-12-20T21:33:42+00:00
[INFO] Final Memory: 16M/736M
[INFO] ------------------------------------------------------------------------
[ERROR] Plugin org.apache.maven.plugins:maven-compiler-plugin:2.5.1 or one of its dependencies
could not be resolved: Could not find artifact org.apache.maven.plugins:maven-compiler-plugin:jar:2.5.1
in central (file:target/null) -> [Help 1]
org.apache.maven.plugin.PluginResolutionException: Plugin org.apache.maven.plugins:maven-compiler-plugin:2.5.1
or one of its dependencies could not be resolved: Could not find artifact org.apache.maven.plugins:maven-compiler-plugin:jar:2.5.1
in central (file:target/null)
	at org.apache.maven.plugin.internal.DefaultPluginDependenciesResolver.resolve(DefaultPluginDependenciesResolver.java:128)
	at org.apache.maven.plugin.internal.DefaultMavenPluginManager.getPluginDescriptor(DefaultMavenPluginManager.java:179)
	at org.apache.maven.plugin.internal.DefaultMavenPluginManager.getMojoDescriptor(DefaultMavenPluginManager.java:284)
	at org.apache.maven.plugin.DefaultBuildPluginManager.getMojoDescriptor(DefaultBuildPluginManager.java:241)
	at org.apache.maven.lifecycle.internal.DefaultLifecycleExecutionPlanCalculator.setupMojoExecution(DefaultLifecycleExecutionPlanCalculator.java:169)
	at org.apache.maven.lifecycle.internal.DefaultLifecycleExecutionPlanCalculator.setupMojoExecutions(DefaultLifecycleExecutionPlanCalculator.java:155)
	at org.apache.maven.lifecycle.internal.DefaultLifecycleExecutionPlanCalculator.calculateExecutionPlan(DefaultLifecycleExecutionPlanCalculator.java:131)
	at org.apache.maven.lifecycle.internal.DefaultLifecycleExecutionPlanCalculator.calculateExecutionPlan(DefaultLifecycleExecutionPlanCalculator.java:145)
	at org.apache.maven.lifecycle.internal.builder.BuilderCommon.resolveBuildPlan(BuilderCommon.java:96)
	at org.apache.maven.lifecycle.internal.LifecycleModuleBuilder.buildProject(LifecycleModuleBuilder.java:109)
	at org.apache.maven.lifecycle.internal.LifecycleModuleBuilder.buildProject(LifecycleModuleBuilder.java:80)
	at org.apache.maven.lifecycle.internal.builder.singlethreaded.SingleThreadedBuilder.build(SingleThreadedBuilder.java:51)
	at org.apache.maven.lifecycle.internal.LifecycleStarter.execute(LifecycleStarter.java:128)
	at org.apache.maven.DefaultMaven.doExecute(DefaultMaven.java:307)
	at org.apache.maven.DefaultMaven.doExecute(DefaultMaven.java:193)
	at org.apache.maven.DefaultMaven.execute(DefaultMaven.java:106)
	at org.apache.maven.cli.MavenCli.execute(MavenCli.java:865)
	at org.apache.maven.cli.MavenCli.doMain(MavenCli.java:288)
	at org.apache.maven.cli.MavenCli.main(MavenCli.java:199)
	at sun.reflect.NativeMethodAccessorImpl.invoke0(Native Method)
	at sun.reflect.NativeMethodAccessorImpl.invoke(NativeMethodAccessorImpl.java:57)
	at sun.reflect.DelegatingMethodAccessorImpl.invoke(DelegatingMethodAccessorImpl.java:43)
	at java.lang.reflect.Method.invoke(Method.java:601)
	at org.codehaus.plexus.classworlds.launcher.Launcher.launchEnhanced(Launcher.java:289)
	at org.codehaus.plexus.classworlds.launcher.Launcher.launch(Launcher.java:229)
	at org.codehaus.plexus.classworlds.launcher.Launcher.mainWithExitCode(Launcher.java:415)
	at org.codehaus.plexus.classworlds.launcher.Launcher.main(Launcher.java:356)
Caused by: org.eclipse.aether.resolution.ArtifactResolutionException: Could not find artifact
org.apache.maven.plugins:maven-compiler-plugin:jar:2.5.1 in central (file:target/null)
	at org.eclipse.aether.internal.impl.DefaultArtifactResolver.resolve(DefaultArtifactResolver.java:444)
	at org.eclipse.aether.internal.impl.DefaultArtifactResolver.resolveArtifacts(DefaultArtifactResolver.java:246)
	at org.eclipse.aether.internal.impl.DefaultArtifactResolver.resolveArtifact(DefaultArtifactResolver.java:223)
	at org.eclipse.aether.internal.impl.DefaultRepositorySystem.resolveArtifact(DefaultRepositorySystem.java:294)
	at org.apache.maven.plugin.internal.DefaultPluginDependenciesResolver.resolve(DefaultPluginDependenciesResolver.java:124)
	... 26 more
Caused by: org.eclipse.aether.transfer.ArtifactNotFoundException: Could not find artifact
org.apache.maven.plugins:maven-compiler-plugin:jar:2.5.1 in central (file:target/null)
	at org.eclipse.aether.connector.basic.ArtifactTransportListener.transferFailed(ArtifactTransportListener.java:39)
	at org.eclipse.aether.connector.basic.BasicRepositoryConnector$TaskRunner.run(BasicRepositoryConnector.java:355)
	at org.eclipse.aether.util.concurrency.RunnableErrorForwarder$1.run(RunnableErrorForwarder.java:67)
	at org.eclipse.aether.connector.basic.BasicRepositoryConnector$DirectExecutor.execute(BasicRepositoryConnector.java:581)
	at org.eclipse.aether.connector.basic.BasicRepositoryConnector.get(BasicRepositoryConnector.java:249)
	at org.eclipse.aether.internal.impl.DefaultArtifactResolver.performDownloads(DefaultArtifactResolver.java:520)
	at org.eclipse.aether.internal.impl.DefaultArtifactResolver.resolve(DefaultArtifactResolver.java:421)
	... 30 more
[ERROR] 
[ERROR] Re-run Maven using the -X switch to enable full debug logging.
[ERROR] 
[ERROR] For more information about the errors and possible solutions, please read the following
articles:
[ERROR] [Help 1] http://cwiki.apache.org/confluence/display/MAVEN/PluginResolutionException

	at org.apache.maven.it.Verifier.executeGoals(Verifier.java:1369)
	at org.apache.maven.it.Verifier.executeGoal(Verifier.java:1254)
	at org.apache.maven.it.Verifier.executeGoal(Verifier.java:1248)
	at org.apache.maven.it.MavenITmng5359CleanPluginExecutionDeclarationInPluginMgmtTest.testit(MavenITmng5359CleanPluginExecutionDeclarationInPluginMgmtTest.java:52)

testCustomLifecycle(org.apache.maven.it.MavenITmng5581LifecycleMappingDelegate)  Time elapsed:
10.995 sec  <<< ERROR!
org.apache.maven.it.VerificationException: Text not found in log: maven-surefire-plugin
	at org.apache.maven.it.Verifier.verifyTextInLog(Verifier.java:325)
	at org.apache.maven.it.MavenITmng5581LifecycleMappingDelegate.testCustomLifecycle(MavenITmng5581LifecycleMappingDelegate.java:68)

testit(org.apache.maven.it.MavenITmng1144MultipleDefaultGoalsTest)  Time elapsed: 2.144 sec
 <<< FAILURE!
junit.framework.AssertionFailedError: Expected file was not found: F:\ws\m3-its\core-integration-testing-trunk\core-it-suite\target\test-classes\mng-1144\target\clean-clean.txt
	at junit.framework.Assert.fail(Assert.java:47)
	at org.apache.maven.it.Verifier.assertFilePresent(Verifier.java:1033)
	at org.apache.maven.it.MavenITmng1144MultipleDefaultGoalsTest.testit(MavenITmng1144MultipleDefaultGoalsTest.java:57)


Results :

Failed tests: 
  MavenITmng1144MultipleDefaultGoalsTest>AbstractMavenIntegrationTestCase.runTest:219->testit:57
Expected file was not found: F:\ws\m3-its\core-integration-testing-trunk\core-it-suite\target\test-classes\mng-1144\target\clean-clean.txt
Tests in error: 
  MavenITmng5359CleanPluginExecutionDeclarationInPluginMgmtTest>AbstractMavenIntegrationTestCase.runTest:219->testit:52
» Verification
  MavenITmng5581LifecycleMappingDelegate>AbstractMavenIntegrationTestCase.runTest:219->testCustomLifecycle:68
» Verification

Tests run: 772, Failures: 1, Errors: 2, Skipped: 0

[INFO] ------------------------------------------------------------------------
[INFO] Reactor Summary:
[INFO] 
[INFO] Maven Core ITs ..................................... SUCCESS [ 41.307 s]
[INFO] Maven IT Support ................................... SUCCESS [  1.192 s]
[INFO] Maven IT :: Plugins ................................ SUCCESS [  0.958 s]
[INFO] Maven IT Plugin :: Active Collection ............... SUCCESS [  9.555 s]
[INFO] Maven IT Plugin :: Ant-Based ....................... SUCCESS [  5.522 s]
[INFO] Maven IT Plugin :: Artifact ........................ SUCCESS [  1.936 s]
[INFO] Maven IT Plugin :: Class Loader :: Dependency A .... SUCCESS [  0.613 s]
[INFO] Maven IT Plugin :: Class Loader :: Dependency B .... SUCCESS [  0.640 s]
[INFO] Maven IT Plugin :: Class Loader :: Dependency C .... SUCCESS [  0.589 s]
[INFO] Maven IT Plugin :: Class Loader .................... SUCCESS [  2.192 s]
[INFO] Maven IT Plugin :: Class Loader :: Aggregator ...... SUCCESS [  0.583 s]
[INFO] Maven IT Plugin :: Configuration ................... SUCCESS [  1.052 s]
[INFO] Maven IT Plugin :: Context Passing ................. SUCCESS [  0.622 s]
[INFO] Maven ITs :: Core Plugin Stubs ..................... SUCCESS [  0.527 s]
[INFO] Maven IT Clean Plugin Stub ......................... SUCCESS [  0.838 s]
[INFO] Maven IT Compiler Plugin Stub ...................... SUCCESS [  0.821 s]
[INFO] Maven IT Deploy Plugin Stub ........................ SUCCESS [  0.770 s]
[INFO] Maven IT EAR Plugin Stub ........................... SUCCESS [  0.721 s]
[INFO] Maven IT EJB Plugin Stub ........................... SUCCESS [  0.705 s]
[INFO] Maven IT Install Plugin Stub ....................... SUCCESS [  0.678 s]
[INFO] Maven IT JAR Plugin Stub ........................... SUCCESS [  0.713 s]
[INFO] Maven IT Javadoc Plugin Stub ....................... SUCCESS [  0.742 s]
[INFO] Maven IT Plugin Plugin Stub ........................ SUCCESS [  0.793 s]
[INFO] Maven IT RAR Plugin Stub ........................... SUCCESS [  0.704 s]
[INFO] Maven IT Resources Plugin Stub ..................... SUCCESS [  0.717 s]
[INFO] Maven IT Site Plugin Stub .......................... SUCCESS [  0.937 s]
[INFO] Maven IT Source Plugin Stub ........................ SUCCESS [  0.709 s]
[INFO] Maven IT Surefire Plugin Stub ...................... SUCCESS [  0.670 s]
[INFO] Maven IT WAR Plugin Stub ........................... SUCCESS [  0.735 s]
[INFO] Maven IT Plugin :: Dependency Collection ........... SUCCESS [  0.838 s]
[INFO] Maven IT Plugin :: Dependency Resolution ........... SUCCESS [  6.590 s]
[INFO] Maven IT Plugin :: Expression ...................... SUCCESS [  1.233 s]
[INFO] Maven IT Plugin :: Error Mojos ..................... SUCCESS [  2.538 s]
[INFO] Maven IT Component ................................. SUCCESS [  0.654 s]
[INFO] Maven IT Plugin :: Extension Consumer .............. SUCCESS [  0.599 s]
[INFO] Maven IT Plugin :: Extension Provider .............. SUCCESS [  0.588 s]
[INFO] Maven IT Plugin :: Fork ............................ SUCCESS [  0.764 s]
[INFO] Maven IT Plugin :: Invalid Descriptor .............. SUCCESS [  0.602 s]
[INFO] Maven IT Plugin :: Log File ........................ SUCCESS [  0.594 s]
[INFO] Maven IT Helper Library ............................ SUCCESS [  1.781 s]
[INFO] Maven IT Plugin :: Model Interpolation ............. SUCCESS [  1.421 s]
[INFO] Maven IT Plugin :: No Default Component ............ SUCCESS [  0.603 s]
[INFO] Maven IT Plugin :: No Project ...................... SUCCESS [  0.541 s]
[INFO] Maven IT Plugin :: Online .......................... SUCCESS [  0.584 s]
[INFO] Maven IT Plugin :: Optional Mojos .................. SUCCESS [  0.666 s]
[INFO] Maven IT Plugin :: Packaging ....................... SUCCESS [  0.589 s]
[INFO] Maven IT Plugin :: Parameter Implementation ........ SUCCESS [  0.578 s]
[INFO] Maven IT Plugin :: Plugin Dependency ............... SUCCESS [  0.635 s]
[INFO] Maven IT Plugin :: Project ......................... SUCCESS [  0.836 s]
[INFO] Maven IT Plugin :: Project Interpolation ........... SUCCESS [  0.947 s]
[INFO] Maven IT Plugin :: Setter .......................... SUCCESS [  0.560 s]
[INFO] Maven IT Plugin :: Singleton Component ............. SUCCESS [  0.748 s]
[INFO] Maven IT Plugin :: Site ............................ SUCCESS [  2.370 s]
[INFO] Maven IT Plugin :: Toolchain ....................... SUCCESS [  5.482 s]
[INFO] Maven IT Plugin :: Touch ........................... SUCCESS [  0.988 s]
[INFO] Maven IT Plugin :: Uses Properties Plugin .......... SUCCESS [  0.532 s]
[INFO] Maven IT Plugin :: Uses Wagon Plugin ............... SUCCESS [  2.207 s]
[INFO] Maven IT Plugin :: This plugin should contain the mojos needed by all tests. SUCCESS
[  0.628 s]
[INFO] Maven IT Plugin :: Plexus Utils 1.1 ................ SUCCESS [  0.762 s]
[INFO] Maven IT Plugin :: Plexus Utils New ................ SUCCESS [  1.072 s]
[INFO] Maven IT Plugin :: Plexus Component API ............ SUCCESS [  1.470 s]
[INFO] Maven IT Plugin :: Log4J Client .................... SUCCESS [  0.836 s]
[INFO] Maven IT Plugin :: Extension 1 ..................... SUCCESS [  0.517 s]
[INFO] Maven IT Plugin :: Extension 2 ..................... SUCCESS [  0.538 s]
[INFO] Maven IT Plugin :: Plexus Lifecycle ................ SUCCESS [  1.554 s]
[INFO] Maven IT Plugin :: Settings ........................ SUCCESS [  0.653 s]
[INFO] Maven IT Plugin :: mng-5805 extension .............. SUCCESS [  0.488 s]
[INFO] Maven IT Plugin :: mng-5805 plugin ................. SUCCESS [  0.689 s]
[INFO] Maven IT Plugin :: mng-5805 plugin-dep ............. SUCCESS [  0.508 s]
[INFO] Maven IT Toolchain ................................. SUCCESS [  0.979 s]
[INFO] Maven IT Wagon ..................................... SUCCESS [  0.664 s]
[INFO] Maven IT Support Artifacts ......................... SUCCESS [  2.023 s]
[INFO] Maven IT Extension ................................. SUCCESS [  0.494 s]
[INFO] Maven ITs .......................................... FAILURE [41:15 min]
[INFO] ------------------------------------------------------------------------
[INFO] BUILD FAILURE
[INFO] ------------------------------------------------------------------------
[INFO] Total time: 43:30 min
[INFO] Finished at: 2015-12-20T22:13:51+00:00
[INFO] Final Memory: 59M/765M
[INFO] ------------------------------------------------------------------------
[ERROR] Failed to execute goal org.apache.maven.plugins:maven-surefire-plugin:2.18.1:test
(default-test) on project core-it-suite: There are test failures.
[ERROR] 
[ERROR] Please refer to F:\ws\m3-its\core-integration-testing-trunk\core-it-suite\target\surefire-reports
for the individual test results.
[ERROR] -> [Help 1]
org.apache.maven.lifecycle.LifecycleExecutionException: Failed to execute goal org.apache.maven.plugins:maven-surefire-plugin:2.18.1:test
(default-test) on project core-it-suite: There are test failures.

Please refer to F:\ws\m3-its\core-integration-testing-trunk\core-it-suite\target\surefire-reports
for the individual test results.
	at org.apache.maven.lifecycle.internal.MojoExecutor.execute(MojoExecutor.java:212)
	at org.apache.maven.lifecycle.internal.MojoExecutor.execute(MojoExecutor.java:153)
	at org.apache.maven.lifecycle.internal.MojoExecutor.execute(MojoExecutor.java:145)
	at org.apache.maven.lifecycle.internal.LifecycleModuleBuilder.buildProject(LifecycleModuleBuilder.java:116)
	at org.apache.maven.lifecycle.internal.LifecycleModuleBuilder.buildProject(LifecycleModuleBuilder.java:80)
	at org.apache.maven.lifecycle.internal.builder.singlethreaded.SingleThreadedBuilder.build(SingleThreadedBuilder.java:51)
	at org.apache.maven.lifecycle.internal.LifecycleStarter.execute(LifecycleStarter.java:128)
	at org.apache.maven.DefaultMaven.doExecute(DefaultMaven.java:307)
	at org.apache.maven.DefaultMaven.doExecute(DefaultMaven.java:193)
	at org.apache.maven.DefaultMaven.execute(DefaultMaven.java:106)
	at org.apache.maven.cli.MavenCli.execute(MavenCli.java:862)
	at org.apache.maven.cli.MavenCli.doMain(MavenCli.java:286)
	at org.apache.maven.cli.MavenCli.main(MavenCli.java:197)
	at sun.reflect.NativeMethodAccessorImpl.invoke0(Native Method)
	at sun.reflect.NativeMethodAccessorImpl.invoke(NativeMethodAccessorImpl.java:57)
	at sun.reflect.DelegatingMethodAccessorImpl.invoke(DelegatingMethodAccessorImpl.java:43)
	at java.lang.reflect.Method.invoke(Method.java:601)
	at org.codehaus.plexus.classworlds.launcher.Launcher.launchEnhanced(Launcher.java:289)
	at org.codehaus.plexus.classworlds.launcher.Launcher.launch(Launcher.java:229)
	at org.codehaus.plexus.classworlds.launcher.Launcher.mainWithExitCode(Launcher.java:415)
	at org.codehaus.plexus.classworlds.launcher.Launcher.main(Launcher.java:356)
Caused by: org.apache.maven.plugin.MojoFailureException: There are test failures.

Please refer to F:\ws\m3-its\core-integration-testing-trunk\core-it-suite\target\surefire-reports
for the individual test results.
	at org.apache.maven.plugin.surefire.SurefireHelper.reportExecution(SurefireHelper.java:82)
	at org.apache.maven.plugin.surefire.SurefirePlugin.handleSummary(SurefirePlugin.java:254)
	at org.apache.maven.plugin.surefire.AbstractSurefireMojo.executeAfterPreconditionsChecked(AbstractSurefireMojo.java:854)
	at org.apache.maven.plugin.surefire.AbstractSurefireMojo.execute(AbstractSurefireMojo.java:722)
	at org.apache.maven.plugin.DefaultBuildPluginManager.executeMojo(DefaultBuildPluginManager.java:134)
	at org.apache.maven.lifecycle.internal.MojoExecutor.execute(MojoExecutor.java:208)
	... 20 more
[ERROR] 
[ERROR] Re-run Maven using the -X switch to enable full debug logging.
[ERROR] 
[ERROR] For more information about the errors and possible solutions, please read the following
articles:
[ERROR] [Help 1] http://cwiki.apache.org/confluence/display/MAVEN/MojoFailureException
[ERROR] 
[ERROR] After correcting the problems, you can resume the build with the command
[ERROR]   mvn <goals> -rf :core-it-suite
Build step 'Invoke top-level Maven targets' marked build as failure
Recording test results

Mime
View raw message