maven-notifications mailing list archives

Site index · List index
Message view « Date » · « Thread »
Top « Date » · « Thread »
From gmcdon...@apache.org
Subject Build failed in Jenkins: maven-archetype #74
Date Wed, 09 Dec 2015 09:17:44 GMT
See <https://analysis.apache.org/jenkins/job/maven-archetype/74/>

------------------------------------------
[...truncated 1000 lines...]
[INFO] Exclude: archetype-samples/**
[INFO] Exclude: **/*.sha1
[INFO] Exclude: src/main/resources/org/apache/maven/archetype/creator/*
[INFO] Exclude: **/Format.java
[INFO] Exclude: **/NamespaceStack.java
[INFO] Exclude: **/XMLOutputter.java
[INFO] Exclude: src/test/**
[INFO] Exclude: src/it/**
[INFO] Exclude: .repository/**
[INFO] Exclude: .java-version
[INFO] Exclude: DEPENDENCIES
[INFO] 49 resources included (use -debug for more details)
[INFO] Rat check: Summary of files. Unapproved: 0 unknown: 0 generated: 0 approved: 47 licence.
[INFO] 
[INFO] --- maven-install-plugin:2.5.2:install (default-install) @ maven-archetype-plugin ---
[INFO] Installing <https://analysis.apache.org/jenkins/job/maven-archetype/ws/maven-archetype-plugin/target/maven-archetype-plugin-2.5-SNAPSHOT.jar>
to /x1/jenkins/mvn-repo/org/apache/maven/plugins/maven-archetype-plugin/2.5-SNAPSHOT/maven-archetype-plugin-2.5-SNAPSHOT.jar
[INFO] Installing <https://analysis.apache.org/jenkins/job/maven-archetype/ws/maven-archetype-plugin/pom.xml>
to /x1/jenkins/mvn-repo/org/apache/maven/plugins/maven-archetype-plugin/2.5-SNAPSHOT/maven-archetype-plugin-2.5-SNAPSHOT.pom
[JENKINS] Archiving disabled
[JENKINS] Archiving disabled
[JENKINS] Archiving disabled
[JENKINS] Archiving disabled
[JENKINS] Archiving disabled
[JENKINS] Archiving disabled
[JENKINS] Archiving disabled
[JENKINS] Archiving disabled
[JENKINS] Archiving disabled
[JENKINS] Archiving disabled
[JENKINS] Archiving disabled
[JENKINS] Archiving disabled[INFO] ------------------------------------------------------------------------
[INFO] Reactor Summary:
[INFO] 
[INFO] Maven Archetype .................................... SUCCESS [ 18.557 s]

[INFO] Maven Archetype Testing ............................ SUCCESS [  1.736 s]
[INFO] Maven Archetype Webapp Proxy ....................... SUCCESS [  7.519 s]
[INFO] Maven Archetype Webapp Repository .................. SUCCESS [  7.223 s]
[INFO] Maven Archetype Models ............................. SUCCESS [  1.643 s]
[INFO] Maven Archetype Catalog Model ...................... SUCCESS [  3.046 s]
[INFO] Maven Archetype Descriptor Model ................... SUCCESS [  9.656 s]
[INFO] Maven Archetype Registry Model ..................... SUCCESS [  8.947 s]
[INFO] Maven Archetype Common ............................. SUCCESS [ 35.365 s]
[INFO] Maven Archetype Packaging .......................... SUCCESS [  3.605 s]
[INFO] Maven Archetype Plugin ............................. SUCCESS [ 35.181 s]
[INFO] ------------------------------------------------------------------------
[INFO] BUILD SUCCESS
[INFO] ------------------------------------------------------------------------
[INFO] Total time: 01:55 min (Wall Clock)
[INFO] Finished at: 2015-12-09T09:17:16+00:00
[INFO] Final Memory: 37M/323M
[INFO] ------------------------------------------------------------------------
[WARNING] The requested profile "apache.snapshots" could not be activated because it does
not exist.
Sending e-mails to: notifications@maven.apache.org
channel stopped
[workspace] $ /x1/jenkins/jenkins-master/jenkins-home/tools/hudson.tasks.Maven_MavenInstallation/maven-3.2.2/bin/mvn
-f <https://analysis.apache.org/jenkins/job/maven-archetype/ws/pom.xml> -e -B org.codehaus.mojo:sonar-maven-plugin:2.6:sonar
-Dsonar.jdbc.url=jdbc:mysql://192.168.0.64:3306/sonar?useUnicode=true&amp;characterEncoding=utf8
******** ******** -Dsonar.host.url=http://localhost:9090 ******** ********
[INFO] Error stacktraces are turned on.
[INFO] Scanning for projects...
[INFO] ------------------------------------------------------------------------
[INFO] Reactor Build Order:
[INFO] 
[INFO] Maven Archetype
[INFO] Maven Archetype Testing
[INFO] Maven Archetype Webapp Proxy
[INFO] Maven Archetype Webapp Repository
[INFO] Maven Archetype Models
[INFO] Maven Archetype Catalog Model
[INFO] Maven Archetype Descriptor Model
[INFO] Maven Archetype Registry Model
[INFO] Maven Archetype Common
[INFO] Maven Archetype Packaging
[INFO] Maven Archetype Plugin
[INFO]                                                                         
[INFO] ------------------------------------------------------------------------
[INFO] Building Maven Archetype 2.5-SNAPSHOT
[INFO] ------------------------------------------------------------------------
[INFO] 
[INFO] --- sonar-maven-plugin:2.6:sonar (default-cli) @ maven-archetype ---
[INFO] SonarQube version: 5.1
INFO: Default locale: "en_US", source code encoding: "UTF-8"
INFO: Work directory: <https://analysis.apache.org/jenkins/job/maven-archetype/ws/target/sonar>
INFO: SonarQube Server 5.1
[INFO] ------------------------------------------------------------------------
[INFO] Reactor Summary:
[INFO] 
[INFO] Maven Archetype .................................... FAILURE [ 12.611 s]
[INFO] Maven Archetype Testing ............................ SKIPPED
[INFO] Maven Archetype Webapp Proxy ....................... SKIPPED
[INFO] Maven Archetype Webapp Repository .................. SKIPPED
[INFO] Maven Archetype Models ............................. SKIPPED
[INFO] Maven Archetype Catalog Model ...................... SKIPPED
[INFO] Maven Archetype Descriptor Model ................... SKIPPED
[INFO] Maven Archetype Registry Model ..................... SKIPPED
[INFO] Maven Archetype Common ............................. SKIPPED
[INFO] Maven Archetype Packaging .......................... SKIPPED
[INFO] Maven Archetype Plugin ............................. SKIPPED
[INFO] ------------------------------------------------------------------------
[INFO] BUILD FAILURE
[INFO] ------------------------------------------------------------------------
[INFO] Total time: 13.668 s
[INFO] Finished at: 2015-12-09T09:17:43+00:00
[INFO] Final Memory: 13M/309M
[INFO] ------------------------------------------------------------------------
[ERROR] Failed to execute goal org.codehaus.mojo:sonar-maven-plugin:2.6:sonar (default-cli)
on project maven-archetype: Execution default-cli of goal org.codehaus.mojo:sonar-maven-plugin:2.6:sonar
failed: An API incompatibility was encountered while executing org.codehaus.mojo:sonar-maven-plugin:2.6:sonar:
java.lang.UnsupportedClassVersionError: org/sonar/api/utils/SonarException : Unsupported major.minor
version 51.0
[ERROR] -----------------------------------------------------
[ERROR] realm =    plugin>org.codehaus.mojo:sonar-maven-plugin:2.6
[ERROR] strategy = org.codehaus.plexus.classworlds.strategy.SelfFirstStrategy
[ERROR] urls[0] = file:/x1/jenkins/mvn-repo/org/codehaus/mojo/sonar-maven-plugin/2.6/sonar-maven-plugin-2.6.jar
[ERROR] urls[1] = file:/x1/jenkins/mvn-repo/org/apache/maven/shared/maven-dependency-tree/2.1/maven-dependency-tree-2.1.jar
[ERROR] urls[2] = file:/x1/jenkins/mvn-repo/backport-util-concurrent/backport-util-concurrent/3.1/backport-util-concurrent-3.1.jar
[ERROR] urls[3] = file:/x1/jenkins/mvn-repo/org/codehaus/plexus/plexus-interpolation/1.11/plexus-interpolation-1.11.jar
[ERROR] urls[4] = file:/x1/jenkins/mvn-repo/org/codehaus/plexus/plexus-component-annotations/1.5.5/plexus-component-annotations-1.5.5.jar
[ERROR] urls[5] = file:/x1/jenkins/mvn-repo/org/eclipse/aether/aether-util/0.9.0.M2/aether-util-0.9.0.M2.jar
[ERROR] urls[6] = file:/x1/jenkins/mvn-repo/org/sonatype/plexus/plexus-sec-dispatcher/1.4/plexus-sec-dispatcher-1.4.jar
[ERROR] urls[7] = file:/x1/jenkins/mvn-repo/org/codehaus/plexus/plexus-utils/1.5.5/plexus-utils-1.5.5.jar
[ERROR] urls[8] = file:/x1/jenkins/mvn-repo/org/sonatype/plexus/plexus-cipher/1.4/plexus-cipher-1.4.jar
[ERROR] urls[9] = file:/x1/jenkins/mvn-repo/org/codehaus/sonar/runner/sonar-runner-api/2.4/sonar-runner-api-2.4.jar
[ERROR] urls[10] = file:/x1/jenkins/mvn-repo/commons-lang/commons-lang/2.6/commons-lang-2.6.jar
[ERROR] urls[11] = file:/x1/jenkins/mvn-repo/com/google/guava/guava/10.0.1/guava-10.0.1.jar
[ERROR] urls[12] = file:/x1/jenkins/mvn-repo/com/google/code/findbugs/jsr305/2.0.3/jsr305-2.0.3.jar
[ERROR] Number of foreign imports: 1
[ERROR] import: Entry[import  from realm ClassRealm[maven.api, parent: null]]
[ERROR] 
[ERROR] -----------------------------------------------------
[ERROR] -> [Help 1]
org.apache.maven.lifecycle.LifecycleExecutionException: Failed to execute goal org.codehaus.mojo:sonar-maven-plugin:2.6:sonar
(default-cli) on project maven-archetype: Execution default-cli of goal org.codehaus.mojo:sonar-maven-plugin:2.6:sonar
failed: An API incompatibility was encountered while executing org.codehaus.mojo:sonar-maven-plugin:2.6:sonar:
java.lang.UnsupportedClassVersionError: org/sonar/api/utils/SonarException : Unsupported major.minor
version 51.0
-----------------------------------------------------
realm =    plugin>org.codehaus.mojo:sonar-maven-plugin:2.6
strategy = org.codehaus.plexus.classworlds.strategy.SelfFirstStrategy
urls[0] = file:/x1/jenkins/mvn-repo/org/codehaus/mojo/sonar-maven-plugin/2.6/sonar-maven-plugin-2.6.jar
urls[1] = file:/x1/jenkins/mvn-repo/org/apache/maven/shared/maven-dependency-tree/2.1/maven-dependency-tree-2.1.jar
urls[2] = file:/x1/jenkins/mvn-repo/backport-util-concurrent/backport-util-concurrent/3.1/backport-util-concurrent-3.1.jar
urls[3] = file:/x1/jenkins/mvn-repo/org/codehaus/plexus/plexus-interpolation/1.11/plexus-interpolation-1.11.jar
urls[4] = file:/x1/jenkins/mvn-repo/org/codehaus/plexus/plexus-component-annotations/1.5.5/plexus-component-annotations-1.5.5.jar
urls[5] = file:/x1/jenkins/mvn-repo/org/eclipse/aether/aether-util/0.9.0.M2/aether-util-0.9.0.M2.jar
urls[6] = file:/x1/jenkins/mvn-repo/org/sonatype/plexus/plexus-sec-dispatcher/1.4/plexus-sec-dispatcher-1.4.jar
urls[7] = file:/x1/jenkins/mvn-repo/org/codehaus/plexus/plexus-utils/1.5.5/plexus-utils-1.5.5.jar
urls[8] = file:/x1/jenkins/mvn-repo/org/sonatype/plexus/plexus-cipher/1.4/plexus-cipher-1.4.jar
urls[9] = file:/x1/jenkins/mvn-repo/org/codehaus/sonar/runner/sonar-runner-api/2.4/sonar-runner-api-2.4.jar
urls[10] = file:/x1/jenkins/mvn-repo/commons-lang/commons-lang/2.6/commons-lang-2.6.jar
urls[11] = file:/x1/jenkins/mvn-repo/com/google/guava/guava/10.0.1/guava-10.0.1.jar
urls[12] = file:/x1/jenkins/mvn-repo/com/google/code/findbugs/jsr305/2.0.3/jsr305-2.0.3.jar
Number of foreign imports: 1
import: Entry[import  from realm ClassRealm[maven.api, parent: null]]

-----------------------------------------------------

	at org.apache.maven.lifecycle.internal.MojoExecutor.execute(MojoExecutor.java:224)
	at org.apache.maven.lifecycle.internal.MojoExecutor.execute(MojoExecutor.java:153)
	at org.apache.maven.lifecycle.internal.MojoExecutor.execute(MojoExecutor.java:145)
	at org.apache.maven.lifecycle.internal.LifecycleModuleBuilder.buildProject(LifecycleModuleBuilder.java:116)
	at org.apache.maven.lifecycle.internal.LifecycleModuleBuilder.buildProject(LifecycleModuleBuilder.java:80)
	at org.apache.maven.lifecycle.internal.builder.singlethreaded.SingleThreadedBuilder.build(SingleThreadedBuilder.java:51)
	at org.apache.maven.lifecycle.internal.LifecycleStarter.execute(LifecycleStarter.java:120)
	at org.apache.maven.DefaultMaven.doExecute(DefaultMaven.java:347)
	at org.apache.maven.DefaultMaven.execute(DefaultMaven.java:154)
	at org.apache.maven.cli.MavenCli.execute(MavenCli.java:584)
	at org.apache.maven.cli.MavenCli.doMain(MavenCli.java:213)
	at org.apache.maven.cli.MavenCli.main(MavenCli.java:157)
	at sun.reflect.NativeMethodAccessorImpl.invoke0(Native Method)
	at sun.reflect.NativeMethodAccessorImpl.invoke(NativeMethodAccessorImpl.java:39)
	at sun.reflect.DelegatingMethodAccessorImpl.invoke(DelegatingMethodAccessorImpl.java:25)
	at java.lang.reflect.Method.invoke(Method.java:597)
	at org.codehaus.plexus.classworlds.launcher.Launcher.launchEnhanced(Launcher.java:289)
	at org.codehaus.plexus.classworlds.launcher.Launcher.launch(Launcher.java:229)
	at org.codehaus.plexus.classworlds.launcher.Launcher.mainWithExitCode(Launcher.java:415)
	at org.codehaus.plexus.classworlds.launcher.Launcher.main(Launcher.java:356)
Caused by: org.apache.maven.plugin.PluginExecutionException: Execution default-cli of goal
org.codehaus.mojo:sonar-maven-plugin:2.6:sonar failed: An API incompatibility was encountered
while executing org.codehaus.mojo:sonar-maven-plugin:2.6:sonar: java.lang.UnsupportedClassVersionError:
org/sonar/api/utils/SonarException : Unsupported major.minor version 51.0
-----------------------------------------------------
realm =    plugin>org.codehaus.mojo:sonar-maven-plugin:2.6
strategy = org.codehaus.plexus.classworlds.strategy.SelfFirstStrategy
urls[0] = file:/x1/jenkins/mvn-repo/org/codehaus/mojo/sonar-maven-plugin/2.6/sonar-maven-plugin-2.6.jar
urls[1] = file:/x1/jenkins/mvn-repo/org/apache/maven/shared/maven-dependency-tree/2.1/maven-dependency-tree-2.1.jar
urls[2] = file:/x1/jenkins/mvn-repo/backport-util-concurrent/backport-util-concurrent/3.1/backport-util-concurrent-3.1.jar
urls[3] = file:/x1/jenkins/mvn-repo/org/codehaus/plexus/plexus-interpolation/1.11/plexus-interpolation-1.11.jar
urls[4] = file:/x1/jenkins/mvn-repo/org/codehaus/plexus/plexus-component-annotations/1.5.5/plexus-component-annotations-1.5.5.jar
urls[5] = file:/x1/jenkins/mvn-repo/org/eclipse/aether/aether-util/0.9.0.M2/aether-util-0.9.0.M2.jar
urls[6] = file:/x1/jenkins/mvn-repo/org/sonatype/plexus/plexus-sec-dispatcher/1.4/plexus-sec-dispatcher-1.4.jar
urls[7] = file:/x1/jenkins/mvn-repo/org/codehaus/plexus/plexus-utils/1.5.5/plexus-utils-1.5.5.jar
urls[8] = file:/x1/jenkins/mvn-repo/org/sonatype/plexus/plexus-cipher/1.4/plexus-cipher-1.4.jar
urls[9] = file:/x1/jenkins/mvn-repo/org/codehaus/sonar/runner/sonar-runner-api/2.4/sonar-runner-api-2.4.jar
urls[10] = file:/x1/jenkins/mvn-repo/commons-lang/commons-lang/2.6/commons-lang-2.6.jar
urls[11] = file:/x1/jenkins/mvn-repo/com/google/guava/guava/10.0.1/guava-10.0.1.jar
urls[12] = file:/x1/jenkins/mvn-repo/com/google/code/findbugs/jsr305/2.0.3/jsr305-2.0.3.jar
Number of foreign imports: 1
import: Entry[import  from realm ClassRealm[maven.api, parent: null]]

-----------------------------------------------------

	at org.apache.maven.plugin.DefaultBuildPluginManager.executeMojo(DefaultBuildPluginManager.java:181)
	at org.apache.maven.lifecycle.internal.MojoExecutor.execute(MojoExecutor.java:208)
	... 19 more
Caused by: org.apache.maven.plugin.PluginContainerException: An API incompatibility was encountered
while executing org.codehaus.mojo:sonar-maven-plugin:2.6:sonar: java.lang.UnsupportedClassVersionError:
org/sonar/api/utils/SonarException : Unsupported major.minor version 51.0
-----------------------------------------------------
realm =    plugin>org.codehaus.mojo:sonar-maven-plugin:2.6
strategy = org.codehaus.plexus.classworlds.strategy.SelfFirstStrategy
urls[0] = file:/x1/jenkins/mvn-repo/org/codehaus/mojo/sonar-maven-plugin/2.6/sonar-maven-plugin-2.6.jar
urls[1] = file:/x1/jenkins/mvn-repo/org/apache/maven/shared/maven-dependency-tree/2.1/maven-dependency-tree-2.1.jar
urls[2] = file:/x1/jenkins/mvn-repo/backport-util-concurrent/backport-util-concurrent/3.1/backport-util-concurrent-3.1.jar
urls[3] = file:/x1/jenkins/mvn-repo/org/codehaus/plexus/plexus-interpolation/1.11/plexus-interpolation-1.11.jar
urls[4] = file:/x1/jenkins/mvn-repo/org/codehaus/plexus/plexus-component-annotations/1.5.5/plexus-component-annotations-1.5.5.jar
urls[5] = file:/x1/jenkins/mvn-repo/org/eclipse/aether/aether-util/0.9.0.M2/aether-util-0.9.0.M2.jar
urls[6] = file:/x1/jenkins/mvn-repo/org/sonatype/plexus/plexus-sec-dispatcher/1.4/plexus-sec-dispatcher-1.4.jar
urls[7] = file:/x1/jenkins/mvn-repo/org/codehaus/plexus/plexus-utils/1.5.5/plexus-utils-1.5.5.jar
urls[8] = file:/x1/jenkins/mvn-repo/org/sonatype/plexus/plexus-cipher/1.4/plexus-cipher-1.4.jar
urls[9] = file:/x1/jenkins/mvn-repo/org/codehaus/sonar/runner/sonar-runner-api/2.4/sonar-runner-api-2.4.jar
urls[10] = file:/x1/jenkins/mvn-repo/commons-lang/commons-lang/2.6/commons-lang-2.6.jar
urls[11] = file:/x1/jenkins/mvn-repo/com/google/guava/guava/10.0.1/guava-10.0.1.jar
urls[12] = file:/x1/jenkins/mvn-repo/com/google/code/findbugs/jsr305/2.0.3/jsr305-2.0.3.jar
Number of foreign imports: 1
import: Entry[import  from realm ClassRealm[maven.api, parent: null]]

-----------------------------------------------------

	at org.apache.maven.plugin.DefaultBuildPluginManager.executeMojo(DefaultBuildPluginManager.java:179)
	... 20 more
Caused by: java.lang.UnsupportedClassVersionError: org/sonar/api/utils/SonarException : Unsupported
major.minor version 51.0
	at java.lang.ClassLoader.defineClass1(Native Method)
	at java.lang.ClassLoader.defineClassCond(ClassLoader.java:632)
	at java.lang.ClassLoader.defineClass(ClassLoader.java:616)
	at java.security.SecureClassLoader.defineClass(SecureClassLoader.java:141)
	at java.net.URLClassLoader.defineClass(URLClassLoader.java:283)
	at java.net.URLClassLoader.access$000(URLClassLoader.java:58)
	at java.net.URLClassLoader$1.run(URLClassLoader.java:197)
	at java.security.AccessController.doPrivileged(Native Method)
	at java.net.URLClassLoader.findClass(URLClassLoader.java:190)
	at org.sonar.runner.impl.IsolatedClassloader.loadClass(IsolatedClassloader.java:94)
	at java.lang.ClassLoader.loadClass(ClassLoader.java:248)
	at java.lang.Class.getDeclaredMethods0(Native Method)
	at java.lang.Class.privateGetDeclaredMethods(Class.java:2427)
	at java.lang.Class.getMethod0(Class.java:2670)
	at java.lang.Class.getMethod(Class.java:1603)
	at org.sonar.runner.impl.BatchLauncher$1.delegateExecution(BatchLauncher.java:85)
	at org.sonar.runner.impl.BatchLauncher$1.run(BatchLauncher.java:75)
	at java.security.AccessController.doPrivileged(Native Method)
	at org.sonar.runner.impl.BatchLauncher.doExecute(BatchLauncher.java:69)
	at org.sonar.runner.impl.BatchLauncher.execute(BatchLauncher.java:50)
	at org.sonar.runner.api.EmbeddedRunner.doExecute(EmbeddedRunner.java:102)
	at org.sonar.runner.api.Runner.execute(Runner.java:100)
	at org.codehaus.mojo.sonar.bootstrap.RunnerBootstraper.execute(RunnerBootstraper.java:135)
	at org.codehaus.mojo.sonar.SonarMojo.execute(SonarMojo.java:132)
	at org.apache.maven.plugin.DefaultBuildPluginManager.executeMojo(DefaultBuildPluginManager.java:132)
	... 20 more
[ERROR] 
[ERROR] Re-run Maven using the -X switch to enable full debug logging.
[ERROR] 
[ERROR] For more information about the errors and possible solutions, please read the following
articles:
[ERROR] [Help 1] http://cwiki.apache.org/confluence/display/MAVEN/PluginContainerException
SonarQube analysis completed: FAILURE
Build step 'SonarQube' changed build result to FAILURE
Build step 'SonarQube' marked build as failure

Mime
View raw message