maven-notifications mailing list archives

Site index · List index
Message view « Date » · « Thread »
Top « Date » · « Thread »
From Apache Jenkins Server <jenk...@builds.apache.org>
Subject Build failed in Jenkins: core-it-maven-3-win #1067
Date Mon, 21 Dec 2015 19:20:24 GMT
See <https://builds.apache.org/job/core-it-maven-3-win/1067/changes>

Changes:

[schulte] [MNG-5581] Provide a way to customize lifecycle mapping logic

[schulte] [MNG-5359] Declared execution in PluginMgmt gets bound to lifecycle

------------------------------------------
[...truncated 10779 lines...]
[INFO] 
[INFO] --- maven-resources-plugin:2.6:resources (default-resources) @ mng-module3-XXX ---
[WARNING] Using platform encoding (Cp1252 actually) to copy filtered resources, i.e. build
is platform dependent!
[INFO] skip non existing resourceDirectory F:\ws\m3-its\core-integration-testing-trunk\core-it-suite\target\test-classes\mng-3259\module3\src\main\resources
[INFO] 
[INFO] --- maven-compiler-plugin:3.1:compile (default-compile) @ mng-module3-XXX ---
[INFO] Changes detected - recompiling the module!
[WARNING] File encoding has not been set, using platform encoding Cp1252, i.e. build is platform
dependent!
[INFO] Compiling 1 source file to F:\ws\m3-its\core-integration-testing-trunk\core-it-suite\target\test-classes\mng-3259\module3\target\classes
[INFO] 
[INFO] --- maven-resources-plugin:2.6:testResources (default-testResources) @ mng-module3-XXX
---
[WARNING] Using platform encoding (Cp1252 actually) to copy filtered resources, i.e. build
is platform dependent!
[INFO] skip non existing resourceDirectory F:\ws\m3-its\core-integration-testing-trunk\core-it-suite\target\test-classes\mng-3259\module3\src\test\resources
[INFO] 
[INFO] --- maven-compiler-plugin:3.1:testCompile (default-testCompile) @ mng-module3-XXX ---
[INFO] Changes detected - recompiling the module!
[WARNING] File encoding has not been set, using platform encoding Cp1252, i.e. build is platform
dependent!
[INFO] Compiling 1 source file to F:\ws\m3-its\core-integration-testing-trunk\core-it-suite\target\test-classes\mng-3259\module3\target\test-classes
[INFO] 
[INFO] --- maven-surefire-plugin:2.3:test (default-test) @ mng-module3-XXX ---
[INFO] Downloading: http://repo1.maven.org/maven2/org/apache/maven/surefire/surefire-junit/2.3/surefire-junit-2.3.pom
[INFO] Downloaded: http://repo1.maven.org/maven2/org/apache/maven/surefire/surefire-junit/2.3/surefire-junit-2.3.pom
(583 B at 7.9 KB/sec)
[INFO] Downloading: http://repo1.maven.org/maven2/org/apache/maven/surefire/surefire-providers/2.3/surefire-providers-2.3.pom
[INFO] Downloaded: http://repo1.maven.org/maven2/org/apache/maven/surefire/surefire-providers/2.3/surefire-providers-2.3.pom
(2 KB at 24.6 KB/sec)
[INFO] Downloading: http://repo1.maven.org/maven2/org/apache/maven/surefire/surefire-junit/2.3/surefire-junit-2.3.jar
[INFO] Downloaded: http://repo1.maven.org/maven2/org/apache/maven/surefire/surefire-junit/2.3/surefire-junit-2.3.jar
(11 KB at 115.7 KB/sec)
[INFO] Surefire report directory: F:\ws\m3-its\core-integration-testing-trunk\core-it-suite\target\test-classes\mng-3259\module3\target\surefire-reports
[INFO] ------------------------------------------------------------------------
[INFO] Reactor Summary:
[INFO] 
[INFO] Module-1 XXX ....................................... SUCCESS [  5.298 s]
[INFO] Module-2 XXX ....................................... SUCCESS [  0.092 s]
[INFO] Module-3 XXX ....................................... FAILURE [  0.789 s]
[INFO] Module-4 XXX ....................................... SKIPPED
[INFO] Module-5 XXX ....................................... SKIPPED
[INFO] Builder POM for issue XXX .......................... SKIPPED
[INFO] ------------------------------------------------------------------------
[INFO] BUILD FAILURE
[INFO] ------------------------------------------------------------------------
[INFO] Total time: 6.488 s
[INFO] Finished at: 2015-12-21T11:08:22-08:00
[INFO] Final Memory: 23M/742M
[INFO] ------------------------------------------------------------------------
[ERROR] Failed to execute goal org.apache.maven.plugins:maven-surefire-plugin:2.3:test (default-test)
on project mng-module3-XXX: Error creating properties files for forking; nested exception
is java.io.IOException: There is not enough space on the disk -> [Help 1]
org.apache.maven.lifecycle.LifecycleExecutionException: Failed to execute goal org.apache.maven.plugins:maven-surefire-plugin:2.3:test
(default-test) on project mng-module3-XXX: Error creating properties files for forking; nested
exception is java.io.IOException: There is not enough space on the disk
	at org.apache.maven.lifecycle.internal.MojoExecutor.execute(MojoExecutor.java:214)
	at org.apache.maven.lifecycle.internal.MojoExecutor.execute(MojoExecutor.java:155)
	at org.apache.maven.lifecycle.internal.MojoExecutor.execute(MojoExecutor.java:147)
	at org.apache.maven.lifecycle.internal.LifecycleModuleBuilder.buildProject(LifecycleModuleBuilder.java:116)
	at org.apache.maven.lifecycle.internal.LifecycleModuleBuilder.buildProject(LifecycleModuleBuilder.java:80)
	at org.apache.maven.lifecycle.internal.builder.singlethreaded.SingleThreadedBuilder.build(SingleThreadedBuilder.java:51)
	at org.apache.maven.lifecycle.internal.LifecycleStarter.execute(LifecycleStarter.java:128)
	at org.apache.maven.DefaultMaven.doExecute(DefaultMaven.java:307)
	at org.apache.maven.DefaultMaven.doExecute(DefaultMaven.java:193)
	at org.apache.maven.DefaultMaven.execute(DefaultMaven.java:106)
	at org.apache.maven.cli.MavenCli.execute(MavenCli.java:865)
	at org.apache.maven.cli.MavenCli.doMain(MavenCli.java:288)
	at org.apache.maven.cli.MavenCli.main(MavenCli.java:199)
	at sun.reflect.NativeMethodAccessorImpl.invoke0(Native Method)
	at sun.reflect.NativeMethodAccessorImpl.invoke(NativeMethodAccessorImpl.java:57)
	at sun.reflect.DelegatingMethodAccessorImpl.invoke(DelegatingMethodAccessorImpl.java:43)
	at java.lang.reflect.Method.invoke(Method.java:601)
	at org.codehaus.plexus.classworlds.launcher.Launcher.launchEnhanced(Launcher.java:289)
	at org.codehaus.plexus.classworlds.launcher.Launcher.launch(Launcher.java:229)
	at org.codehaus.plexus.classworlds.launcher.Launcher.mainWithExitCode(Launcher.java:415)
	at org.codehaus.plexus.classworlds.launcher.Launcher.main(Launcher.java:356)
Caused by: org.apache.maven.plugin.MojoExecutionException: Error creating properties files
for forking; nested exception is java.io.IOException: There is not enough space on the disk
	at org.apache.maven.plugin.surefire.SurefirePlugin.execute(SurefirePlugin.java:402)
	at org.apache.maven.plugin.DefaultBuildPluginManager.executeMojo(DefaultBuildPluginManager.java:134)
	at org.apache.maven.lifecycle.internal.MojoExecutor.execute(MojoExecutor.java:209)
	... 20 more
Caused by: org.apache.maven.surefire.booter.SurefireBooterForkException: Error creating properties
files for forking; nested exception is java.io.IOException: There is not enough space on the
disk
	at org.apache.maven.surefire.booter.SurefireBooter.fork(SurefireBooter.java:519)
	at org.apache.maven.surefire.booter.SurefireBooter.forkSuites(SurefireBooter.java:412)
	at org.apache.maven.surefire.booter.SurefireBooter.runSuitesForkOnce(SurefireBooter.java:312)
	at org.apache.maven.surefire.booter.SurefireBooter.run(SurefireBooter.java:202)
	at org.apache.maven.plugin.surefire.SurefirePlugin.execute(SurefirePlugin.java:398)
	... 22 more
Caused by: java.io.IOException: There is not enough space on the disk
	at java.io.FileOutputStream.writeBytes(Native Method)
	at java.io.FileOutputStream.write(FileOutputStream.java:318)
	at sun.nio.cs.StreamEncoder.writeBytes(StreamEncoder.java:221)
	at sun.nio.cs.StreamEncoder.implFlushBuffer(StreamEncoder.java:291)
	at sun.nio.cs.StreamEncoder.implFlush(StreamEncoder.java:295)
	at sun.nio.cs.StreamEncoder.flush(StreamEncoder.java:141)
	at java.io.OutputStreamWriter.flush(OutputStreamWriter.java:229)
	at java.io.BufferedWriter.flush(BufferedWriter.java:254)
	at java.util.Properties.store0(Properties.java:838)
	at java.util.Properties.store(Properties.java:812)
	at org.apache.maven.surefire.booter.SurefireBooter.writePropertiesFile(SurefireBooter.java:465)
	at org.apache.maven.surefire.booter.SurefireBooter.writePropertiesFile(SurefireBooter.java:453)
	at org.apache.maven.surefire.booter.SurefireBooter.fork(SurefireBooter.java:511)
	... 26 more
[ERROR] 
[ERROR] Re-run Maven using the -X switch to enable full debug logging.
[ERROR] 
[ERROR] For more information about the errors and possible solutions, please read the following
articles:
[ERROR] [Help 1] http://cwiki.apache.org/confluence/display/MAVEN/MojoExecutionException
[ERROR] 
[ERROR] After correcting the problems, you can resume the build with the command
[ERROR]   mvn <goals> -rf :mng-module3-XXX

	at org.apache.maven.it.Verifier.executeGoals(Verifier.java:1369)
	at org.apache.maven.it.Verifier.executeGoal(Verifier.java:1254)
	at org.apache.maven.it.Verifier.executeGoal(Verifier.java:1248)
	at org.apache.maven.it.MavenITmng3259DepsDroppedInMultiModuleBuildTest.testitMNG3259(MavenITmng3259DepsDroppedInMultiModuleBuildTest.java:62)


Results :

Tests in error: 
  MavenITmng3259DepsDroppedInMultiModuleBuildTest>AbstractMavenIntegrationTestCase.runTest:219->testitMNG3259:62
» Verification
  MavenITmng4396AntBased20xMojoSupportTest>AbstractMavenIntegrationTestCase.runTest:219->testit:53
» Verification
  MavenITmng4786AntBased21xMojoSupportTest>AbstractMavenIntegrationTestCase.runTest:219->testit:55
» Verification

Tests run: 772, Failures: 0, Errors: 3, Skipped: 0

[INFO] ------------------------------------------------------------------------
[INFO] Reactor Summary:
[INFO] 
[INFO] Maven Core ITs ..................................... SUCCESS [ 52.602 s]
[INFO] Maven IT Support ................................... SUCCESS [  1.068 s]
[INFO] Maven IT :: Plugins ................................ SUCCESS [  0.670 s]
[INFO] Maven IT Plugin :: Active Collection ............... SUCCESS [ 11.324 s]
[INFO] Maven IT Plugin :: Ant-Based ....................... SUCCESS [  5.932 s]
[INFO] Maven IT Plugin :: Artifact ........................ SUCCESS [  2.875 s]
[INFO] Maven IT Plugin :: Class Loader :: Dependency A .... SUCCESS [  0.550 s]
[INFO] Maven IT Plugin :: Class Loader :: Dependency B .... SUCCESS [  1.306 s]
[INFO] Maven IT Plugin :: Class Loader :: Dependency C .... SUCCESS [  0.488 s]
[INFO] Maven IT Plugin :: Class Loader .................... SUCCESS [  2.529 s]
[INFO] Maven IT Plugin :: Class Loader :: Aggregator ...... SUCCESS [  0.430 s]
[INFO] Maven IT Plugin :: Configuration ................... SUCCESS [  1.184 s]
[INFO] Maven IT Plugin :: Context Passing ................. SUCCESS [  0.840 s]
[INFO] Maven ITs :: Core Plugin Stubs ..................... SUCCESS [  0.457 s]
[INFO] Maven IT Clean Plugin Stub ......................... SUCCESS [  1.132 s]
[INFO] Maven IT Compiler Plugin Stub ...................... SUCCESS [  0.903 s]
[INFO] Maven IT Deploy Plugin Stub ........................ SUCCESS [  1.012 s]
[INFO] Maven IT EAR Plugin Stub ........................... SUCCESS [  0.764 s]
[INFO] Maven IT EJB Plugin Stub ........................... SUCCESS [  0.961 s]
[INFO] Maven IT Install Plugin Stub ....................... SUCCESS [  0.669 s]
[INFO] Maven IT JAR Plugin Stub ........................... SUCCESS [  0.685 s]
[INFO] Maven IT Javadoc Plugin Stub ....................... SUCCESS [  0.628 s]
[INFO] Maven IT Plugin Plugin Stub ........................ SUCCESS [  0.735 s]
[INFO] Maven IT RAR Plugin Stub ........................... SUCCESS [  0.843 s]
[INFO] Maven IT Resources Plugin Stub ..................... SUCCESS [  0.632 s]
[INFO] Maven IT Site Plugin Stub .......................... SUCCESS [  0.854 s]
[INFO] Maven IT Source Plugin Stub ........................ SUCCESS [  0.941 s]
[INFO] Maven IT Surefire Plugin Stub ...................... SUCCESS [  0.755 s]
[INFO] Maven IT WAR Plugin Stub ........................... SUCCESS [  0.811 s]
[INFO] Maven IT Plugin :: Dependency Collection ........... SUCCESS [  0.830 s]
[INFO] Maven IT Plugin :: Dependency Resolution ........... SUCCESS [ 10.324 s]
[INFO] Maven IT Plugin :: Expression ...................... SUCCESS [  1.832 s]
[INFO] Maven IT Plugin :: Error Mojos ..................... SUCCESS [  2.928 s]
[INFO] Maven IT Component ................................. SUCCESS [  0.432 s]
[INFO] Maven IT Plugin :: Extension Consumer .............. SUCCESS [  0.654 s]
[INFO] Maven IT Plugin :: Extension Provider .............. SUCCESS [  0.650 s]
[INFO] Maven IT Plugin :: Fork ............................ SUCCESS [  0.732 s]
[INFO] Maven IT Plugin :: Invalid Descriptor .............. SUCCESS [  1.071 s]
[INFO] Maven IT Plugin :: Log File ........................ SUCCESS [  0.605 s]
[INFO] Maven IT Helper Library ............................ SUCCESS [  1.483 s]
[INFO] Maven IT Plugin :: Model Interpolation ............. SUCCESS [  1.435 s]
[INFO] Maven IT Plugin :: No Default Component ............ SUCCESS [  0.515 s]
[INFO] Maven IT Plugin :: No Project ...................... SUCCESS [  0.551 s]
[INFO] Maven IT Plugin :: Online .......................... SUCCESS [  0.487 s]
[INFO] Maven IT Plugin :: Optional Mojos .................. SUCCESS [  0.617 s]
[INFO] Maven IT Plugin :: Packaging ....................... SUCCESS [  0.488 s]
[INFO] Maven IT Plugin :: Parameter Implementation ........ SUCCESS [  0.539 s]
[INFO] Maven IT Plugin :: Plugin Dependency ............... SUCCESS [  0.522 s]
[INFO] Maven IT Plugin :: Project ......................... SUCCESS [  1.254 s]
[INFO] Maven IT Plugin :: Project Interpolation ........... SUCCESS [  1.853 s]
[INFO] Maven IT Plugin :: Setter .......................... SUCCESS [  0.497 s]
[INFO] Maven IT Plugin :: Singleton Component ............. SUCCESS [  0.846 s]
[INFO] Maven IT Plugin :: Site ............................ SUCCESS [  3.256 s]
[INFO] Maven IT Plugin :: Toolchain ....................... SUCCESS [  7.524 s]
[INFO] Maven IT Plugin :: Touch ........................... SUCCESS [  1.394 s]
[INFO] Maven IT Plugin :: Uses Properties Plugin .......... SUCCESS [  0.517 s]
[INFO] Maven IT Plugin :: Uses Wagon Plugin ............... SUCCESS [  5.249 s]
[INFO] Maven IT Plugin :: This plugin should contain the mojos needed by all tests. SUCCESS
[  0.461 s]
[INFO] Maven IT Plugin :: Plexus Utils 1.1 ................ SUCCESS [  0.966 s]
[INFO] Maven IT Plugin :: Plexus Utils New ................ SUCCESS [  0.667 s]
[INFO] Maven IT Plugin :: Plexus Component API ............ SUCCESS [  1.954 s]
[INFO] Maven IT Plugin :: Log4J Client .................... SUCCESS [  1.035 s]
[INFO] Maven IT Plugin :: Extension 1 ..................... SUCCESS [  0.759 s]
[INFO] Maven IT Plugin :: Extension 2 ..................... SUCCESS [  0.519 s]
[INFO] Maven IT Plugin :: Plexus Lifecycle ................ SUCCESS [  2.204 s]
[INFO] Maven IT Plugin :: Settings ........................ SUCCESS [  0.677 s]
[INFO] Maven IT Plugin :: mng-5805 extension .............. SUCCESS [  0.423 s]
[INFO] Maven IT Plugin :: mng-5805 plugin ................. SUCCESS [  0.546 s]
[INFO] Maven IT Plugin :: mng-5805 plugin-dep ............. SUCCESS [  0.465 s]
[INFO] Maven IT Toolchain ................................. SUCCESS [  1.077 s]
[INFO] Maven IT Wagon ..................................... SUCCESS [  0.732 s]
[INFO] Maven IT Support Artifacts ......................... SUCCESS [  2.900 s]
[INFO] Maven IT Extension ................................. SUCCESS [  0.390 s]
[INFO] Maven ITs .......................................... FAILURE [47:44 min]
[INFO] ------------------------------------------------------------------------
[INFO] BUILD FAILURE
[INFO] ------------------------------------------------------------------------
[INFO] Total time: 50:29 min
[INFO] Finished at: 2015-12-21T11:20:22-08:00
[INFO] Final Memory: 60M/742M
[INFO] ------------------------------------------------------------------------
[ERROR] Failed to execute goal org.apache.maven.plugins:maven-surefire-plugin:2.18.1:test
(default-test) on project core-it-suite: There are test failures.
[ERROR] 
[ERROR] Please refer to F:\ws\m3-its\core-integration-testing-trunk\core-it-suite\target\surefire-reports
for the individual test results.
[ERROR] -> [Help 1]
org.apache.maven.lifecycle.LifecycleExecutionException: Failed to execute goal org.apache.maven.plugins:maven-surefire-plugin:2.18.1:test
(default-test) on project core-it-suite: There are test failures.

Please refer to F:\ws\m3-its\core-integration-testing-trunk\core-it-suite\target\surefire-reports
for the individual test results.
	at org.apache.maven.lifecycle.internal.MojoExecutor.execute(MojoExecutor.java:212)
	at org.apache.maven.lifecycle.internal.MojoExecutor.execute(MojoExecutor.java:153)
	at org.apache.maven.lifecycle.internal.MojoExecutor.execute(MojoExecutor.java:145)
	at org.apache.maven.lifecycle.internal.LifecycleModuleBuilder.buildProject(LifecycleModuleBuilder.java:116)
	at org.apache.maven.lifecycle.internal.LifecycleModuleBuilder.buildProject(LifecycleModuleBuilder.java:80)
	at org.apache.maven.lifecycle.internal.builder.singlethreaded.SingleThreadedBuilder.build(SingleThreadedBuilder.java:51)
	at org.apache.maven.lifecycle.internal.LifecycleStarter.execute(LifecycleStarter.java:128)
	at org.apache.maven.DefaultMaven.doExecute(DefaultMaven.java:307)
	at org.apache.maven.DefaultMaven.doExecute(DefaultMaven.java:193)
	at org.apache.maven.DefaultMaven.execute(DefaultMaven.java:106)
	at org.apache.maven.cli.MavenCli.execute(MavenCli.java:862)
	at org.apache.maven.cli.MavenCli.doMain(MavenCli.java:286)
	at org.apache.maven.cli.MavenCli.main(MavenCli.java:197)
	at sun.reflect.NativeMethodAccessorImpl.invoke0(Native Method)
	at sun.reflect.NativeMethodAccessorImpl.invoke(NativeMethodAccessorImpl.java:57)
	at sun.reflect.DelegatingMethodAccessorImpl.invoke(DelegatingMethodAccessorImpl.java:43)
	at java.lang.reflect.Method.invoke(Method.java:601)
	at org.codehaus.plexus.classworlds.launcher.Launcher.launchEnhanced(Launcher.java:289)
	at org.codehaus.plexus.classworlds.launcher.Launcher.launch(Launcher.java:229)
	at org.codehaus.plexus.classworlds.launcher.Launcher.mainWithExitCode(Launcher.java:415)
	at org.codehaus.plexus.classworlds.launcher.Launcher.main(Launcher.java:356)
Caused by: org.apache.maven.plugin.MojoFailureException: There are test failures.

Please refer to F:\ws\m3-its\core-integration-testing-trunk\core-it-suite\target\surefire-reports
for the individual test results.
	at org.apache.maven.plugin.surefire.SurefireHelper.reportExecution(SurefireHelper.java:82)
	at org.apache.maven.plugin.surefire.SurefirePlugin.handleSummary(SurefirePlugin.java:254)
	at org.apache.maven.plugin.surefire.AbstractSurefireMojo.executeAfterPreconditionsChecked(AbstractSurefireMojo.java:854)
	at org.apache.maven.plugin.surefire.AbstractSurefireMojo.execute(AbstractSurefireMojo.java:722)
	at org.apache.maven.plugin.DefaultBuildPluginManager.executeMojo(DefaultBuildPluginManager.java:134)
	at org.apache.maven.lifecycle.internal.MojoExecutor.execute(MojoExecutor.java:208)
	... 20 more
[ERROR] 
[ERROR] Re-run Maven using the -X switch to enable full debug logging.
[ERROR] 
[ERROR] For more information about the errors and possible solutions, please read the following
articles:
[ERROR] [Help 1] http://cwiki.apache.org/confluence/display/MAVEN/MojoFailureException
[ERROR] 
[ERROR] After correcting the problems, you can resume the build with the command
[ERROR]   mvn <goals> -rf :core-it-suite
Build step 'Invoke top-level Maven targets' marked build as failure
Recording test results

Mime
View raw message