maven-notifications mailing list archives

Site index · List index
Message view « Date » · « Thread »
Top « Date » · « Thread »
From Apache Jenkins Server <jenk...@builds.apache.org>
Subject Build failed in Jenkins: maven-plugins #4884
Date Mon, 14 Dec 2015 01:22:15 GMT
See <https://builds.apache.org/job/maven-plugins/4884/changes>

Changes:

[dennisl] [maven-release-plugin] prepare for next development iteration

[dennisl] [maven-release-plugin] prepare release maven-pmd-plugin-3.6

[dennisl] Add a temporary workaround for MRELEASE-925, to get the release out.

------------------------------------------
Started by an SCM change
Started by an SCM change
[EnvInject] - Loading node environment variables.
Building remotely on ubuntu-1 (docker Ubuntu ubuntu ubuntu1) in workspace <https://builds.apache.org/job/maven-plugins/ws/>
Updating http://svn.apache.org/repos/asf/maven/plugins/trunk at revision '2015-12-13T22:42:34.927
+0000'
U         maven-ejb-plugin/pom.xml
U         maven-install-plugin/pom.xml
AU        maven-site-plugin/dependency-reduced-pom.xml
D         maven-site-plugin/src/test/resources/unit/interpolated-site
D         maven-site-plugin/src/test/java/org/apache/maven/plugins/site/render
U         maven-site-plugin/src/test/java/org/apache/maven/plugins/site/stubs/SiteMavenProjectStub.java
U         maven-site-plugin/src/test/java/org/apache/maven/plugins/site/deploy/SiteDeployWebDavTest.java
U         maven-site-plugin/src/test/java/org/apache/maven/plugins/site/deploy/AbstractSiteDeployWebDavTest.java
U         maven-site-plugin/src/main/java/org/apache/maven/plugins/site/render/AbstractSiteRenderingMojo.java
U         maven-site-plugin/src/main/java/org/apache/maven/plugins/site/AbstractSiteMojo.java
U         maven-site-plugin/src/main/java/org/apache/maven/plugins/site/SiteDescriptorAttachMojo.java
U         maven-dependency-plugin/pom.xml
U         maven-pmd-plugin/pom.xml
D         maven-rar-plugin/src/main/java/org/apache/maven/plugin
A         maven-rar-plugin/src/main/java/org/apache/maven/plugins
A         maven-rar-plugin/src/main/java/org/apache/maven/plugins/rar
AU        maven-rar-plugin/src/main/java/org/apache/maven/plugins/rar/RarResource.java
AU        maven-rar-plugin/src/main/java/org/apache/maven/plugins/rar/RarMojo.java
U         maven-rar-plugin/src/test/resources/unit/basic-rar-test/plugin-config.xml
U         maven-rar-plugin/src/test/resources/unit/basic-rar-with-manifest/plugin-config.xml
U         maven-rar-plugin/src/test/resources/unit/basic-rar-with-descriptor/plugin-config.xml
D         maven-rar-plugin/src/test/java/org/apache/maven/plugin
A         maven-rar-plugin/src/test/java/org/apache/maven/plugins
A         maven-rar-plugin/src/test/java/org/apache/maven/plugins/rar
A         maven-rar-plugin/src/test/java/org/apache/maven/plugins/rar/RarMojoTest.java
A         maven-rar-plugin/src/test/java/org/apache/maven/plugins/rar/stubs
AU        maven-rar-plugin/src/test/java/org/apache/maven/plugins/rar/stubs/RarArtifactStub.java
AU        maven-rar-plugin/src/test/java/org/apache/maven/plugins/rar/stubs/RarMavenProjectStub.java
AU        maven-rar-plugin/src/test/java/org/apache/maven/plugins/rar/stubs/RarMavenProjectStub2.java
AU        maven-rar-plugin/src/test/java/org/apache/maven/plugins/rar/stubs/RarMavenProjectStub3.java
AU        maven-rar-plugin/src/test/java/org/apache/maven/plugins/rar/stubs/ArtifactHandlerStub.java
At revision 1719844
Parsing POMs
Modules changed, recalculating dependency graph
Build timed out (after 84 minutes). Marking the build as aborted.
ERROR: Processing failed due to a bug in the code. Please report this to jenkinsci-users@googlegroups.com
java.lang.RuntimeException: java.lang.InterruptedException
	at hudson.scm.SubversionSCM.getModuleRoot(SubversionSCM.java:1527)
	at hudson.model.AbstractBuild.getModuleRoot(AbstractBuild.java:311)
	at hudson.maven.MavenModuleSetBuild$MavenModuleSetBuildExecution.doRun(MavenModuleSetBuild.java:720)
	at hudson.model.AbstractBuild$AbstractBuildExecution.run(AbstractBuild.java:536)
	at hudson.model.Run.execute(Run.java:1738)
	at hudson.maven.MavenModuleSetBuild.run(MavenModuleSetBuild.java:531)
	at hudson.model.ResourceController.execute(ResourceController.java:98)
	at hudson.model.Executor.run(Executor.java:381)
Caused by: java.lang.InterruptedException
	at java.util.concurrent.locks.AbstractQueuedSynchronizer.acquireSharedInterruptibly(AbstractQueuedSynchronizer.java:1301)
	at java.util.concurrent.Semaphore.acquire(Semaphore.java:317)
	at hudson.tools.InstallerTranslator.getToolHome(InstallerTranslator.java:66)
	at hudson.tools.ToolLocationNodeProperty.getToolHome(ToolLocationNodeProperty.java:107)
	at hudson.tools.ToolInstallation.translateFor(ToolInstallation.java:205)
	at hudson.tasks.Maven$MavenInstallation.forNode(Maven.java:621)
	at hudson.maven.MavenModuleSetBuild.getEnvironment(MavenModuleSetBuild.java:183)
	at hudson.scm.SubversionSCM.getModuleRoot(SubversionSCM.java:1522)
	... 7 more
project=hudson.maven.MavenModuleSet@574f85a9[maven-plugins]
project.getModules()=[hudson.maven.MavenModule@2e358fe7[maven-plugins/org.apache.maven.plugins:maven-acr-plugin][maven-plugins/org.apache.maven.plugins:maven-acr-plugin][relativePath:maven-acr-plugin],
hudson.maven.MavenModule@4921a9b6[maven-plugins/org.apache.maven.plugins:maven-ant-plugin][maven-plugins/org.apache.maven.plugins:maven-ant-plugin][relativePath:maven-ant-plugin],
hudson.maven.MavenModule@7888e671[maven-plugins/org.apache.maven.plugins:maven-antrun-plugin][maven-plugins/org.apache.maven.plugins:maven-antrun-plugin][relativePath:maven-antrun-plugin],
hudson.maven.MavenModule@1cb9e51c[maven-plugins/org.apache.maven.plugins:maven-assembly-plugin][maven-plugins/org.apache.maven.plugins:maven-assembly-plugin][relativePath:maven-assembly-plugin],
hudson.maven.MavenModule@334709ce[maven-plugins/org.apache.maven.plugins:maven-changelog-plugin][maven-plugins/org.apache.maven.plugins:maven-changelog-plugin][relativePath:maven-changelog-plugin],
hudson.maven.MavenModule@1ace93c7[maven-plugins/org.apache.maven.plugins:maven-changes-plugin][maven-plugins/org.apache.maven.plugins:maven-changes-plugin][relativePath:maven-changes-plugin],
hudson.maven.MavenModule@5d4e487[maven-plugins/org.apache.maven.plugins:maven-checkstyle-plugin][maven-plugins/org.apache.maven.plugins:maven-checkstyle-plugin][relativePath:maven-checkstyle-plugin],
hudson.maven.MavenModule@426aead1[maven-plugins/org.apache.maven.plugins:maven-clean-plugin][maven-plugins/org.apache.maven.plugins:maven-clean-plugin][relativePath:maven-clean-plugin],
hudson.maven.MavenModule@ffbf5d2[maven-plugins/org.apache.maven.plugins:maven-compiler-plugin][maven-plugins/org.apache.maven.plugins:maven-compiler-plugin][relativePath:maven-compiler-plugin],
hudson.maven.MavenModule@57aaf3a5[maven-plugins/org.apache.maven.plugins:maven-dependency-plugin][maven-plugins/org.apache.maven.plugins:maven-dependency-plugin][relativePath:maven-dependency-plugin],
hudson.maven.MavenModule@33562b8a[maven-plugins/org.apache.maven.plugins:maven-deploy-plugin][maven-plugins/org.apache.maven.plugins:maven-deploy-plugin][relativePath:maven-deploy-plugin],
hudson.maven.MavenModule@6fbbeb26[maven-plugins/org.apache.maven.plugins:maven-doap-plugin][maven-plugins/org.apache.maven.plugins:maven-doap-plugin][relativePath:maven-doap-plugin],
hudson.maven.MavenModule@6852ce58[maven-plugins/org.apache.maven.plugins:maven-docck-plugin][maven-plugins/org.apache.maven.plugins:maven-docck-plugin][relativePath:maven-docck-plugin],
hudson.maven.MavenModule@608fd69d[maven-plugins/org.apache.maven.plugins:maven-ear-plugin][maven-plugins/org.apache.maven.plugins:maven-ear-plugin][relativePath:maven-ear-plugin],
hudson.maven.MavenModule@27ee4644[maven-plugins/org.apache.maven.plugins:maven-eclipse-plugin][maven-plugins/org.apache.maven.plugins:maven-eclipse-plugin][relativePath:maven-eclipse-plugin],
hudson.maven.MavenModule@10f35394[maven-plugins/org.apache.maven.plugins:maven-ejb-plugin][maven-plugins/org.apache.maven.plugins:maven-ejb-plugin][relativePath:maven-ejb-plugin],
hudson.maven.MavenModule@260419e8[maven-plugins/org.apache.maven.plugins:maven-gpg-plugin][maven-plugins/org.apache.maven.plugins:maven-gpg-plugin][relativePath:maven-gpg-plugin],
hudson.maven.MavenModule@64ab1701[maven-plugins/org.apache.maven.plugins:maven-help-plugin][maven-plugins/org.apache.maven.plugins:maven-help-plugin][relativePath:maven-help-plugin],
hudson.maven.MavenModule@605ac136[maven-plugins/org.apache.maven.plugins:maven-install-plugin][maven-plugins/org.apache.maven.plugins:maven-install-plugin][relativePath:maven-install-plugin],
hudson.maven.MavenModule@3506bc16[maven-plugins/org.apache.maven.plugins:maven-invoker-plugin][maven-plugins/org.apache.maven.plugins:maven-invoker-plugin][relativePath:maven-invoker-plugin],
hudson.maven.MavenModule@58dfd48[maven-plugins/org.apache.maven.plugins:maven-jar-plugin][maven-plugins/org.apache.maven.plugins:maven-jar-plugin][relativePath:maven-jar-plugin],
hudson.maven.MavenModule@20f8cc63[maven-plugins/org.apache.maven.plugins:maven-jarsigner-plugin][maven-plugins/org.apache.maven.plugins:maven-jarsigner-plugin][relativePath:maven-jarsigner-plugin],
hudson.maven.MavenModule@11848bce[maven-plugins/org.apache.maven.plugins:maven-javadoc-plugin][maven-plugins/org.apache.maven.plugins:maven-javadoc-plugin][relativePath:maven-javadoc-plugin],
hudson.maven.MavenModule@290278bc[maven-plugins/org.apache.maven.plugins:maven-linkcheck-plugin][maven-plugins/org.apache.maven.plugins:maven-linkcheck-plugin][relativePath:maven-linkcheck-plugin],
hudson.maven.MavenModule@59975ad2[maven-plugins/org.apache.maven.plugins:maven-patch-plugin][maven-plugins/org.apache.maven.plugins:maven-patch-plugin][relativePath:maven-patch-plugin],
hudson.maven.MavenModule@3964f159[maven-plugins/org.apache.maven.plugins:maven-pdf-plugin][maven-plugins/org.apache.maven.plugins:maven-pdf-plugin][relativePath:maven-pdf-plugin],
hudson.maven.MavenModule@3ea80c25[maven-plugins/org.apache.maven.plugins:maven-plugins][maven-plugins/org.apache.maven.plugins:maven-plugins][relativePath:maven-plugins],
hudson.maven.MavenModule@242853d5[maven-plugins/org.apache.maven.plugins:maven-plugins-aggregator][maven-plugins/org.apache.maven.plugins:maven-plugins-aggregator][relativePath:],
hudson.maven.MavenModule@15c4bc12[maven-plugins/org.apache.maven.plugins:maven-pmd-plugin][maven-plugins/org.apache.maven.plugins:maven-pmd-plugin][relativePath:maven-pmd-plugin],
hudson.maven.MavenModule@6aba2764[maven-plugins/org.apache.maven.plugins:maven-project-info-reports-plugin][maven-plugins/org.apache.maven.plugins:maven-project-info-reports-plugin][relativePath:maven-project-info-reports-plugin],
hudson.maven.MavenModule@70e41098[maven-plugins/org.apache.maven.plugins:maven-rar-plugin][maven-plugins/org.apache.maven.plugins:maven-rar-plugin][relativePath:maven-rar-plugin],
hudson.maven.MavenModule@1e6d3bcc[maven-plugins/org.apache.maven.plugins:maven-remote-resources-plugin][maven-plugins/org.apache.maven.plugins:maven-remote-resources-plugin][relativePath:maven-remote-resources-plugin],
hudson.maven.MavenModule@4965607[maven-plugins/org.apache.maven.plugins:maven-repository-plugin][maven-plugins/org.apache.maven.plugins:maven-repository-plugin][relativePath:maven-repository-plugin],
hudson.maven.MavenModule@219f5662[maven-plugins/org.apache.maven.plugins:maven-resources-plugin][maven-plugins/org.apache.maven.plugins:maven-resources-plugin][relativePath:maven-resources-plugin],
hudson.maven.MavenModule@1aeab6ee[maven-plugins/org.apache.maven.plugins:maven-scm-publish-plugin][maven-plugins/org.apache.maven.plugins:maven-scm-publish-plugin][relativePath:maven-scm-publish-plugin],
hudson.maven.MavenModule@3dda2c7b[maven-plugins/org.apache.maven.plugins:maven-shade-plugin][maven-plugins/org.apache.maven.plugins:maven-shade-plugin][relativePath:maven-shade-plugin],
hudson.maven.MavenModule@1668d8ff[maven-plugins/org.apache.maven.plugins:maven-site-plugin][maven-plugins/org.apache.maven.plugins:maven-site-plugin][relativePath:maven-site-plugin],
hudson.maven.MavenModule@31faaacb[maven-plugins/org.apache.maven.plugins:maven-source-plugin][maven-plugins/org.apache.maven.plugins:maven-source-plugin][relativePath:maven-source-plugin],
hudson.maven.MavenModule@4994cfe7[maven-plugins/org.apache.maven.plugins:maven-stage-plugin][maven-plugins/org.apache.maven.plugins:maven-stage-plugin][relativePath:maven-stage-plugin],
hudson.maven.MavenModule@23b7187[maven-plugins/org.apache.maven.plugins:maven-toolchains-plugin][maven-plugins/org.apache.maven.plugins:maven-toolchains-plugin][relativePath:maven-toolchains-plugin],
hudson.maven.MavenModule@68d3a0b0[maven-plugins/org.apache.maven.plugins:maven-verifier-plugin][maven-plugins/org.apache.maven.plugins:maven-verifier-plugin][relativePath:maven-verifier-plugin],
hudson.maven.MavenModule@28c0bdc[maven-plugins/org.apache.maven.plugins:maven-war-plugin][maven-plugins/org.apache.maven.plugins:maven-war-plugin][relativePath:maven-war-plugin]]
project.getRootModule()=hudson.maven.MavenModule@242853d5[maven-plugins/org.apache.maven.plugins:maven-plugins-aggregator][maven-plugins/org.apache.maven.plugins:maven-plugins-aggregator][relativePath:]
FATAL: java.lang.InterruptedException
java.lang.RuntimeException: java.lang.InterruptedException
	at hudson.scm.SubversionSCM.getModuleRoot(SubversionSCM.java:1527)
	at hudson.model.AbstractBuild.getModuleRoot(AbstractBuild.java:311)
	at hudson.maven.MavenModuleSetBuild$MavenModuleSetBuildExecution.doRun(MavenModuleSetBuild.java:720)
	at hudson.model.AbstractBuild$AbstractBuildExecution.run(AbstractBuild.java:536)
	at hudson.model.Run.execute(Run.java:1738)
	at hudson.maven.MavenModuleSetBuild.run(MavenModuleSetBuild.java:531)
	at hudson.model.ResourceController.execute(ResourceController.java:98)
	at hudson.model.Executor.run(Executor.java:381)
Caused by: java.lang.InterruptedException
	at java.util.concurrent.locks.AbstractQueuedSynchronizer.acquireSharedInterruptibly(AbstractQueuedSynchronizer.java:1301)
	at java.util.concurrent.Semaphore.acquire(Semaphore.java:317)
	at hudson.tools.InstallerTranslator.getToolHome(InstallerTranslator.java:66)
	at hudson.tools.ToolLocationNodeProperty.getToolHome(ToolLocationNodeProperty.java:107)
	at hudson.tools.ToolInstallation.translateFor(ToolInstallation.java:205)
	at hudson.tasks.Maven$MavenInstallation.forNode(Maven.java:621)
	at hudson.maven.MavenModuleSetBuild.getEnvironment(MavenModuleSetBuild.java:183)
	at hudson.scm.SubversionSCM.getModuleRoot(SubversionSCM.java:1522)
	... 7 more
[WARNINGS] Skipping publisher since build result is FAILURE
Error updating JIRA issues. Saving issues for next build.
java.lang.NullPointerException

Mime
View raw message