maven-notifications mailing list archives

Site index · List index
Message view « Date » · « Thread »
Top « Date » · « Thread »
From Apache Jenkins Server <jenk...@builds.apache.org>
Subject Build failed in Jenkins: maven-plugins-ITs-m3 #2224
Date Thu, 31 Dec 2015 22:05:04 GMT
See <https://builds.apache.org/job/maven-plugins-ITs-m3/2224/changes>

Changes:

[khmarbaise] [MASSEMBLY-796] Upgrade maven-shared-io to 3.0.0

[khmarbaise] [MASSEMBLY-795] Upgrade file-management to 3.0.0

[Robert Scholte] Fix checkstyle reported errors

[khmarbaise] [MEAR-224] Upgrade plexus-archiver from 2.10.3 to 3.0.1

------------------------------------------
[...truncated 5602 lines...]
[INFO] Configured Artifact: test:test:1.0:jar
[INFO] Unpacking /x1/jenkins/jenkins-slave/workspace/maven-plugins-ITs-m3/maven-dependency-plugin/target/unit-tests/unpack/localTestRepo/test/test/1.0/test-1.0.jar
to /x1/jenkins/jenkins-slave/workspace/maven-plugins-ITs-m3/maven-dependency-plugin/target/unit-tests/unpack/outputDirectory
with includes "**/test2.txt" and excludes ""
[INFO] Unpacking /x1/jenkins/jenkins-slave/workspace/maven-plugins-ITs-m3/maven-dependency-plugin/target/unit-tests/unpack/localTestRepo/test/test/1.0/test-1.0.jar
to /x1/jenkins/jenkins-slave/workspace/maven-plugins-ITs-m3/maven-dependency-plugin/target/unit-tests/unpack/outputDirectory
with includes "**/test3.txt" and excludes ""
[INFO] Configured Artifact: test:test:1.0:jar
[INFO] Configured Artifact: test:test:1.0:jar
[INFO] test-1.0.jar already unpacked.
[INFO] test-1.0.jar already unpacked.
[INFO] Configured Artifact: test:test:1.0:jar
[INFO] Unpacking /x1/jenkins/jenkins-slave/workspace/maven-plugins-ITs-m3/maven-dependency-plugin/target/unit-tests/unpack/localTestRepo/test/test/1.0/test-1.0.jar
to /x1/jenkins/jenkins-slave/workspace/maven-plugins-ITs-m3/maven-dependency-plugin/target/unit-tests/unpack/outputDirectory
with includes "" and excludes "**/*1.txt"
Tests run: 11, Failures: 0, Errors: 0, Skipped: 0, Time elapsed: 3.867 sec - in org.apache.maven.plugins.dependency.fromConfiguration.TestIncludeExcludeUnpackMojo
Running org.apache.maven.plugins.dependency.fromConfiguration.TestCopyMojo
Tests run: 27, Failures: 0, Errors: 0, Skipped: 0, Time elapsed: 2.76 sec - in org.apache.maven.plugins.dependency.fromConfiguration.TestCopyMojo
Running org.apache.maven.plugins.dependency.fromConfiguration.TestUnpackMojo
unpackedFile 2015-12-31T22:04:55 /target/unit-tests/unpack/outputDirectory/testGroupId-snapshot-2.0-SNAPSHOT-null-jar.txt
artifact     2015-12-31T22:05:00 /target/unit-tests/unpack/localTestRepo/testGroupId/snapshot/2.0-SNAPSHOT/snapshot-2.0-SNAPSHOT.jar
marker       2015-12-31T22:04:55 /target/unit-tests/unpack/markers/testGroupId-snapshot-jar-2.0-SNAPSHOT.marker
mojo.execute()
unpackedFile 2015-12-31T22:04:18 /target/unit-tests/unpack/outputDirectory/testGroupId-snapshot-2.0-SNAPSHOT-null-jar.txt
artifact     2015-12-31T22:05:00 /target/unit-tests/unpack/localTestRepo/testGroupId/snapshot/2.0-SNAPSHOT/snapshot-2.0-SNAPSHOT.jar
marker       2015-12-31T22:05:00 /target/unit-tests/unpack/markers/testGroupId-snapshot-jar-2.0-SNAPSHOT.marker
marker.lastModified() = 1451599500000
unpackedFile.lastModified() = 1451599458000
Tests run: 17, Failures: 0, Errors: 0, Skipped: 0, Time elapsed: 2.598 sec - in org.apache.maven.plugins.dependency.fromConfiguration.TestUnpackMojo

Results :

Tests run: 237, Failures: 0, Errors: 0, Skipped: 0

[INFO] 
[INFO] --- maven-jar-plugin:2.5:jar (default-jar) @ maven-dependency-plugin ---
[INFO] Building jar: /x1/jenkins/jenkins-slave/workspace/maven-plugins-ITs-m3/maven-dependency-plugin/target/maven-dependency-plugin-3.0-SNAPSHOT.jar
[INFO] 
[INFO] --- maven-plugin-plugin:3.4:addPluginArtifactMetadata (default-addPluginArtifactMetadata)
@ maven-dependency-plugin ---
[INFO] 
[INFO] --- maven-invoker-plugin:2.0.0:install (integration-test) @ maven-dependency-plugin
---
[INFO] Installing /x1/jenkins/jenkins-slave/workspace/maven-plugins-ITs-m3/maven-acr-plugin/pom.xml
to /x1/jenkins/jenkins-slave/workspace/maven-plugins-ITs-m3/maven-dependency-plugin/target/local-repo/org/apache/maven/plugins/maven-acr-plugin/1.2-SNAPSHOT/maven-acr-plugin-1.2-SNAPSHOT.pom
[INFO] Installing /x1/jenkins/jenkins-slave/workspace/maven-plugins-ITs-m3/maven-acr-plugin/target/maven-acr-plugin-1.2-SNAPSHOT.jar
to /x1/jenkins/jenkins-slave/workspace/maven-plugins-ITs-m3/maven-dependency-plugin/target/local-repo/org/apache/maven/plugins/maven-acr-plugin/1.2-SNAPSHOT/maven-acr-plugin-1.2-SNAPSHOT.jar
[INFO] Installing /x1/jenkins/jenkins-slave/workspace/maven-plugins-ITs-m3/maven-acr-plugin/pom.xml
to /x1/jenkins/jenkins-slave/workspace/maven-plugins-ITs-m3/maven-dependency-plugin/target/local-repo/org/apache/maven/plugins/maven-acr-plugin/1.2-SNAPSHOT/maven-acr-plugin-1.2-SNAPSHOT.pom
[INFO] Installing /x1/jenkins/jenkins-slave/workspace/maven-plugins-ITs-m3/maven-ant-plugin/pom.xml
to /x1/jenkins/jenkins-slave/workspace/maven-plugins-ITs-m3/maven-dependency-plugin/target/local-repo/org/apache/maven/plugins/maven-ant-plugin/2.5-SNAPSHOT/maven-ant-plugin-2.5-SNAPSHOT.pom
[INFO] Installing /x1/jenkins/jenkins-slave/workspace/maven-plugins-ITs-m3/maven-ant-plugin/target/maven-ant-plugin-2.5-SNAPSHOT.jar
to /x1/jenkins/jenkins-slave/workspace/maven-plugins-ITs-m3/maven-dependency-plugin/target/local-repo/org/apache/maven/plugins/maven-ant-plugin/2.5-SNAPSHOT/maven-ant-plugin-2.5-SNAPSHOT.jar
[INFO] Installing /x1/jenkins/jenkins-slave/workspace/maven-plugins-ITs-m3/maven-ant-plugin/pom.xml
to /x1/jenkins/jenkins-slave/workspace/maven-plugins-ITs-m3/maven-dependency-plugin/target/local-repo/org/apache/maven/plugins/maven-ant-plugin/2.5-SNAPSHOT/maven-ant-plugin-2.5-SNAPSHOT.pom
[INFO] Installing /x1/jenkins/jenkins-slave/workspace/maven-plugins-ITs-m3/maven-antrun-plugin/pom.xml
to /x1/jenkins/jenkins-slave/workspace/maven-plugins-ITs-m3/maven-dependency-plugin/target/local-repo/org/apache/maven/plugins/maven-antrun-plugin/1.9-SNAPSHOT/maven-antrun-plugin-1.9-SNAPSHOT.pom
[INFO] Installing /x1/jenkins/jenkins-slave/workspace/maven-plugins-ITs-m3/maven-antrun-plugin/target/maven-antrun-plugin-1.9-SNAPSHOT.jar
to /x1/jenkins/jenkins-slave/workspace/maven-plugins-ITs-m3/maven-dependency-plugin/target/local-repo/org/apache/maven/plugins/maven-antrun-plugin/1.9-SNAPSHOT/maven-antrun-plugin-1.9-SNAPSHOT.jar
[INFO] Installing /x1/jenkins/jenkins-slave/workspace/maven-plugins-ITs-m3/maven-antrun-plugin/pom.xml
to /x1/jenkins/jenkins-slave/workspace/maven-plugins-ITs-m3/maven-dependency-plugin/target/local-repo/org/apache/maven/plugins/maven-antrun-plugin/1.9-SNAPSHOT/maven-antrun-plugin-1.9-SNAPSHOT.pom
[INFO] Installing /x1/jenkins/jenkins-slave/workspace/maven-plugins-ITs-m3/maven-changelog-plugin/pom.xml
to /x1/jenkins/jenkins-slave/workspace/maven-plugins-ITs-m3/maven-dependency-plugin/target/local-repo/org/apache/maven/plugins/maven-changelog-plugin/2.4-SNAPSHOT/maven-changelog-plugin-2.4-SNAPSHOT.pom
[INFO] Installing /x1/jenkins/jenkins-slave/workspace/maven-plugins-ITs-m3/maven-changelog-plugin/target/maven-changelog-plugin-2.4-SNAPSHOT.jar
to /x1/jenkins/jenkins-slave/workspace/maven-plugins-ITs-m3/maven-dependency-plugin/target/local-repo/org/apache/maven/plugins/maven-changelog-plugin/2.4-SNAPSHOT/maven-changelog-plugin-2.4-SNAPSHOT.jar
[INFO] Installing /x1/jenkins/jenkins-slave/workspace/maven-plugins-ITs-m3/maven-changes-plugin/pom.xml
to /x1/jenkins/jenkins-slave/workspace/maven-plugins-ITs-m3/maven-dependency-plugin/target/local-repo/org/apache/maven/plugins/maven-changes-plugin/2.12-SNAPSHOT/maven-changes-plugin-2.12-SNAPSHOT.pom
[INFO]                                                                         
[INFO] ------------------------------------------------------------------------
[INFO] Building Apache Maven GPG Plugin 1.7-SNAPSHOT
[INFO] ------------------------------------------------------------------------
[INFO] 
[INFO] --- maven-clean-plugin:2.5:clean (default-clean) @ maven-gpg-plugin ---
[INFO] Deleting /x1/jenkins/jenkins-slave/workspace/maven-plugins-ITs-m3/maven-gpg-plugin/target
[INFO] 
[INFO] --- maven-enforcer-plugin:1.3.1:enforce (enforce-bytecode-version) @ maven-gpg-plugin
---
[INFO] 
[INFO] --- maven-enforcer-plugin:1.3.1:enforce (ban-known-bad-maven-versions) @ maven-gpg-plugin
---
[INFO] 
[INFO] --- maven-enforcer-plugin:1.3.1:enforce (ensure-no-container-api) @ maven-gpg-plugin
---
[INFO] 
[INFO] --- apache-rat-plugin:0.11:check (rat-check) @ maven-gpg-plugin ---
[INFO] 51 implicit excludes (use -debug for more details).
[INFO] Exclude: src/test/resources/gnupg/*
[INFO] Exclude: DEPENDENCIES
[INFO] 66 resources included (use -debug for more details)
[INFO] Rat check: Summary of files. Unapproved: 0 unknown: 0 generated: 0 approved: 54 licence.
[INFO] 
[INFO] --- maven-plugin-plugin:3.4:helpmojo (generate-helpmojo) @ maven-gpg-plugin ---
[INFO] Using 'UTF-8' encoding to read mojo metadata.
[INFO] Mojo extractor with id: java-annotations found 0 mojo descriptors.
[INFO] Mojo extractor with id: java-javadoc found 0 mojo descriptors.
[INFO] 
[INFO] --- maven-remote-resources-plugin:1.5:process (default) @ maven-gpg-plugin ---
[INFO] 
[INFO] --- maven-resources-plugin:2.7:resources (default-resources) @ maven-gpg-plugin ---
[INFO] Using 'UTF-8' encoding to copy filtered resources.
[INFO] Copying 1 resource
[INFO] Copying 3 resources
[INFO] 
[INFO] --- maven-compiler-plugin:3.2:compile (default-compile) @ maven-gpg-plugin ---
[INFO] Changes detected - recompiling the module!
[INFO] Compiling 9 source files to /x1/jenkins/jenkins-slave/workspace/maven-plugins-ITs-m3/maven-gpg-plugin/target/classes
[INFO] Some input files use unchecked or unsafe operations.
[INFO] Recompile with -Xlint:unchecked for details.
[INFO] 
[INFO] --- maven-plugin-plugin:3.4:descriptor (default-descriptor) @ maven-gpg-plugin ---
[INFO] Using 'UTF-8' encoding to read mojo metadata.
[INFO] Mojo extractor with id: java-annotations found 3 mojo descriptors.
[INFO] Mojo extractor with id: java-javadoc found 0 mojo descriptors.
[INFO] 
[INFO] --- maven-resources-plugin:2.7:testResources (default-testResources) @ maven-gpg-plugin
---
[INFO] Using 'UTF-8' encoding to copy filtered resources.
[INFO] Copying 8 resources
[INFO] Copying 3 resources
[INFO] 
[INFO] --- maven-compiler-plugin:3.2:testCompile (default-testCompile) @ maven-gpg-plugin
---
[INFO] No sources to compile
[INFO] 
[INFO] --- maven-surefire-plugin:2.18.1:test (default-test) @ maven-gpg-plugin ---
[INFO] 
[INFO] --- maven-jar-plugin:2.5:jar (default-jar) @ maven-gpg-plugin ---
[INFO] Building jar: /x1/jenkins/jenkins-slave/workspace/maven-plugins-ITs-m3/maven-gpg-plugin/target/maven-gpg-plugin-1.7-SNAPSHOT.jar
[INFO] 
[INFO] --- maven-plugin-plugin:3.4:addPluginArtifactMetadata (default-addPluginArtifactMetadata)
@ maven-gpg-plugin ---
[INFO] 
[INFO] --- maven-invoker-plugin:2.0.0:install (integration-test) @ maven-gpg-plugin ---
[INFO] Installing /x1/jenkins/jenkins-slave/workspace/maven-plugins-ITs-m3/maven-acr-plugin/pom.xml
to /x1/jenkins/jenkins-slave/workspace/maven-plugins-ITs-m3/maven-gpg-plugin/target/local-repo/org/apache/maven/plugins/maven-acr-plugin/1.2-SNAPSHOT/maven-acr-plugin-1.2-SNAPSHOT.pom
[INFO] Installing /x1/jenkins/jenkins-slave/workspace/maven-plugins-ITs-m3/maven-acr-plugin/target/maven-acr-plugin-1.2-SNAPSHOT.jar
to /x1/jenkins/jenkins-slave/workspace/maven-plugins-ITs-m3/maven-gpg-plugin/target/local-repo/org/apache/maven/plugins/maven-acr-plugin/1.2-SNAPSHOT/maven-acr-plugin-1.2-SNAPSHOT.jar
[INFO] Installing /x1/jenkins/jenkins-slave/workspace/maven-plugins-ITs-m3/maven-acr-plugin/pom.xml
to /x1/jenkins/jenkins-slave/workspace/maven-plugins-ITs-m3/maven-gpg-plugin/target/local-repo/org/apache/maven/plugins/maven-acr-plugin/1.2-SNAPSHOT/maven-acr-plugin-1.2-SNAPSHOT.pom
[INFO] Installing /x1/jenkins/jenkins-slave/workspace/maven-plugins-ITs-m3/maven-ant-plugin/pom.xml
to /x1/jenkins/jenkins-slave/workspace/maven-plugins-ITs-m3/maven-gpg-plugin/target/local-repo/org/apache/maven/plugins/maven-ant-plugin/2.5-SNAPSHOT/maven-ant-plugin-2.5-SNAPSHOT.pom
[INFO] Installing /x1/jenkins/jenkins-slave/workspace/maven-plugins-ITs-m3/maven-ant-plugin/target/maven-ant-plugin-2.5-SNAPSHOT.jar
to /x1/jenkins/jenkins-slave/workspace/maven-plugins-ITs-m3/maven-gpg-plugin/target/local-repo/org/apache/maven/plugins/maven-ant-plugin/2.5-SNAPSHOT/maven-ant-plugin-2.5-SNAPSHOT.jar
[INFO] Installing /x1/jenkins/jenkins-slave/workspace/maven-plugins-ITs-m3/maven-ant-plugin/pom.xml
to /x1/jenkins/jenkins-slave/workspace/maven-plugins-ITs-m3/maven-gpg-plugin/target/local-repo/org/apache/maven/plugins/maven-ant-plugin/2.5-SNAPSHOT/maven-ant-plugin-2.5-SNAPSHOT.pom
[INFO] Installing /x1/jenkins/jenkins-slave/workspace/maven-plugins-ITs-m3/maven-antrun-plugin/pom.xml
to /x1/jenkins/jenkins-slave/workspace/maven-plugins-ITs-m3/maven-gpg-plugin/target/local-repo/org/apache/maven/plugins/maven-antrun-plugin/1.9-SNAPSHOT/maven-antrun-plugin-1.9-SNAPSHOT.pom
[INFO] Installing /x1/jenkins/jenkins-slave/workspace/maven-plugins-ITs-m3/maven-antrun-plugin/target/maven-antrun-plugin-1.9-SNAPSHOT.jar
to /x1/jenkins/jenkins-slave/workspace/maven-plugins-ITs-m3/maven-gpg-plugin/target/local-repo/org/apache/maven/plugins/maven-antrun-plugin/1.9-SNAPSHOT/maven-antrun-plugin-1.9-SNAPSHOT.jar
[INFO] Installing /x1/jenkins/jenkins-slave/workspace/maven-plugins-ITs-m3/maven-antrun-plugin/pom.xml
to /x1/jenkins/jenkins-slave/workspace/maven-plugins-ITs-m3/maven-gpg-plugin/target/local-repo/org/apache/maven/plugins/maven-antrun-plugin/1.9-SNAPSHOT/maven-antrun-plugin-1.9-SNAPSHOT.pom
[INFO] Installing /x1/jenkins/jenkins-slave/workspace/maven-plugins-ITs-m3/maven-changelog-plugin/pom.xml
to /x1/jenkins/jenkins-slave/workspace/maven-plugins-ITs-m3/maven-gpg-plugin/target/local-repo/org/apache/maven/plugins/maven-changelog-plugin/2.4-SNAPSHOT/maven-changelog-plugin-2.4-SNAPSHOT.pom
[INFO] Installing /x1/jenkins/jenkins-slave/workspace/maven-plugins-ITs-m3/maven-changelog-plugin/target/maven-changelog-plugin-2.4-SNAPSHOT.jar
to /x1/jenkins/jenkins-slave/workspace/maven-plugins-ITs-m3/maven-gpg-plugin/target/local-repo/org/apache/maven/plugins/maven-changelog-plugin/2.4-SNAPSHOT/maven-changelog-plugin-2.4-SNAPSHOT.jar
[INFO] Installing /x1/jenkins/jenkins-slave/workspace/maven-plugins-ITs-m3/maven-changes-plugin/pom.xml
to /x1/jenkins/jenkins-slave/workspace/maven-plugins-ITs-m3/maven-gpg-plugin/target/local-repo/org/apache/maven/plugins/maven-changes-plugin/2.12-SNAPSHOT/maven-changes-plugin-2.12-SNAPSHOT.pom
[INFO]                                                                         
[INFO] ------------------------------------------------------------------------
[INFO] Building Apache Maven Plugins Aggregator 1-SNAPSHOT
[INFO] ------------------------------------------------------------------------
[INFO] 
[INFO] --- maven-clean-plugin:2.5:clean (default-clean) @ maven-plugins-aggregator ---
[INFO] Deleting /x1/jenkins/jenkins-slave/workspace/maven-plugins-ITs-m3/target
[INFO] 
[INFO] --- maven-enforcer-plugin:1.3.1:enforce (enforce-bytecode-version) @ maven-plugins-aggregator
---
[INFO] 
[INFO] --- maven-enforcer-plugin:1.3.1:enforce (ban-known-bad-maven-versions) @ maven-plugins-aggregator
---
[INFO] 
[INFO] --- maven-remote-resources-plugin:1.5:process (default) @ maven-plugins-aggregator
---
[INFO] 
[INFO] --- maven-site-plugin:3.3:attach-descriptor (attach-descriptor) @ maven-plugins-aggregator
---
[INFO] 
[INFO] --- maven-install-plugin:2.5.1:install (default-install) @ maven-plugins-aggregator
---
[INFO] Installing /x1/jenkins/jenkins-slave/workspace/maven-plugins-ITs-m3/pom.xml to /home/jenkins/.m2/repository/org/apache/maven/plugins/maven-plugins-aggregator/1-SNAPSHOT/maven-plugins-aggregator-1-SNAPSHOT.pom
[INFO] ------------------------------------------------------------------------
[INFO] Reactor Summary:
[INFO] 
[INFO] Apache Maven ACR Plugin ........................... SUCCESS [ 20.244 s]
[INFO] Apache Maven Ant Plugin ........................... SUCCESS [01:13 min]
[INFO] Apache Maven AntRun Plugin ........................ SUCCESS [ 46.195 s]
[INFO] Apache Maven Changelog Plugin ..................... FAILURE [02:04 min]
[INFO] Apache Maven Changes Plugin ....................... FAILURE [ 17.652 s]
[INFO] Apache Maven Clean Plugin ......................... FAILURE [  3.263 s]
[INFO] Apache Maven Compiler Plugin ...................... FAILURE [ 13.396 s]
[INFO] Apache Maven Deploy Plugin ........................ FAILURE [  5.814 s]
[INFO] Apache Maven Documentation Checker Plugin ......... FAILURE [  1.103 s]
[INFO] Apache Maven EAR Plugin ........................... FAILURE [  5.083 s]
[INFO] Apache Maven EJB Plugin ........................... FAILURE [  5.569 s]
[INFO] Apache Maven Help Plugin .......................... FAILURE [  2.866 s]
[INFO] Apache Maven Install Plugin ....................... FAILURE [  5.413 s]
[INFO] Apache Maven Jarsigner Plugin ..................... FAILURE [  1.680 s]
[INFO] Apache Maven Javadoc Plugin ....................... FAILURE [09:30 min]
[INFO] Apache Maven Linkcheck Plugin ..................... FAILURE [  3.043 s]
[INFO] Apache Maven Patch Plugin ......................... FAILURE [  0.532 s]
[INFO] Apache Maven PDF Plugin ........................... FAILURE [ 10.312 s]
[INFO] Apache Maven RAR Plugin ........................... FAILURE [  3.556 s]
[INFO] Apache Maven Repository Plugin .................... FAILURE [  3.956 s]
[INFO] Apache Maven Resources Plugin ..................... FAILURE [  6.029 s]
[INFO] Apache Maven Site Plugin .......................... FAILURE [ 10.624 s]
[INFO] Apache Maven Source Plugin ........................ FAILURE [  4.604 s]
[INFO] Apache Maven Stage Plugin ......................... FAILURE [  1.735 s]
[INFO] Apache Maven Toolchains Plugin .................... FAILURE [  2.136 s]
[INFO] Apache Maven Verifier Plugin ...................... FAILURE [  1.263 s]
[INFO] Apache Maven WAR Plugin ........................... FAILURE [  8.263 s]
[INFO] Apache Maven DOAP Plugin .......................... FAILURE [ 30.887 s]
[INFO] Apache Maven PMD Plugin ........................... FAILURE [ 14.719 s]
[INFO] Apache Maven Invoker Plugin ....................... FAILURE [  7.501 s]
[INFO] Apache Maven JAR Plugin ........................... FAILURE [  2.673 s]
[INFO] Apache Maven Project Info Reports Plugin .......... FAILURE [01:34 min]
[INFO] Apache Maven Remote Resources Plugin .............. FAILURE [  4.323 s]
[INFO] Apache Maven Shade Plugin ......................... FAILURE [  6.073 s]
[INFO] Apache Maven SCM Publish Plugin ................... FAILURE [  3.600 s]
[INFO] Apache Maven Assembly Plugin ...................... FAILURE [02:54 min]
[INFO] Apache Maven Dependency Plugin .................... FAILURE [ 52.131 s]
[INFO] Apache Maven GPG Plugin ........................... FAILURE [  0.957 s]
[INFO] Apache Maven Plugins Aggregator ................... SUCCESS [  0.400 s]
[INFO] ------------------------------------------------------------------------
[INFO] BUILD FAILURE
[INFO] ------------------------------------------------------------------------
[INFO] Total time: 22:27 min
[INFO] Finished at: 2015-12-31T22:05:08+00:00
[INFO] Final Memory: 79M/372M
[INFO] ------------------------------------------------------------------------
[WARNING] The requested profile "apache.snapshots" could not be activated because it does
not exist.
[ERROR] Failed to execute goal org.apache.maven.plugins:maven-invoker-plugin:2.0.0:verify
(integration-test) on project maven-changelog-plugin: 1 build failed. See console output above
for details. -> [Help 1]
[ERROR] Failed to execute goal org.apache.maven.plugins:maven-surefire-plugin:2.18.1:test
(default-test) on project maven-changes-plugin: There are test failures.
[ERROR] 
[ERROR] Please refer to /x1/jenkins/jenkins-slave/workspace/maven-plugins-ITs-m3/maven-changes-plugin/target/surefire-reports
for the individual test results.
[ERROR] -> [Help 1]
[ERROR] Failed to execute goal org.apache.maven.plugins:maven-invoker-plugin:2.0.0:install
(integration-test) on project maven-clean-plugin: Failed to install project dependencies:
MavenProject: org.apache.maven.plugins:maven-clean-plugin:3.0.1-SNAPSHOT @ /x1/jenkins/jenkins-slave/workspace/maven-plugins-ITs-m3/maven-clean-plugin/pom.xml:
Failed to install project artifacts: MavenProject: org.apache.maven.plugins:maven-changes-plugin:2.12-SNAPSHOT
@ /x1/jenkins/jenkins-slave/workspace/maven-plugins-ITs-m3/maven-changes-plugin/pom.xml: Failed
to install artifact: org.apache.maven.plugins:maven-changes-plugin:maven-plugin:2.12-SNAPSHOT:
Artifact is not fully assembled: /x1/jenkins/jenkins-slave/workspace/maven-plugins-ITs-m3/maven-changes-plugin/target/classes
-> [Help 2]
[ERROR] Failed to execute goal org.apache.maven.plugins:maven-invoker-plugin:2.0.0:install
(integration-test) on project maven-compiler-plugin: Failed to install project dependencies:
MavenProject: org.apache.maven.plugins:maven-compiler-plugin:3.5-SNAPSHOT @ /x1/jenkins/jenkins-slave/workspace/maven-plugins-ITs-m3/maven-compiler-plugin/pom.xml:
Failed to install project artifacts: MavenProject: org.apache.maven.plugins:maven-changes-plugin:2.12-SNAPSHOT
@ /x1/jenkins/jenkins-slave/workspace/maven-plugins-ITs-m3/maven-changes-plugin/pom.xml: Failed
to install artifact: org.apache.maven.plugins:maven-changes-plugin:maven-plugin:2.12-SNAPSHOT:
Artifact is not fully assembled: /x1/jenkins/jenkins-slave/workspace/maven-plugins-ITs-m3/maven-changes-plugin/target/classes
-> [Help 2]
[ERROR] Failed to execute goal org.apache.maven.plugins:maven-invoker-plugin:2.0.0:install
(integration-test) on project maven-deploy-plugin: Failed to install project dependencies:
MavenProject: org.apache.maven.plugins:maven-deploy-plugin:3.0-SNAPSHOT @ /x1/jenkins/jenkins-slave/workspace/maven-plugins-ITs-m3/maven-deploy-plugin/pom.xml:
Failed to install project artifacts: MavenProject: org.apache.maven.plugins:maven-changes-plugin:2.12-SNAPSHOT
@ /x1/jenkins/jenkins-slave/workspace/maven-plugins-ITs-m3/maven-changes-plugin/pom.xml: Failed
to install artifact: org.apache.maven.plugins:maven-changes-plugin:maven-plugin:2.12-SNAPSHOT:
Artifact is not fully assembled: /x1/jenkins/jenkins-slave/workspace/maven-plugins-ITs-m3/maven-changes-plugin/target/classes
-> [Help 2]
[ERROR] Failed to execute goal org.apache.maven.plugins:maven-invoker-plugin:2.0.0:install
(integration-test) on project maven-docck-plugin: Failed to install project dependencies:
MavenProject: org.apache.maven.plugins:maven-docck-plugin:1.2-SNAPSHOT @ /x1/jenkins/jenkins-slave/workspace/maven-plugins-ITs-m3/maven-docck-plugin/pom.xml:
Failed to install project artifacts: MavenProject: org.apache.maven.plugins:maven-changes-plugin:2.12-SNAPSHOT
@ /x1/jenkins/jenkins-slave/workspace/maven-plugins-ITs-m3/maven-changes-plugin/pom.xml: Failed
to install artifact: org.apache.maven.plugins:maven-changes-plugin:maven-plugin:2.12-SNAPSHOT:
Artifact is not fully assembled: /x1/jenkins/jenkins-slave/workspace/maven-plugins-ITs-m3/maven-changes-plugin/target/classes
-> [Help 2]
[ERROR] Failed to execute goal org.apache.maven.plugins:maven-invoker-plugin:2.0.0:install
(integration-test) on project maven-ear-plugin: Failed to install project dependencies: MavenProject:
org.apache.maven.plugins:maven-ear-plugin:2.10.2-SNAPSHOT @ /x1/jenkins/jenkins-slave/workspace/maven-plugins-ITs-m3/maven-ear-plugin/pom.xml:
Failed to install project artifacts: MavenProject: org.apache.maven.plugins:maven-changes-plugin:2.12-SNAPSHOT
@ /x1/jenkins/jenkins-slave/workspace/maven-plugins-ITs-m3/maven-changes-plugin/pom.xml: Failed
to install artifact: org.apache.maven.plugins:maven-changes-plugin:maven-plugin:2.12-SNAPSHOT:
Artifact is not fully assembled: /x1/jenkins/jenkins-slave/workspace/maven-plugins-ITs-m3/maven-changes-plugin/target/classes
-> [Help 2]
[ERROR] Failed to execute goal org.apache.maven.plugins:maven-invoker-plugin:2.0.0:install
(integration-test) on project maven-ejb-plugin: Failed to install project dependencies: MavenProject:
org.apache.maven.plugins:maven-ejb-plugin:2.5.2-SNAPSHOT @ /x1/jenkins/jenkins-slave/workspace/maven-plugins-ITs-m3/maven-ejb-plugin/pom.xml:
Failed to install project artifacts: MavenProject: org.apache.maven.plugins:maven-changes-plugin:2.12-SNAPSHOT
@ /x1/jenkins/jenkins-slave/workspace/maven-plugins-ITs-m3/maven-changes-plugin/pom.xml: Failed
to install artifact: org.apache.maven.plugins:maven-changes-plugin:maven-plugin:2.12-SNAPSHOT:
Artifact is not fully assembled: /x1/jenkins/jenkins-slave/workspace/maven-plugins-ITs-m3/maven-changes-plugin/target/classes
-> [Help 2]
[ERROR] Failed to execute goal org.apache.maven.plugins:maven-invoker-plugin:2.0.0:install
(integration-test) on project maven-help-plugin: Failed to install project dependencies: MavenProject:
org.apache.maven.plugins:maven-help-plugin:2.2.1-SNAPSHOT @ /x1/jenkins/jenkins-slave/workspace/maven-plugins-ITs-m3/maven-help-plugin/pom.xml:
Failed to install project artifacts: MavenProject: org.apache.maven.plugins:maven-changes-plugin:2.12-SNAPSHOT
@ /x1/jenkins/jenkins-slave/workspace/maven-plugins-ITs-m3/maven-changes-plugin/pom.xml: Failed
to install artifact: org.apache.maven.plugins:maven-changes-plugin:maven-plugin:2.12-SNAPSHOT:
Artifact is not fully assembled: /x1/jenkins/jenkins-slave/workspace/maven-plugins-ITs-m3/maven-changes-plugin/target/classes
-> [Help 2]
[ERROR] Failed to execute goal org.apache.maven.plugins:maven-invoker-plugin:1.10:install
(integration-test) on project maven-install-plugin: Failed to install project dependencies:
MavenProject: org.apache.maven.plugins:maven-install-plugin:3.0-SNAPSHOT @ /x1/jenkins/jenkins-slave/workspace/maven-plugins-ITs-m3/maven-install-plugin/pom.xml:
Failed to install project artifacts: MavenProject: org.apache.maven.plugins:maven-changes-plugin:2.12-SNAPSHOT
@ /x1/jenkins/jenkins-slave/workspace/maven-plugins-ITs-m3/maven-changes-plugin/pom.xml: Failed
to install artifact: org.apache.maven.plugins:maven-changes-plugin:maven-plugin:2.12-SNAPSHOT:
Artifact is not fully assembled: /x1/jenkins/jenkins-slave/workspace/maven-plugins-ITs-m3/maven-changes-plugin/target/classes
-> [Help 2]
[ERROR] Failed to execute goal org.apache.maven.plugins:maven-invoker-plugin:2.0.0:install
(integration-test) on project maven-jarsigner-plugin: Failed to install project dependencies:
MavenProject: org.apache.maven.plugins:maven-jarsigner-plugin:1.5-SNAPSHOT @ /x1/jenkins/jenkins-slave/workspace/maven-plugins-ITs-m3/maven-jarsigner-plugin/pom.xml:
Failed to install project artifacts: MavenProject: org.apache.maven.plugins:maven-changes-plugin:2.12-SNAPSHOT
@ /x1/jenkins/jenkins-slave/workspace/maven-plugins-ITs-m3/maven-changes-plugin/pom.xml: Failed
to install artifact: org.apache.maven.plugins:maven-changes-plugin:maven-plugin:2.12-SNAPSHOT:
Artifact is not fully assembled: /x1/jenkins/jenkins-slave/workspace/maven-plugins-ITs-m3/maven-changes-plugin/target/classes
-> [Help 2]
[ERROR] Failed to execute goal org.apache.maven.plugins:maven-surefire-plugin:2.18.1:test
(default-test) on project maven-javadoc-plugin: There are test failures.
[ERROR] 
[ERROR] Please refer to /x1/jenkins/jenkins-slave/workspace/maven-plugins-ITs-m3/maven-javadoc-plugin/target/surefire-reports
for the individual test results.
[ERROR] -> [Help 1]
[ERROR] Failed to execute goal org.apache.maven.plugins:maven-invoker-plugin:2.0.0:install
(integration-test) on project maven-linkcheck-plugin: Failed to install project dependencies:
MavenProject: org.apache.maven.plugins:maven-linkcheck-plugin:1.3-SNAPSHOT @ /x1/jenkins/jenkins-slave/workspace/maven-plugins-ITs-m3/maven-linkcheck-plugin/pom.xml:
Failed to install project artifacts: MavenProject: org.apache.maven.plugins:maven-changes-plugin:2.12-SNAPSHOT
@ /x1/jenkins/jenkins-slave/workspace/maven-plugins-ITs-m3/maven-changes-plugin/pom.xml: Failed
to install artifact: org.apache.maven.plugins:maven-changes-plugin:maven-plugin:2.12-SNAPSHOT:
Artifact is not fully assembled: /x1/jenkins/jenkins-slave/workspace/maven-plugins-ITs-m3/maven-changes-plugin/target/classes
-> [Help 2]
[ERROR] Failed to execute goal org.apache.maven.plugins:maven-invoker-plugin:2.0.0:install
(integration-test) on project maven-patch-plugin: Failed to install project dependencies:
MavenProject: org.apache.maven.plugins:maven-patch-plugin:1.3-SNAPSHOT @ /x1/jenkins/jenkins-slave/workspace/maven-plugins-ITs-m3/maven-patch-plugin/pom.xml:
Failed to install project artifacts: MavenProject: org.apache.maven.plugins:maven-changes-plugin:2.12-SNAPSHOT
@ /x1/jenkins/jenkins-slave/workspace/maven-plugins-ITs-m3/maven-changes-plugin/pom.xml: Failed
to install artifact: org.apache.maven.plugins:maven-changes-plugin:maven-plugin:2.12-SNAPSHOT:
Artifact is not fully assembled: /x1/jenkins/jenkins-slave/workspace/maven-plugins-ITs-m3/maven-changes-plugin/target/classes
-> [Help 2]
[ERROR] Failed to execute goal org.apache.maven.plugins:maven-invoker-plugin:2.0.0:install
(integration-test) on project maven-pdf-plugin: Failed to install project dependencies: MavenProject:
org.apache.maven.plugins:maven-pdf-plugin:1.4-SNAPSHOT @ /x1/jenkins/jenkins-slave/workspace/maven-plugins-ITs-m3/maven-pdf-plugin/pom.xml:
Failed to install project artifacts: MavenProject: org.apache.maven.plugins:maven-changes-plugin:2.12-SNAPSHOT
@ /x1/jenkins/jenkins-slave/workspace/maven-plugins-ITs-m3/maven-changes-plugin/pom.xml: Failed
to install artifact: org.apache.maven.plugins:maven-changes-plugin:maven-plugin:2.12-SNAPSHOT:
Artifact is not fully assembled: /x1/jenkins/jenkins-slave/workspace/maven-plugins-ITs-m3/maven-changes-plugin/target/classes
-> [Help 2]
[ERROR] Failed to execute goal org.apache.maven.plugins:maven-invoker-plugin:2.0.0:install
(integration-test) on project maven-rar-plugin: Failed to install project dependencies: MavenProject:
org.apache.maven.plugins:maven-rar-plugin:2.5-SNAPSHOT @ /x1/jenkins/jenkins-slave/workspace/maven-plugins-ITs-m3/maven-rar-plugin/pom.xml:
Failed to install project artifacts: MavenProject: org.apache.maven.plugins:maven-changes-plugin:2.12-SNAPSHOT
@ /x1/jenkins/jenkins-slave/workspace/maven-plugins-ITs-m3/maven-changes-plugin/pom.xml: Failed
to install artifact: org.apache.maven.plugins:maven-changes-plugin:maven-plugin:2.12-SNAPSHOT:
Artifact is not fully assembled: /x1/jenkins/jenkins-slave/workspace/maven-plugins-ITs-m3/maven-changes-plugin/target/classes
-> [Help 2]
[ERROR] Failed to execute goal org.apache.maven.plugins:maven-invoker-plugin:2.0.0:install
(integration-test) on project maven-repository-plugin: Failed to install project dependencies:
MavenProject: org.apache.maven.plugins:maven-repository-plugin:2.5-SNAPSHOT @ /x1/jenkins/jenkins-slave/workspace/maven-plugins-ITs-m3/maven-repository-plugin/pom.xml:
Failed to install project artifacts: MavenProject: org.apache.maven.plugins:maven-changes-plugin:2.12-SNAPSHOT
@ /x1/jenkins/jenkins-slave/workspace/maven-plugins-ITs-m3/maven-changes-plugin/pom.xml: Failed
to install artifact: org.apache.maven.plugins:maven-changes-plugin:maven-plugin:2.12-SNAPSHOT:
Artifact is not fully assembled: /x1/jenkins/jenkins-slave/workspace/maven-plugins-ITs-m3/maven-changes-plugin/target/classes
-> [Help 2]
[ERROR] Failed to execute goal org.apache.maven.plugins:maven-invoker-plugin:2.0.0:install
(integration-test) on project maven-resources-plugin: Failed to install project dependencies:
MavenProject: org.apache.maven.plugins:maven-resources-plugin:2.8-SNAPSHOT @ /x1/jenkins/jenkins-slave/workspace/maven-plugins-ITs-m3/maven-resources-plugin/pom.xml:
Failed to install project artifacts: MavenProject: org.apache.maven.plugins:maven-changes-plugin:2.12-SNAPSHOT
@ /x1/jenkins/jenkins-slave/workspace/maven-plugins-ITs-m3/maven-changes-plugin/pom.xml: Failed
to install artifact: org.apache.maven.plugins:maven-changes-plugin:maven-plugin:2.12-SNAPSHOT:
Artifact is not fully assembled: /x1/jenkins/jenkins-slave/workspace/maven-plugins-ITs-m3/maven-changes-plugin/target/classes
-> [Help 2]
[ERROR] Failed to execute goal org.apache.maven.plugins:maven-invoker-plugin:2.0.0:install
(integration-test) on project maven-site-plugin: Failed to install project dependencies: MavenProject:
org.apache.maven.plugins:maven-site-plugin:3.5-SNAPSHOT @ /x1/jenkins/jenkins-slave/workspace/maven-plugins-ITs-m3/maven-site-plugin/dependency-reduced-pom.xml:
Failed to install project artifacts: MavenProject: org.apache.maven.plugins:maven-changes-plugin:2.12-SNAPSHOT
@ /x1/jenkins/jenkins-slave/workspace/maven-plugins-ITs-m3/maven-changes-plugin/pom.xml: Failed
to install artifact: org.apache.maven.plugins:maven-changes-plugin:maven-plugin:2.12-SNAPSHOT:
Artifact is not fully assembled: /x1/jenkins/jenkins-slave/workspace/maven-plugins-ITs-m3/maven-changes-plugin/target/classes
-> [Help 2]
[ERROR] Failed to execute goal org.apache.maven.plugins:maven-invoker-plugin:2.0.0:install
(integration-test) on project maven-source-plugin: Failed to install project dependencies:
MavenProject: org.apache.maven.plugins:maven-source-plugin:3.0.0-SNAPSHOT @ /x1/jenkins/jenkins-slave/workspace/maven-plugins-ITs-m3/maven-source-plugin/pom.xml:
Failed to install project artifacts: MavenProject: org.apache.maven.plugins:maven-changes-plugin:2.12-SNAPSHOT
@ /x1/jenkins/jenkins-slave/workspace/maven-plugins-ITs-m3/maven-changes-plugin/pom.xml: Failed
to install artifact: org.apache.maven.plugins:maven-changes-plugin:maven-plugin:2.12-SNAPSHOT:
Artifact is not fully assembled: /x1/jenkins/jenkins-slave/workspace/maven-plugins-ITs-m3/maven-changes-plugin/target/classes
-> [Help 2]
[ERROR] Failed to execute goal org.apache.maven.plugins:maven-invoker-plugin:2.0.0:install
(integration-test) on project maven-stage-plugin: Failed to install project dependencies:
MavenProject: org.apache.maven.plugins:maven-stage-plugin:1.1-SNAPSHOT @ /x1/jenkins/jenkins-slave/workspace/maven-plugins-ITs-m3/maven-stage-plugin/pom.xml:
Failed to install project artifacts: MavenProject: org.apache.maven.plugins:maven-changes-plugin:2.12-SNAPSHOT
@ /x1/jenkins/jenkins-slave/workspace/maven-plugins-ITs-m3/maven-changes-plugin/pom.xml: Failed
to install artifact: org.apache.maven.plugins:maven-changes-plugin:maven-plugin:2.12-SNAPSHOT:
Artifact is not fully assembled: /x1/jenkins/jenkins-slave/workspace/maven-plugins-ITs-m3/maven-changes-plugin/target/classes
-> [Help 2]
[ERROR] Failed to execute goal org.apache.maven.plugins:maven-invoker-plugin:2.0.0:install
(integration-test) on project maven-toolchains-plugin: Failed to install project dependencies:
MavenProject: org.apache.maven.plugins:maven-toolchains-plugin:1.2-SNAPSHOT @ /x1/jenkins/jenkins-slave/workspace/maven-plugins-ITs-m3/maven-toolchains-plugin/pom.xml:
Failed to install project artifacts: MavenProject: org.apache.maven.plugins:maven-changes-plugin:2.12-SNAPSHOT
@ /x1/jenkins/jenkins-slave/workspace/maven-plugins-ITs-m3/maven-changes-plugin/pom.xml: Failed
to install artifact: org.apache.maven.plugins:maven-changes-plugin:maven-plugin:2.12-SNAPSHOT:
Artifact is not fully assembled: /x1/jenkins/jenkins-slave/workspace/maven-plugins-ITs-m3/maven-changes-plugin/target/classes
-> [Help 2]
[ERROR] Failed to execute goal org.apache.maven.plugins:maven-invoker-plugin:2.0.0:install
(integration-test) on project maven-verifier-plugin: Failed to install project dependencies:
MavenProject: org.apache.maven.plugins:maven-verifier-plugin:3.0.0-SNAPSHOT @ /x1/jenkins/jenkins-slave/workspace/maven-plugins-ITs-m3/maven-verifier-plugin/pom.xml:
Failed to install project artifacts: MavenProject: org.apache.maven.plugins:maven-changes-plugin:2.12-SNAPSHOT
@ /x1/jenkins/jenkins-slave/workspace/maven-plugins-ITs-m3/maven-changes-plugin/pom.xml: Failed
to install artifact: org.apache.maven.plugins:maven-changes-plugin:maven-plugin:2.12-SNAPSHOT:
Artifact is not fully assembled: /x1/jenkins/jenkins-slave/workspace/maven-plugins-ITs-m3/maven-changes-plugin/target/classes
-> [Help 2]
[ERROR] Failed to execute goal org.apache.maven.plugins:maven-invoker-plugin:1.10:install
(integration-test) on project maven-war-plugin: Failed to install project dependencies: MavenProject:
org.apache.maven.plugins:maven-war-plugin:2.7-SNAPSHOT @ /x1/jenkins/jenkins-slave/workspace/maven-plugins-ITs-m3/maven-war-plugin/pom.xml:
Failed to install project artifacts: MavenProject: org.apache.maven.plugins:maven-changes-plugin:2.12-SNAPSHOT
@ /x1/jenkins/jenkins-slave/workspace/maven-plugins-ITs-m3/maven-changes-plugin/pom.xml: Failed
to install artifact: org.apache.maven.plugins:maven-changes-plugin:maven-plugin:2.12-SNAPSHOT:
Artifact is not fully assembled: /x1/jenkins/jenkins-slave/workspace/maven-plugins-ITs-m3/maven-changes-plugin/target/classes
-> [Help 2]
[ERROR] Failed to execute goal org.apache.maven.plugins:maven-surefire-plugin:2.18.1:test
(default-test) on project maven-doap-plugin: There are test failures.
[ERROR] 
[ERROR] Please refer to /x1/jenkins/jenkins-slave/workspace/maven-plugins-ITs-m3/maven-doap-plugin/target/surefire-reports
for the individual test results.
[ERROR] -> [Help 1]
[ERROR] Failed to execute goal org.apache.maven.plugins:maven-invoker-plugin:2.0.0:install
(integration-test) on project maven-pmd-plugin: Failed to install project dependencies: MavenProject:
org.apache.maven.plugins:maven-pmd-plugin:3.7-SNAPSHOT @ /x1/jenkins/jenkins-slave/workspace/maven-plugins-ITs-m3/maven-pmd-plugin/pom.xml:
Failed to install project artifacts: MavenProject: org.apache.maven.plugins:maven-changes-plugin:2.12-SNAPSHOT
@ /x1/jenkins/jenkins-slave/workspace/maven-plugins-ITs-m3/maven-changes-plugin/pom.xml: Failed
to install artifact: org.apache.maven.plugins:maven-changes-plugin:maven-plugin:2.12-SNAPSHOT:
Artifact is not fully assembled: /x1/jenkins/jenkins-slave/workspace/maven-plugins-ITs-m3/maven-changes-plugin/target/classes
-> [Help 2]
[ERROR] Failed to execute goal org.apache.maven.plugins:maven-invoker-plugin:1.9:install (integration-test)
on project maven-invoker-plugin: Failed to install project dependencies: MavenProject: org.apache.maven.plugins:maven-invoker-plugin:2.0.1-SNAPSHOT
@ /x1/jenkins/jenkins-slave/workspace/maven-plugins-ITs-m3/maven-invoker-plugin/pom.xml: Failed
to install project artifacts: MavenProject: org.apache.maven.plugins:maven-changes-plugin:2.12-SNAPSHOT
@ /x1/jenkins/jenkins-slave/workspace/maven-plugins-ITs-m3/maven-changes-plugin/pom.xml: Failed
to install artifact: org.apache.maven.plugins:maven-changes-plugin:maven-plugin:2.12-SNAPSHOT:
Artifact is not fully assembled: /x1/jenkins/jenkins-slave/workspace/maven-plugins-ITs-m3/maven-changes-plugin/target/classes
-> [Help 2]
[ERROR] Failed to execute goal org.apache.maven.plugins:maven-invoker-plugin:2.0.0:install
(integration-test) on project maven-jar-plugin: Failed to install project dependencies: MavenProject:
org.apache.maven.plugins:maven-jar-plugin:3.0.0-SNAPSHOT @ /x1/jenkins/jenkins-slave/workspace/maven-plugins-ITs-m3/maven-jar-plugin/pom.xml:
Failed to install project artifacts: MavenProject: org.apache.maven.plugins:maven-changes-plugin:2.12-SNAPSHOT
@ /x1/jenkins/jenkins-slave/workspace/maven-plugins-ITs-m3/maven-changes-plugin/pom.xml: Failed
to install artifact: org.apache.maven.plugins:maven-changes-plugin:maven-plugin:2.12-SNAPSHOT:
Artifact is not fully assembled: /x1/jenkins/jenkins-slave/workspace/maven-plugins-ITs-m3/maven-changes-plugin/target/classes
-> [Help 2]
[ERROR] Failed to execute goal org.apache.maven.plugins:maven-surefire-plugin:2.18.1:test
(default-test) on project maven-project-info-reports-plugin: There are test failures.
[ERROR] 
[ERROR] Please refer to /x1/jenkins/jenkins-slave/workspace/maven-plugins-ITs-m3/maven-project-info-reports-plugin/target/surefire-reports
for the individual test results.
[ERROR] -> [Help 1]
[ERROR] Failed to execute goal org.apache.maven.plugins:maven-invoker-plugin:2.0.0:install
(integration-test) on project maven-remote-resources-plugin: Failed to install project dependencies:
MavenProject: org.apache.maven.plugins:maven-remote-resources-plugin:1.6-SNAPSHOT @ /x1/jenkins/jenkins-slave/workspace/maven-plugins-ITs-m3/maven-remote-resources-plugin/pom.xml:
Failed to install project artifacts: MavenProject: org.apache.maven.plugins:maven-changes-plugin:2.12-SNAPSHOT
@ /x1/jenkins/jenkins-slave/workspace/maven-plugins-ITs-m3/maven-changes-plugin/pom.xml: Failed
to install artifact: org.apache.maven.plugins:maven-changes-plugin:maven-plugin:2.12-SNAPSHOT:
Artifact is not fully assembled: /x1/jenkins/jenkins-slave/workspace/maven-plugins-ITs-m3/maven-changes-plugin/target/classes
-> [Help 2]
[ERROR] Failed to execute goal org.apache.maven.plugins:maven-invoker-plugin:2.0.0:install
(integration-test) on project maven-shade-plugin: Failed to install project dependencies:
MavenProject: org.apache.maven.plugins:maven-shade-plugin:2.4.3-SNAPSHOT @ /x1/jenkins/jenkins-slave/workspace/maven-plugins-ITs-m3/maven-shade-plugin/pom.xml:
Failed to install project artifacts: MavenProject: org.apache.maven.plugins:maven-changes-plugin:2.12-SNAPSHOT
@ /x1/jenkins/jenkins-slave/workspace/maven-plugins-ITs-m3/maven-changes-plugin/pom.xml: Failed
to install artifact: org.apache.maven.plugins:maven-changes-plugin:maven-plugin:2.12-SNAPSHOT:
Artifact is not fully assembled: /x1/jenkins/jenkins-slave/workspace/maven-plugins-ITs-m3/maven-changes-plugin/target/classes
-> [Help 2]
[ERROR] Failed to execute goal org.apache.maven.plugins:maven-invoker-plugin:2.0.0:install
(integration-test) on project maven-scm-publish-plugin: Failed to install project dependencies:
MavenProject: org.apache.maven.plugins:maven-scm-publish-plugin:1.2-SNAPSHOT @ /x1/jenkins/jenkins-slave/workspace/maven-plugins-ITs-m3/maven-scm-publish-plugin/pom.xml:
Failed to install project artifacts: MavenProject: org.apache.maven.plugins:maven-changes-plugin:2.12-SNAPSHOT
@ /x1/jenkins/jenkins-slave/workspace/maven-plugins-ITs-m3/maven-changes-plugin/pom.xml: Failed
to install artifact: org.apache.maven.plugins:maven-changes-plugin:maven-plugin:2.12-SNAPSHOT:
Artifact is not fully assembled: /x1/jenkins/jenkins-slave/workspace/maven-plugins-ITs-m3/maven-changes-plugin/target/classes
-> [Help 2]
[ERROR] Failed to execute goal org.apache.maven.plugins:maven-compiler-plugin:3.2:compile
(default-compile) on project maven-assembly-plugin: Compilation failure
[ERROR] /x1/jenkins/jenkins-slave/workspace/maven-plugins-ITs-m3/maven-assembly-plugin/src/main/java/org/apache/maven/plugins/assembly/io/DefaultAssemblyReader.java:[144,20]
setStrategies(java.util.List<org.apache.maven.shared.io.location.LocatorStrategy>) in
org.apache.maven.shared.io.location.Locator cannot be applied to (java.util.List<org.apache.maven.plugins.assembly.io.RelativeFileLocatorStrategy>)
[ERROR] -> [Help 1]
[ERROR] Failed to execute goal org.apache.maven.plugins:maven-invoker-plugin:2.0.0:install
(integration-test) on project maven-dependency-plugin: Failed to install project dependencies:
MavenProject: org.apache.maven.plugins:maven-dependency-plugin:3.0-SNAPSHOT @ /x1/jenkins/jenkins-slave/workspace/maven-plugins-ITs-m3/maven-dependency-plugin/pom.xml:
Failed to install project artifacts: MavenProject: org.apache.maven.plugins:maven-changes-plugin:2.12-SNAPSHOT
@ /x1/jenkins/jenkins-slave/workspace/maven-plugins-ITs-m3/maven-changes-plugin/pom.xml: Failed
to install artifact: org.apache.maven.plugins:maven-changes-plugin:maven-plugin:2.12-SNAPSHOT:
Artifact is not fully assembled: /x1/jenkins/jenkins-slave/workspace/maven-plugins-ITs-m3/maven-changes-plugin/target/classes
-> [Help 2]
[ERROR] Failed to execute goal org.apache.maven.plugins:maven-invoker-plugin:2.0.0:install
(integration-test) on project maven-gpg-plugin: Failed to install project dependencies: MavenProject:
org.apache.maven.plugins:maven-gpg-plugin:1.7-SNAPSHOT @ /x1/jenkins/jenkins-slave/workspace/maven-plugins-ITs-m3/maven-gpg-plugin/pom.xml:
Failed to install project artifacts: MavenProject: org.apache.maven.plugins:maven-changes-plugin:2.12-SNAPSHOT
@ /x1/jenkins/jenkins-slave/workspace/maven-plugins-ITs-m3/maven-changes-plugin/pom.xml: Failed
to install artifact: org.apache.maven.plugins:maven-changes-plugin:maven-plugin:2.12-SNAPSHOT:
Artifact is not fully assembled: /x1/jenkins/jenkins-slave/workspace/maven-plugins-ITs-m3/maven-changes-plugin/target/classes
-> [Help 2]
[ERROR] 
[ERROR] To see the full stack trace of the errors, re-run Maven with the -e switch.
[ERROR] Re-run Maven using the -X switch to enable full debug logging.
[ERROR] 
[ERROR] For more information about the errors and possible solutions, please read the following
articles:
[ERROR] [Help 1] http://cwiki.apache.org/confluence/display/MAVEN/MojoFailureException
[ERROR] [Help 2] http://cwiki.apache.org/confluence/display/MAVEN/MojoExecutionException
[ERROR] 
[ERROR] After correcting the problems, you can resume the build with the command
[ERROR]   mvn <goals> -rf :maven-changelog-plugin
Build step 'Invoke top-level Maven targets' marked build as failure
Deleting 1 temporary files
Recording test results

Mime
View raw message