maven-notifications mailing list archives

Site index · List index
Message view « Date » · « Thread »
Top « Date » · « Thread »
From Apache Jenkins Server <jenk...@builds.apache.org>
Subject Build failed in Jenkins: core-it-maven-3-win #1031
Date Sun, 08 Nov 2015 15:20:57 GMT
See <https://builds.apache.org/job/core-it-maven-3-win/1031/changes>

Changes:

[khmarbaise] [MNG-5882] Nonportable shell constructs cause bin/mvn errors on Debian

------------------------------------------
[...truncated 10808 lines...]
[INFO] 
[INFO] --- maven-resources-plugin:2.7:resources (default-resources) @ ejbs ---
[WARNING] Using platform encoding (Cp1252 actually) to copy filtered resources, i.e. build
is platform dependent!
[INFO] Copying 1 resource
[INFO] 
[INFO] --- maven-compiler-plugin:2.0.2:compile (default-compile) @ ejbs ---
[INFO] No sources to compile
[INFO] 
[INFO] --- maven-resources-plugin:2.7:testResources (default-testResources) @ ejbs ---
[WARNING] Using platform encoding (Cp1252 actually) to copy filtered resources, i.e. build
is platform dependent!
[INFO] skip non existing resourceDirectory F:\ws\m3-its\core-integration-testing-trunk\core-it-suite\target\test-classes\mng-5898\ejbs\src\test\resources
[INFO] 
[INFO] --- maven-compiler-plugin:2.0.2:testCompile (default-testCompile) @ ejbs ---
[INFO] No sources to compile
[INFO] 
[INFO] --- maven-surefire-plugin:2.12.4:test (default-test) @ ejbs ---
[INFO] No tests to run.
[INFO]                                                                         
[INFO] ------------------------------------------------------------------------
[INFO] Building ear assembly 1.0
[INFO] ------------------------------------------------------------------------
[INFO] 
[INFO] --- maven-ear-plugin:2.8:generate-application-xml (default-generate-application-xml)
@ ear ---
[INFO] Downloading: file:target/null/org/codehaus/plexus/plexus-archiver/2.1.2/plexus-archiver-2.1.2.pom
[WARNING] The POM for org.codehaus.plexus:plexus-archiver:jar:2.1.2 is missing, no dependency
information available
[INFO] Downloading: file:target/null/org/apache/maven/shared/maven-filtering/1.0-beta-2/maven-filtering-1.0-beta-2.pom
[WARNING] The POM for org.apache.maven.shared:maven-filtering:jar:1.0-beta-2 is missing, no
dependency information available
[INFO] Downloading: file:target/null/org/apache/maven/maven-plugin-descriptor/2.0.6/maven-plugin-descriptor-2.0.6.jar
[INFO] Downloading: file:target/null/org/apache/maven/maven-plugin-parameter-documenter/2.0.6/maven-plugin-parameter-documenter-2.0.6.jar
[INFO] Downloading: file:target/null/org/apache/maven/maven-error-diagnostics/2.0.6/maven-error-diagnostics-2.0.6.jar
[INFO] ------------------------------------------------------------------------
[INFO] Reactor Summary:
[INFO] 
[INFO] project ............................................ SUCCESS [  0.003 s]
[INFO] sub projects ....................................... SUCCESS [  0.000 s]
[INFO] logging ............................................ SUCCESS [  1.554 s]
[INFO] core project classes ............................... SUCCESS [  0.124 s]
[INFO] servlets ........................................... SUCCESS [  0.000 s]
[INFO] servlet ............................................ SUCCESS [  0.020 s]
[INFO] enterprise java beans .............................. SUCCESS [  0.076 s]
[INFO] ear assembly ....................................... FAILURE [  0.124 s]
[INFO] ------------------------------------------------------------------------
[INFO] BUILD FAILURE
[INFO] ------------------------------------------------------------------------
[INFO] Total time: 2.125 s
[INFO] Finished at: 2015-11-08T14:37:01+00:00
[INFO] Final Memory: 22M/736M
[INFO] ------------------------------------------------------------------------
[ERROR] Failed to execute goal org.apache.maven.plugins:maven-ear-plugin:2.8:generate-application-xml
(default-generate-application-xml) on project ear: Execution default-generate-application-xml
of goal org.apache.maven.plugins:maven-ear-plugin:2.8:generate-application-xml failed: Plugin
org.apache.maven.plugins:maven-ear-plugin:2.8 or one of its dependencies could not be resolved:
The following artifacts could not be resolved: org.apache.maven:maven-plugin-parameter-documenter:jar:2.0.6,
org.apache.maven:maven-error-diagnostics:jar:2.0.6, org.apache.maven:maven-plugin-descriptor:jar:2.0.6:
Could not find artifact org.apache.maven:maven-plugin-parameter-documenter:jar:2.0.6 in central
(file:target/null) -> [Help 1]
org.apache.maven.lifecycle.LifecycleExecutionException: Failed to execute goal org.apache.maven.plugins:maven-ear-plugin:2.8:generate-application-xml
(default-generate-application-xml) on project ear: Execution default-generate-application-xml
of goal org.apache.maven.plugins:maven-ear-plugin:2.8:generate-application-xml failed: Plugin
org.apache.maven.plugins:maven-ear-plugin:2.8 or one of its dependencies could not be resolved:
The following artifacts could not be resolved: org.apache.maven:maven-plugin-parameter-documenter:jar:2.0.6,
org.apache.maven:maven-error-diagnostics:jar:2.0.6, org.apache.maven:maven-plugin-descriptor:jar:2.0.6:
Could not find artifact org.apache.maven:maven-plugin-parameter-documenter:jar:2.0.6 in central
(file:target/null)
	at org.apache.maven.lifecycle.internal.MojoExecutor.execute(MojoExecutor.java:212)
	at org.apache.maven.lifecycle.internal.MojoExecutor.execute(MojoExecutor.java:153)
	at org.apache.maven.lifecycle.internal.MojoExecutor.execute(MojoExecutor.java:145)
	at org.apache.maven.lifecycle.internal.LifecycleModuleBuilder.buildProject(LifecycleModuleBuilder.java:116)
	at org.apache.maven.lifecycle.internal.LifecycleModuleBuilder.buildProject(LifecycleModuleBuilder.java:80)
	at org.apache.maven.lifecycle.internal.builder.singlethreaded.SingleThreadedBuilder.build(SingleThreadedBuilder.java:51)
	at org.apache.maven.lifecycle.internal.LifecycleStarter.execute(LifecycleStarter.java:128)
	at org.apache.maven.DefaultMaven.doExecute(DefaultMaven.java:307)
	at org.apache.maven.DefaultMaven.doExecute(DefaultMaven.java:193)
	at org.apache.maven.DefaultMaven.execute(DefaultMaven.java:106)
	at org.apache.maven.cli.MavenCli.execute(MavenCli.java:863)
	at org.apache.maven.cli.MavenCli.doMain(MavenCli.java:288)
	at org.apache.maven.cli.MavenCli.main(MavenCli.java:199)
	at sun.reflect.NativeMethodAccessorImpl.invoke0(Native Method)
	at sun.reflect.NativeMethodAccessorImpl.invoke(NativeMethodAccessorImpl.java:57)
	at sun.reflect.DelegatingMethodAccessorImpl.invoke(DelegatingMethodAccessorImpl.java:43)
	at java.lang.reflect.Method.invoke(Method.java:601)
	at org.codehaus.plexus.classworlds.launcher.Launcher.launchEnhanced(Launcher.java:289)
	at org.codehaus.plexus.classworlds.launcher.Launcher.launch(Launcher.java:229)
	at org.codehaus.plexus.classworlds.launcher.Launcher.mainWithExitCode(Launcher.java:415)
	at org.codehaus.plexus.classworlds.launcher.Launcher.main(Launcher.java:356)
Caused by: org.apache.maven.plugin.PluginExecutionException: Execution default-generate-application-xml
of goal org.apache.maven.plugins:maven-ear-plugin:2.8:generate-application-xml failed: Plugin
org.apache.maven.plugins:maven-ear-plugin:2.8 or one of its dependencies could not be resolved:
The following artifacts could not be resolved: org.apache.maven:maven-plugin-parameter-documenter:jar:2.0.6,
org.apache.maven:maven-error-diagnostics:jar:2.0.6, org.apache.maven:maven-plugin-descriptor:jar:2.0.6:
Could not find artifact org.apache.maven:maven-plugin-parameter-documenter:jar:2.0.6 in central
(file:target/null)
	at org.apache.maven.plugin.DefaultBuildPluginManager.executeMojo(DefaultBuildPluginManager.java:106)
	at org.apache.maven.lifecycle.internal.MojoExecutor.execute(MojoExecutor.java:207)
	... 20 more
Caused by: org.apache.maven.plugin.PluginResolutionException: Plugin org.apache.maven.plugins:maven-ear-plugin:2.8
or one of its dependencies could not be resolved: The following artifacts could not be resolved:
org.apache.maven:maven-plugin-parameter-documenter:jar:2.0.6, org.apache.maven:maven-error-diagnostics:jar:2.0.6,
org.apache.maven:maven-plugin-descriptor:jar:2.0.6: Could not find artifact org.apache.maven:maven-plugin-parameter-documenter:jar:2.0.6
in central (file:target/null)
	at org.apache.maven.plugin.internal.DefaultPluginDependenciesResolver.resolveInternal(DefaultPluginDependenciesResolver.java:218)
	at org.apache.maven.plugin.internal.DefaultPluginDependenciesResolver.resolve(DefaultPluginDependenciesResolver.java:149)
	at org.apache.maven.plugin.internal.DefaultMavenPluginManager.createPluginRealm(DefaultMavenPluginManager.java:400)
	at org.apache.maven.plugin.internal.DefaultMavenPluginManager.setupPluginRealm(DefaultMavenPluginManager.java:372)
	at org.apache.maven.plugin.DefaultBuildPluginManager.getPluginRealm(DefaultBuildPluginManager.java:231)
	at org.apache.maven.plugin.DefaultBuildPluginManager.executeMojo(DefaultBuildPluginManager.java:102)
	... 21 more
Caused by: org.eclipse.aether.resolution.ArtifactResolutionException: The following artifacts
could not be resolved: org.apache.maven:maven-plugin-parameter-documenter:jar:2.0.6, org.apache.maven:maven-error-diagnostics:jar:2.0.6,
org.apache.maven:maven-plugin-descriptor:jar:2.0.6: Could not find artifact org.apache.maven:maven-plugin-parameter-documenter:jar:2.0.6
in central (file:target/null)
	at org.eclipse.aether.internal.impl.DefaultArtifactResolver.resolve(DefaultArtifactResolver.java:444)
	at org.eclipse.aether.internal.impl.DefaultArtifactResolver.resolveArtifacts(DefaultArtifactResolver.java:246)
	at org.eclipse.aether.internal.impl.DefaultRepositorySystem.resolveDependencies(DefaultRepositorySystem.java:367)
	at org.apache.maven.plugin.internal.DefaultPluginDependenciesResolver.resolveInternal(DefaultPluginDependenciesResolver.java:210)
	... 26 more
Caused by: org.eclipse.aether.transfer.ArtifactNotFoundException: Could not find artifact
org.apache.maven:maven-plugin-parameter-documenter:jar:2.0.6 in central (file:target/null)
	at org.eclipse.aether.connector.basic.ArtifactTransportListener.transferFailed(ArtifactTransportListener.java:39)
	at org.eclipse.aether.connector.basic.BasicRepositoryConnector$TaskRunner.run(BasicRepositoryConnector.java:355)
	at org.eclipse.aether.util.concurrency.RunnableErrorForwarder$1.run(RunnableErrorForwarder.java:67)
	at java.util.concurrent.ThreadPoolExecutor.runWorker(ThreadPoolExecutor.java:1110)
	at java.util.concurrent.ThreadPoolExecutor$Worker.run(ThreadPoolExecutor.java:603)
	at java.lang.Thread.run(Thread.java:722)
[ERROR] 
[ERROR] Re-run Maven using the -X switch to enable full debug logging.
[ERROR] 
[ERROR] For more information about the errors and possible solutions, please read the following
articles:
[ERROR] [Help 1] http://cwiki.apache.org/confluence/display/MAVEN/PluginResolutionException
[ERROR] 
[ERROR] After correcting the problems, you can resume the build with the command
[ERROR]   mvn <goals> -rf :ear

	at org.apache.maven.it.Verifier.executeGoals(Verifier.java:1369)
	at org.apache.maven.it.Verifier.executeGoal(Verifier.java:1254)
	at org.apache.maven.it.Verifier.executeGoal(Verifier.java:1248)
	at org.apache.maven.it.MavenITmng5898BuildMultimoduleWithEARFailsToResolveWARTest.testit(MavenITmng5898BuildMultimoduleWithEARFailsToResolveWARTest.java:51)


Results :

Tests in error: 
  MavenITmng5898BuildMultimoduleWithEARFailsToResolveWARTest>AbstractMavenIntegrationTestCase.runTest:219->testit:51
ยป Verification

Tests run: 771, Failures: 0, Errors: 1, Skipped: 0

[INFO] ------------------------------------------------------------------------
[INFO] Reactor Summary:
[INFO] 
[INFO] Maven Core ITs .................................... SUCCESS [56.515s]
[INFO] Maven IT Support .................................. SUCCESS [1.374s]
[INFO] Maven IT :: Plugins ............................... SUCCESS [0.776s]
[INFO] Maven IT Plugin :: Active Collection .............. SUCCESS [8.406s]
[INFO] Maven IT Plugin :: Ant-Based ...................... SUCCESS [5.842s]
[INFO] Maven IT Plugin :: Artifact ....................... SUCCESS [2.417s]
[INFO] Maven IT Plugin :: Class Loader :: Dependency A ... SUCCESS [0.618s]
[INFO] Maven IT Plugin :: Class Loader :: Dependency B ... SUCCESS [0.727s]
[INFO] Maven IT Plugin :: Class Loader :: Dependency C ... SUCCESS [0.979s]
[INFO] Maven IT Plugin :: Class Loader ................... SUCCESS [1.742s]
[INFO] Maven IT Plugin :: Class Loader :: Aggregator ..... SUCCESS [0.538s]
[INFO] Maven IT Plugin :: Configuration .................. SUCCESS [1.112s]
[INFO] Maven IT Plugin :: Context Passing ................ SUCCESS [0.599s]
[INFO] Maven ITs :: Core Plugin Stubs .................... SUCCESS [0.523s]
[INFO] Maven IT Clean Plugin Stub ........................ SUCCESS [0.755s]
[INFO] Maven IT Compiler Plugin Stub ..................... SUCCESS [0.780s]
[INFO] Maven IT Deploy Plugin Stub ....................... SUCCESS [0.880s]
[INFO] Maven IT EAR Plugin Stub .......................... SUCCESS [0.784s]
[INFO] Maven IT EJB Plugin Stub .......................... SUCCESS [0.691s]
[INFO] Maven IT Install Plugin Stub ...................... SUCCESS [0.726s]
[INFO] Maven IT JAR Plugin Stub .......................... SUCCESS [0.790s]
[INFO] Maven IT Javadoc Plugin Stub ...................... SUCCESS [0.825s]
[INFO] Maven IT Plugin Plugin Stub ....................... SUCCESS [0.758s]
[INFO] Maven IT RAR Plugin Stub .......................... SUCCESS [0.751s]
[INFO] Maven IT Resources Plugin Stub .................... SUCCESS [0.746s]
[INFO] Maven IT Site Plugin Stub ......................... SUCCESS [0.781s]
[INFO] Maven IT Source Plugin Stub ....................... SUCCESS [0.717s]
[INFO] Maven IT Surefire Plugin Stub ..................... SUCCESS [0.693s]
[INFO] Maven IT WAR Plugin Stub .......................... SUCCESS [0.715s]
[INFO] Maven IT Plugin :: Dependency Collection .......... SUCCESS [0.778s]
[INFO] Maven IT Plugin :: Dependency Resolution .......... SUCCESS [6.300s]
[INFO] Maven IT Plugin :: Expression ..................... SUCCESS [1.237s]
[INFO] Maven IT Plugin :: Error Mojos .................... SUCCESS [2.518s]
[INFO] Maven IT Component ................................ SUCCESS [0.554s]
[INFO] Maven IT Plugin :: Extension Consumer ............. SUCCESS [0.717s]
[INFO] Maven IT Plugin :: Extension Provider ............. SUCCESS [0.650s]
[INFO] Maven IT Plugin :: Fork ........................... SUCCESS [1.016s]
[INFO] Maven IT Plugin :: Invalid Descriptor ............. SUCCESS [0.610s]
[INFO] Maven IT Plugin :: Log File ....................... SUCCESS [0.664s]
[INFO] Maven IT Helper Library ........................... SUCCESS [2.039s]
[INFO] Maven IT Plugin :: Model Interpolation ............ SUCCESS [0.897s]
[INFO] Maven IT Plugin :: No Default Component ........... SUCCESS [0.617s]
[INFO] Maven IT Plugin :: No Project ..................... SUCCESS [0.552s]
[INFO] Maven IT Plugin :: Online ......................... SUCCESS [0.596s]
[INFO] Maven IT Plugin :: Optional Mojos ................. SUCCESS [0.776s]
[INFO] Maven IT Plugin :: Packaging ...................... SUCCESS [0.576s]
[INFO] Maven IT Plugin :: Parameter Implementation ....... SUCCESS [0.608s]
[INFO] Maven IT Plugin :: Plugin Dependency .............. SUCCESS [0.603s]
[INFO] Maven IT Plugin :: Project ........................ SUCCESS [0.783s]
[INFO] Maven IT Plugin :: Project Interpolation .......... SUCCESS [0.808s]
[INFO] Maven IT Plugin :: Setter ......................... SUCCESS [0.560s]
[INFO] Maven IT Plugin :: Singleton Component ............ SUCCESS [0.614s]
[INFO] Maven IT Plugin :: Site ........................... SUCCESS [2.049s]
[INFO] Maven IT Plugin :: Toolchain ...................... SUCCESS [5.146s]
[INFO] Maven IT Plugin :: Touch .......................... SUCCESS [1.033s]
[INFO] Maven IT Plugin :: Uses Properties Plugin ......... SUCCESS [0.919s]
[INFO] Maven IT Plugin :: Uses Wagon Plugin .............. SUCCESS [2.038s]
[INFO] Maven IT Plugin :: This plugin should contain the mojos needed by all tests.  SUCCESS
[0.713s]
[INFO] Maven IT Plugin :: Plexus Utils 1.1 ............... SUCCESS [0.783s]
[INFO] Maven IT Plugin :: Plexus Utils New ............... SUCCESS [0.800s]
[INFO] Maven IT Plugin :: Plexus Component API ........... SUCCESS [1.622s]
[INFO] Maven IT Plugin :: Log4J Client ................... SUCCESS [0.887s]
[INFO] Maven IT Plugin :: Extension 1 .................... SUCCESS [0.568s]
[INFO] Maven IT Plugin :: Extension 2 .................... SUCCESS [0.523s]
[INFO] Maven IT Plugin :: Plexus Lifecycle ............... SUCCESS [1.623s]
[INFO] Maven IT Plugin :: Settings ....................... SUCCESS [0.749s]
[INFO] Maven IT Plugin :: mng-5805 extension ............. SUCCESS [0.528s]
[INFO] Maven IT Plugin :: mng-5805 plugin ................ SUCCESS [0.634s]
[INFO] Maven IT Plugin :: mng-5805 plugin-dep ............ SUCCESS [0.528s]
[INFO] Maven IT Toolchain ................................ SUCCESS [0.933s]
[INFO] Maven IT Wagon .................................... SUCCESS [0.856s]
[INFO] Maven IT Support Artifacts ........................ SUCCESS [2.040s]
[INFO] Maven IT Extension ................................ SUCCESS [0.573s]
[INFO] Maven ITs ......................................... FAILURE [45:30.851s]
[INFO] ------------------------------------------------------------------------
[INFO] BUILD FAILURE
[INFO] ------------------------------------------------------------------------
[INFO] Total time: 47:57.893s
[INFO] Finished at: Sun Nov 08 15:21:09 GMT 2015
[INFO] Final Memory: 45M/765M
[INFO] ------------------------------------------------------------------------
[ERROR] Failed to execute goal org.apache.maven.plugins:maven-surefire-plugin:2.17:test (default-test)
on project core-it-suite: There are test failures.
[ERROR] 
[ERROR] Please refer to F:\ws\m3-its\core-integration-testing-trunk\core-it-suite\target\surefire-reports
for the individual test results.
[ERROR] -> [Help 1]
org.apache.maven.lifecycle.LifecycleExecutionException: Failed to execute goal org.apache.maven.plugins:maven-surefire-plugin:2.17:test
(default-test) on project core-it-suite: There are test failures.

Please refer to F:\ws\m3-its\core-integration-testing-trunk\core-it-suite\target\surefire-reports
for the individual test results.
	at org.apache.maven.lifecycle.internal.MojoExecutor.execute(MojoExecutor.java:213)
	at org.apache.maven.lifecycle.internal.MojoExecutor.execute(MojoExecutor.java:153)
	at org.apache.maven.lifecycle.internal.MojoExecutor.execute(MojoExecutor.java:145)
	at org.apache.maven.lifecycle.internal.LifecycleModuleBuilder.buildProject(LifecycleModuleBuilder.java:84)
	at org.apache.maven.lifecycle.internal.LifecycleModuleBuilder.buildProject(LifecycleModuleBuilder.java:59)
	at org.apache.maven.lifecycle.internal.LifecycleStarter.singleThreadedBuild(LifecycleStarter.java:183)
	at org.apache.maven.lifecycle.internal.LifecycleStarter.execute(LifecycleStarter.java:161)
	at org.apache.maven.DefaultMaven.doExecute(DefaultMaven.java:320)
	at org.apache.maven.DefaultMaven.execute(DefaultMaven.java:156)
	at org.apache.maven.cli.MavenCli.execute(MavenCli.java:537)
	at org.apache.maven.cli.MavenCli.doMain(MavenCli.java:196)
	at org.apache.maven.cli.MavenCli.main(MavenCli.java:141)
	at sun.reflect.NativeMethodAccessorImpl.invoke0(Native Method)
	at sun.reflect.NativeMethodAccessorImpl.invoke(NativeMethodAccessorImpl.java:57)
	at sun.reflect.DelegatingMethodAccessorImpl.invoke(DelegatingMethodAccessorImpl.java:43)
	at java.lang.reflect.Method.invoke(Method.java:601)
	at org.codehaus.plexus.classworlds.launcher.Launcher.launchEnhanced(Launcher.java:290)
	at org.codehaus.plexus.classworlds.launcher.Launcher.launch(Launcher.java:230)
	at org.codehaus.plexus.classworlds.launcher.Launcher.mainWithExitCode(Launcher.java:409)
	at org.codehaus.plexus.classworlds.launcher.Launcher.main(Launcher.java:352)
Caused by: org.apache.maven.plugin.MojoFailureException: There are test failures.

Please refer to F:\ws\m3-its\core-integration-testing-trunk\core-it-suite\target\surefire-reports
for the individual test results.
	at org.apache.maven.plugin.surefire.SurefireHelper.reportExecution(SurefireHelper.java:82)
	at org.apache.maven.plugin.surefire.SurefirePlugin.handleSummary(SurefirePlugin.java:195)
	at org.apache.maven.plugin.surefire.AbstractSurefireMojo.executeAfterPreconditionsChecked(AbstractSurefireMojo.java:861)
	at org.apache.maven.plugin.surefire.AbstractSurefireMojo.execute(AbstractSurefireMojo.java:729)
	at org.apache.maven.plugin.DefaultBuildPluginManager.executeMojo(DefaultBuildPluginManager.java:101)
	at org.apache.maven.lifecycle.internal.MojoExecutor.execute(MojoExecutor.java:209)
	... 19 more
[ERROR] 
[ERROR] Re-run Maven using the -X switch to enable full debug logging.
[ERROR] 
[ERROR] For more information about the errors and possible solutions, please read the following
articles:
[ERROR] [Help 1] http://cwiki.apache.org/confluence/display/MAVEN/MojoFailureException
[ERROR] 
[ERROR] After correcting the problems, you can resume the build with the command
[ERROR]   mvn <goals> -rf :core-it-suite
Build step 'Invoke top-level Maven targets' marked build as failure
Recording test results

Mime
View raw message