maven-notifications mailing list archives

Site index · List index
Message view « Date » · « Thread »
Top « Date » · « Thread »
From gmcdon...@apache.org
Subject Build failed in Jenkins: maven-wagon #151
Date Wed, 14 Oct 2015 01:37:01 GMT
See <https://analysis.apache.org/jenkins/job/maven-wagon/151/changes>

Changes:

[dantran] Replace a deprecated API call and removed no longer needed comment

------------------------------------------
[...truncated 1106 lines...]
[JENKINS] Archiving disabled
[JENKINS] Archiving disabled
[JENKINS] Archiving disabled
[JENKINS] Archiving disabled
[JENKINS] Archiving disabled
[JENKINS] Archiving disabled
[JENKINS] Archiving disabled
[JENKINS] Archiving disabled
[JENKINS] Archiving disabled
[JENKINS] Archiving disabled
[JENKINS] Archiving disabled
[JENKINS] Archiving disabled
[JENKINS] Archiving disabled
[INFO] ------------------------------------------------------------------------
[INFO] Reactor Summary:
[INFO] 
[INFO] Apache Maven Wagon ................................. SUCCESS [01:19 min]
[INFO] Apache Maven Wagon :: API .......................... SUCCESS [ 17.194 s]
[INFO] Apache Maven Wagon :: Provider Test ................ SUCCESS [ 10.094 s]
[INFO] Apache Maven Wagon :: Providers .................... SUCCESS [  4.026 s]
[INFO] Apache Maven Wagon :: Providers :: File Provider ... SUCCESS [  5.995 s]
[INFO] Apache Maven Wagon :: Providers :: FTP Provider .... SUCCESS [  8.496 s]
[INFO] Apache Maven Wagon :: Providers :: HTTP Shared Library SUCCESS [  5.752 s]
[INFO] Apache Maven Wagon :: Test Compatibility Kits ...... SUCCESS [  2.665 s]
[INFO] Apache Maven Wagon :: HTTP Test Compatibility Kit .. SUCCESS [  4.792 s]
[INFO] Apache Maven Wagon :: Providers :: HTTP Provider ... SUCCESS [ 20.085 s]
[INFO] Apache Maven Wagon :: Providers :: Lightweight HTTP Provider SUCCESS [  9.130 s]
[INFO] Apache Maven Wagon :: Providers :: SCM Provider .... SUCCESS [ 10.286 s]
[INFO] Apache Maven Wagon :: Providers :: SSH Common Library SUCCESS [ 10.680 s]
[INFO] Apache Maven Wagon :: Providers :: SSH Common Tests  SUCCESS [  7.837 s]
[INFO] Apache Maven Wagon :: Providers :: SSH External Provider SUCCESS [  7.588 s]
[INFO] Apache Maven Wagon :: Providers :: SSH Provider .... SUCCESS [  7.428 s]
[INFO] Apache Maven Wagon :: Providers :: WebDav Provider . SUCCESS [ 10.944 s]
[INFO] ------------------------------------------------------------------------
[INFO] BUILD SUCCESS
[INFO] ------------------------------------------------------------------------
[INFO] Total time: 03:48 min
[INFO] Finished at: 2015-10-14T01:36:50+00:00
[INFO] Final Memory: 33M/314M
[INFO] ------------------------------------------------------------------------
channel stopped
[workspace] $ /x1/jenkins/jenkins-master/jenkins-home/tools/hudson.tasks.Maven_MavenInstallation/maven-3.2.2/bin/mvn
-f <https://analysis.apache.org/jenkins/job/maven-wagon/ws/pom.xml> -e -B org.codehaus.mojo:sonar-maven-plugin:2.6:sonar
-Dsonar.jdbc.url=jdbc:mysql://192.168.0.64:3306/sonar?useUnicode=true&amp;characterEncoding=utf8
******** ******** -Dsonar.host.url=http://localhost:9090 ******** ******** -Dmaven.repo.local=/x1/jenkins/jenkins-master/jenkins-home/maven-repositories/1
[INFO] Error stacktraces are turned on.
[INFO] Scanning for projects...
[INFO] ------------------------------------------------------------------------
[INFO] Reactor Build Order:
[INFO] 
[INFO] Apache Maven Wagon
[INFO] Apache Maven Wagon :: API
[INFO] Apache Maven Wagon :: Provider Test
[INFO] Apache Maven Wagon :: Providers
[INFO] Apache Maven Wagon :: Providers :: File Provider
[INFO] Apache Maven Wagon :: Providers :: FTP Provider
[INFO] Apache Maven Wagon :: Providers :: HTTP Shared Library
[INFO] Apache Maven Wagon :: Test Compatibility Kits
[INFO] Apache Maven Wagon :: HTTP Test Compatibility Kit
[INFO] Apache Maven Wagon :: Providers :: HTTP Provider
[INFO] Apache Maven Wagon :: Providers :: Lightweight HTTP Provider
[INFO] Apache Maven Wagon :: Providers :: SCM Provider
[INFO] Apache Maven Wagon :: Providers :: SSH Common Library
[INFO] Apache Maven Wagon :: Providers :: SSH Common Tests
[INFO] Apache Maven Wagon :: Providers :: SSH External Provider
[INFO] Apache Maven Wagon :: Providers :: SSH Provider
[INFO] Apache Maven Wagon :: Providers :: WebDav Provider
[INFO]                                                                         
[INFO] ------------------------------------------------------------------------
[INFO] Building Apache Maven Wagon 2.11-SNAPSHOT
[INFO] ------------------------------------------------------------------------
[INFO] 
[INFO] --- sonar-maven-plugin:2.6:sonar (default-cli) @ wagon ---
[INFO] SonarQube version: 5.1
INFO: Default locale: "en_US", source code encoding: "UTF-8"
INFO: Work directory: <https://analysis.apache.org/jenkins/job/maven-wagon/ws/target/sonar>
INFO: SonarQube Server 5.1
[INFO] ------------------------------------------------------------------------
[INFO] Reactor Summary:
[INFO] 
[INFO] Apache Maven Wagon ................................. FAILURE [  4.357 s]
[INFO] Apache Maven Wagon :: API .......................... SKIPPED
[INFO] Apache Maven Wagon :: Provider Test ................ SKIPPED
[INFO] Apache Maven Wagon :: Providers .................... SKIPPED
[INFO] Apache Maven Wagon :: Providers :: File Provider ... SKIPPED
[INFO] Apache Maven Wagon :: Providers :: FTP Provider .... SKIPPED
[INFO] Apache Maven Wagon :: Providers :: HTTP Shared Library SKIPPED
[INFO] Apache Maven Wagon :: Test Compatibility Kits ...... SKIPPED
[INFO] Apache Maven Wagon :: HTTP Test Compatibility Kit .. SKIPPED
[INFO] Apache Maven Wagon :: Providers :: HTTP Provider ... SKIPPED
[INFO] Apache Maven Wagon :: Providers :: Lightweight HTTP Provider SKIPPED
[INFO] Apache Maven Wagon :: Providers :: SCM Provider .... SKIPPED
[INFO] Apache Maven Wagon :: Providers :: SSH Common Library SKIPPED
[INFO] Apache Maven Wagon :: Providers :: SSH Common Tests  SKIPPED
[INFO] Apache Maven Wagon :: Providers :: SSH External Provider SKIPPED
[INFO] Apache Maven Wagon :: Providers :: SSH Provider .... SKIPPED
[INFO] Apache Maven Wagon :: Providers :: WebDav Provider . SKIPPED
[INFO] ------------------------------------------------------------------------
[INFO] BUILD FAILURE
[INFO] ------------------------------------------------------------------------
[INFO] Total time: 6.482 s
[INFO] Finished at: 2015-10-14T01:37:01+00:00
[INFO] Final Memory: 14M/330M
[INFO] ------------------------------------------------------------------------
[ERROR] Failed to execute goal org.codehaus.mojo:sonar-maven-plugin:2.6:sonar (default-cli)
on project wagon: Execution default-cli of goal org.codehaus.mojo:sonar-maven-plugin:2.6:sonar
failed: An API incompatibility was encountered while executing org.codehaus.mojo:sonar-maven-plugin:2.6:sonar:
java.lang.UnsupportedClassVersionError: org/sonar/api/utils/SonarException : Unsupported major.minor
version 51.0
[ERROR] -----------------------------------------------------
[ERROR] realm =    plugin>org.codehaus.mojo:sonar-maven-plugin:2.6
[ERROR] strategy = org.codehaus.plexus.classworlds.strategy.SelfFirstStrategy
[ERROR] urls[0] = file:/x1/jenkins/jenkins-master/jenkins-home/maven-repositories/1/org/codehaus/mojo/sonar-maven-plugin/2.6/sonar-maven-plugin-2.6.jar
[ERROR] urls[1] = file:/x1/jenkins/jenkins-master/jenkins-home/maven-repositories/1/org/apache/maven/shared/maven-dependency-tree/2.1/maven-dependency-tree-2.1.jar
[ERROR] urls[2] = file:/x1/jenkins/jenkins-master/jenkins-home/maven-repositories/1/backport-util-concurrent/backport-util-concurrent/3.1/backport-util-concurrent-3.1.jar
[ERROR] urls[3] = file:/x1/jenkins/jenkins-master/jenkins-home/maven-repositories/1/org/codehaus/plexus/plexus-interpolation/1.11/plexus-interpolation-1.11.jar
[ERROR] urls[4] = file:/x1/jenkins/jenkins-master/jenkins-home/maven-repositories/1/org/codehaus/plexus/plexus-component-annotations/1.5.5/plexus-component-annotations-1.5.5.jar
[ERROR] urls[5] = file:/x1/jenkins/jenkins-master/jenkins-home/maven-repositories/1/org/eclipse/aether/aether-util/0.9.0.M2/aether-util-0.9.0.M2.jar
[ERROR] urls[6] = file:/x1/jenkins/jenkins-master/jenkins-home/maven-repositories/1/org/sonatype/plexus/plexus-sec-dispatcher/1.4/plexus-sec-dispatcher-1.4.jar
[ERROR] urls[7] = file:/x1/jenkins/jenkins-master/jenkins-home/maven-repositories/1/org/codehaus/plexus/plexus-utils/1.5.5/plexus-utils-1.5.5.jar
[ERROR] urls[8] = file:/x1/jenkins/jenkins-master/jenkins-home/maven-repositories/1/org/sonatype/plexus/plexus-cipher/1.4/plexus-cipher-1.4.jar
[ERROR] urls[9] = file:/x1/jenkins/jenkins-master/jenkins-home/maven-repositories/1/org/codehaus/sonar/runner/sonar-runner-api/2.4/sonar-runner-api-2.4.jar
[ERROR] urls[10] = file:/x1/jenkins/jenkins-master/jenkins-home/maven-repositories/1/commons-lang/commons-lang/2.6/commons-lang-2.6.jar
[ERROR] urls[11] = file:/x1/jenkins/jenkins-master/jenkins-home/maven-repositories/1/com/google/guava/guava/10.0.1/guava-10.0.1.jar
[ERROR] urls[12] = file:/x1/jenkins/jenkins-master/jenkins-home/maven-repositories/1/com/google/code/findbugs/jsr305/2.0.3/jsr305-2.0.3.jar
[ERROR] Number of foreign imports: 1
[ERROR] import: Entry[import  from realm ClassRealm[maven.api, parent: null]]
[ERROR] 
[ERROR] -----------------------------------------------------
[ERROR] -> [Help 1]
org.apache.maven.lifecycle.LifecycleExecutionException: Failed to execute goal org.codehaus.mojo:sonar-maven-plugin:2.6:sonar
(default-cli) on project wagon: Execution default-cli of goal org.codehaus.mojo:sonar-maven-plugin:2.6:sonar
failed: An API incompatibility was encountered while executing org.codehaus.mojo:sonar-maven-plugin:2.6:sonar:
java.lang.UnsupportedClassVersionError: org/sonar/api/utils/SonarException : Unsupported major.minor
version 51.0
-----------------------------------------------------
realm =    plugin>org.codehaus.mojo:sonar-maven-plugin:2.6
strategy = org.codehaus.plexus.classworlds.strategy.SelfFirstStrategy
urls[0] = file:/x1/jenkins/jenkins-master/jenkins-home/maven-repositories/1/org/codehaus/mojo/sonar-maven-plugin/2.6/sonar-maven-plugin-2.6.jar
urls[1] = file:/x1/jenkins/jenkins-master/jenkins-home/maven-repositories/1/org/apache/maven/shared/maven-dependency-tree/2.1/maven-dependency-tree-2.1.jar
urls[2] = file:/x1/jenkins/jenkins-master/jenkins-home/maven-repositories/1/backport-util-concurrent/backport-util-concurrent/3.1/backport-util-concurrent-3.1.jar
urls[3] = file:/x1/jenkins/jenkins-master/jenkins-home/maven-repositories/1/org/codehaus/plexus/plexus-interpolation/1.11/plexus-interpolation-1.11.jar
urls[4] = file:/x1/jenkins/jenkins-master/jenkins-home/maven-repositories/1/org/codehaus/plexus/plexus-component-annotations/1.5.5/plexus-component-annotations-1.5.5.jar
urls[5] = file:/x1/jenkins/jenkins-master/jenkins-home/maven-repositories/1/org/eclipse/aether/aether-util/0.9.0.M2/aether-util-0.9.0.M2.jar
urls[6] = file:/x1/jenkins/jenkins-master/jenkins-home/maven-repositories/1/org/sonatype/plexus/plexus-sec-dispatcher/1.4/plexus-sec-dispatcher-1.4.jar
urls[7] = file:/x1/jenkins/jenkins-master/jenkins-home/maven-repositories/1/org/codehaus/plexus/plexus-utils/1.5.5/plexus-utils-1.5.5.jar
urls[8] = file:/x1/jenkins/jenkins-master/jenkins-home/maven-repositories/1/org/sonatype/plexus/plexus-cipher/1.4/plexus-cipher-1.4.jar
urls[9] = file:/x1/jenkins/jenkins-master/jenkins-home/maven-repositories/1/org/codehaus/sonar/runner/sonar-runner-api/2.4/sonar-runner-api-2.4.jar
urls[10] = file:/x1/jenkins/jenkins-master/jenkins-home/maven-repositories/1/commons-lang/commons-lang/2.6/commons-lang-2.6.jar
urls[11] = file:/x1/jenkins/jenkins-master/jenkins-home/maven-repositories/1/com/google/guava/guava/10.0.1/guava-10.0.1.jar
urls[12] = file:/x1/jenkins/jenkins-master/jenkins-home/maven-repositories/1/com/google/code/findbugs/jsr305/2.0.3/jsr305-2.0.3.jar
Number of foreign imports: 1
import: Entry[import  from realm ClassRealm[maven.api, parent: null]]

-----------------------------------------------------

	at org.apache.maven.lifecycle.internal.MojoExecutor.execute(MojoExecutor.java:224)
	at org.apache.maven.lifecycle.internal.MojoExecutor.execute(MojoExecutor.java:153)
	at org.apache.maven.lifecycle.internal.MojoExecutor.execute(MojoExecutor.java:145)
	at org.apache.maven.lifecycle.internal.LifecycleModuleBuilder.buildProject(LifecycleModuleBuilder.java:116)
	at org.apache.maven.lifecycle.internal.LifecycleModuleBuilder.buildProject(LifecycleModuleBuilder.java:80)
	at org.apache.maven.lifecycle.internal.builder.singlethreaded.SingleThreadedBuilder.build(SingleThreadedBuilder.java:51)
	at org.apache.maven.lifecycle.internal.LifecycleStarter.execute(LifecycleStarter.java:120)
	at org.apache.maven.DefaultMaven.doExecute(DefaultMaven.java:347)
	at org.apache.maven.DefaultMaven.execute(DefaultMaven.java:154)
	at org.apache.maven.cli.MavenCli.execute(MavenCli.java:584)
	at org.apache.maven.cli.MavenCli.doMain(MavenCli.java:213)
	at org.apache.maven.cli.MavenCli.main(MavenCli.java:157)
	at sun.reflect.NativeMethodAccessorImpl.invoke0(Native Method)
	at sun.reflect.NativeMethodAccessorImpl.invoke(NativeMethodAccessorImpl.java:39)
	at sun.reflect.DelegatingMethodAccessorImpl.invoke(DelegatingMethodAccessorImpl.java:25)
	at java.lang.reflect.Method.invoke(Method.java:597)
	at org.codehaus.plexus.classworlds.launcher.Launcher.launchEnhanced(Launcher.java:289)
	at org.codehaus.plexus.classworlds.launcher.Launcher.launch(Launcher.java:229)
	at org.codehaus.plexus.classworlds.launcher.Launcher.mainWithExitCode(Launcher.java:415)
	at org.codehaus.plexus.classworlds.launcher.Launcher.main(Launcher.java:356)
Caused by: org.apache.maven.plugin.PluginExecutionException: Execution default-cli of goal
org.codehaus.mojo:sonar-maven-plugin:2.6:sonar failed: An API incompatibility was encountered
while executing org.codehaus.mojo:sonar-maven-plugin:2.6:sonar: java.lang.UnsupportedClassVersionError:
org/sonar/api/utils/SonarException : Unsupported major.minor version 51.0
-----------------------------------------------------
realm =    plugin>org.codehaus.mojo:sonar-maven-plugin:2.6
strategy = org.codehaus.plexus.classworlds.strategy.SelfFirstStrategy
urls[0] = file:/x1/jenkins/jenkins-master/jenkins-home/maven-repositories/1/org/codehaus/mojo/sonar-maven-plugin/2.6/sonar-maven-plugin-2.6.jar
urls[1] = file:/x1/jenkins/jenkins-master/jenkins-home/maven-repositories/1/org/apache/maven/shared/maven-dependency-tree/2.1/maven-dependency-tree-2.1.jar
urls[2] = file:/x1/jenkins/jenkins-master/jenkins-home/maven-repositories/1/backport-util-concurrent/backport-util-concurrent/3.1/backport-util-concurrent-3.1.jar
urls[3] = file:/x1/jenkins/jenkins-master/jenkins-home/maven-repositories/1/org/codehaus/plexus/plexus-interpolation/1.11/plexus-interpolation-1.11.jar
urls[4] = file:/x1/jenkins/jenkins-master/jenkins-home/maven-repositories/1/org/codehaus/plexus/plexus-component-annotations/1.5.5/plexus-component-annotations-1.5.5.jar
urls[5] = file:/x1/jenkins/jenkins-master/jenkins-home/maven-repositories/1/org/eclipse/aether/aether-util/0.9.0.M2/aether-util-0.9.0.M2.jar
urls[6] = file:/x1/jenkins/jenkins-master/jenkins-home/maven-repositories/1/org/sonatype/plexus/plexus-sec-dispatcher/1.4/plexus-sec-dispatcher-1.4.jar
urls[7] = file:/x1/jenkins/jenkins-master/jenkins-home/maven-repositories/1/org/codehaus/plexus/plexus-utils/1.5.5/plexus-utils-1.5.5.jar
urls[8] = file:/x1/jenkins/jenkins-master/jenkins-home/maven-repositories/1/org/sonatype/plexus/plexus-cipher/1.4/plexus-cipher-1.4.jar
urls[9] = file:/x1/jenkins/jenkins-master/jenkins-home/maven-repositories/1/org/codehaus/sonar/runner/sonar-runner-api/2.4/sonar-runner-api-2.4.jar
urls[10] = file:/x1/jenkins/jenkins-master/jenkins-home/maven-repositories/1/commons-lang/commons-lang/2.6/commons-lang-2.6.jar
urls[11] = file:/x1/jenkins/jenkins-master/jenkins-home/maven-repositories/1/com/google/guava/guava/10.0.1/guava-10.0.1.jar
urls[12] = file:/x1/jenkins/jenkins-master/jenkins-home/maven-repositories/1/com/google/code/findbugs/jsr305/2.0.3/jsr305-2.0.3.jar
Number of foreign imports: 1
import: Entry[import  from realm ClassRealm[maven.api, parent: null]]

-----------------------------------------------------

	at org.apache.maven.plugin.DefaultBuildPluginManager.executeMojo(DefaultBuildPluginManager.java:181)
	at org.apache.maven.lifecycle.internal.MojoExecutor.execute(MojoExecutor.java:208)
	... 19 more
Caused by: org.apache.maven.plugin.PluginContainerException: An API incompatibility was encountered
while executing org.codehaus.mojo:sonar-maven-plugin:2.6:sonar: java.lang.UnsupportedClassVersionError:
org/sonar/api/utils/SonarException : Unsupported major.minor version 51.0
-----------------------------------------------------
realm =    plugin>org.codehaus.mojo:sonar-maven-plugin:2.6
strategy = org.codehaus.plexus.classworlds.strategy.SelfFirstStrategy
urls[0] = file:/x1/jenkins/jenkins-master/jenkins-home/maven-repositories/1/org/codehaus/mojo/sonar-maven-plugin/2.6/sonar-maven-plugin-2.6.jar
urls[1] = file:/x1/jenkins/jenkins-master/jenkins-home/maven-repositories/1/org/apache/maven/shared/maven-dependency-tree/2.1/maven-dependency-tree-2.1.jar
urls[2] = file:/x1/jenkins/jenkins-master/jenkins-home/maven-repositories/1/backport-util-concurrent/backport-util-concurrent/3.1/backport-util-concurrent-3.1.jar
urls[3] = file:/x1/jenkins/jenkins-master/jenkins-home/maven-repositories/1/org/codehaus/plexus/plexus-interpolation/1.11/plexus-interpolation-1.11.jar
urls[4] = file:/x1/jenkins/jenkins-master/jenkins-home/maven-repositories/1/org/codehaus/plexus/plexus-component-annotations/1.5.5/plexus-component-annotations-1.5.5.jar
urls[5] = file:/x1/jenkins/jenkins-master/jenkins-home/maven-repositories/1/org/eclipse/aether/aether-util/0.9.0.M2/aether-util-0.9.0.M2.jar
urls[6] = file:/x1/jenkins/jenkins-master/jenkins-home/maven-repositories/1/org/sonatype/plexus/plexus-sec-dispatcher/1.4/plexus-sec-dispatcher-1.4.jar
urls[7] = file:/x1/jenkins/jenkins-master/jenkins-home/maven-repositories/1/org/codehaus/plexus/plexus-utils/1.5.5/plexus-utils-1.5.5.jar
urls[8] = file:/x1/jenkins/jenkins-master/jenkins-home/maven-repositories/1/org/sonatype/plexus/plexus-cipher/1.4/plexus-cipher-1.4.jar
urls[9] = file:/x1/jenkins/jenkins-master/jenkins-home/maven-repositories/1/org/codehaus/sonar/runner/sonar-runner-api/2.4/sonar-runner-api-2.4.jar
urls[10] = file:/x1/jenkins/jenkins-master/jenkins-home/maven-repositories/1/commons-lang/commons-lang/2.6/commons-lang-2.6.jar
urls[11] = file:/x1/jenkins/jenkins-master/jenkins-home/maven-repositories/1/com/google/guava/guava/10.0.1/guava-10.0.1.jar
urls[12] = file:/x1/jenkins/jenkins-master/jenkins-home/maven-repositories/1/com/google/code/findbugs/jsr305/2.0.3/jsr305-2.0.3.jar
Number of foreign imports: 1
import: Entry[import  from realm ClassRealm[maven.api, parent: null]]

-----------------------------------------------------

	at org.apache.maven.plugin.DefaultBuildPluginManager.executeMojo(DefaultBuildPluginManager.java:179)
	... 20 more
Caused by: java.lang.UnsupportedClassVersionError: org/sonar/api/utils/SonarException : Unsupported
major.minor version 51.0
	at java.lang.ClassLoader.defineClass1(Native Method)
	at java.lang.ClassLoader.defineClassCond(ClassLoader.java:632)
	at java.lang.ClassLoader.defineClass(ClassLoader.java:616)
	at java.security.SecureClassLoader.defineClass(SecureClassLoader.java:141)
	at java.net.URLClassLoader.defineClass(URLClassLoader.java:283)
	at java.net.URLClassLoader.access$000(URLClassLoader.java:58)
	at java.net.URLClassLoader$1.run(URLClassLoader.java:197)
	at java.security.AccessController.doPrivileged(Native Method)
	at java.net.URLClassLoader.findClass(URLClassLoader.java:190)
	at org.sonar.runner.impl.IsolatedClassloader.loadClass(IsolatedClassloader.java:94)
	at java.lang.ClassLoader.loadClass(ClassLoader.java:248)
	at java.lang.Class.getDeclaredMethods0(Native Method)
	at java.lang.Class.privateGetDeclaredMethods(Class.java:2427)
	at java.lang.Class.getMethod0(Class.java:2670)
	at java.lang.Class.getMethod(Class.java:1603)
	at org.sonar.runner.impl.BatchLauncher$1.delegateExecution(BatchLauncher.java:85)
	at org.sonar.runner.impl.BatchLauncher$1.run(BatchLauncher.java:75)
	at java.security.AccessController.doPrivileged(Native Method)
	at org.sonar.runner.impl.BatchLauncher.doExecute(BatchLauncher.java:69)
	at org.sonar.runner.impl.BatchLauncher.execute(BatchLauncher.java:50)
	at org.sonar.runner.api.EmbeddedRunner.doExecute(EmbeddedRunner.java:102)
	at org.sonar.runner.api.Runner.execute(Runner.java:100)
	at org.codehaus.mojo.sonar.bootstrap.RunnerBootstraper.execute(RunnerBootstraper.java:135)
	at org.codehaus.mojo.sonar.SonarMojo.execute(SonarMojo.java:132)
	at org.apache.maven.plugin.DefaultBuildPluginManager.executeMojo(DefaultBuildPluginManager.java:132)
	... 20 more
[ERROR] 
[ERROR] Re-run Maven using the -X switch to enable full debug logging.
[ERROR] 
[ERROR] For more information about the errors and possible solutions, please read the following
articles:
[ERROR] [Help 1] http://cwiki.apache.org/confluence/display/MAVEN/PluginContainerException
SonarQube analysis completed: FAILURE
Build step 'SonarQube' changed build result to FAILURE
Build step 'SonarQube' marked build as failure

Mime
View raw message