maven-notifications mailing list archives

Site index · List index
Message view « Date » · « Thread »
Top « Date » · « Thread »
From Apache Jenkins Server <jenk...@builds.apache.org>
Subject Build failed in Jenkins: maven-plugins-ITs-m3-windows #1260
Date Sat, 17 Oct 2015 17:43:59 GMT
See <https://builds.apache.org/job/maven-plugins-ITs-m3-windows/1260/changes>

Changes:

[hboutemy] [MSITE-750] workaround for dav: wagon pseudo protocol when comparing distributionManagement.site.url

------------------------------------------
[...truncated 3229 lines...]
[ERROR] -X                         Print a synopsis of nonstandard options
[ERROR] -J<flag>                   Pass <flag> directly to the runtime system
[ERROR] -> [Help 1]
[ERROR] Failed to execute goal org.apache.maven.plugins:maven-compiler-plugin:3.2:compile
(default-compile) on project maven-toolchains-plugin: Compilation failure
[ERROR] javac: invalid flag: -s
[ERROR] Usage: javac <options> <source files>
[ERROR] where possible options include:
[ERROR] -g                         Generate all debugging info
[ERROR] -g:none                    Generate no debugging info
[ERROR] -g:{lines,vars,source}     Generate only some debugging info
[ERROR] -nowarn                    Generate no warnings
[ERROR] -verbose                   Output messages about what the compiler is doing
[ERROR] -deprecation               Output source locations where deprecated APIs are used
[ERROR] -classpath <path>          Specify where to find user class files
[ERROR] -cp <path>                 Specify where to find user class files
[ERROR] -sourcepath <path>         Specify where to find input source files
[ERROR] -bootclasspath <path>      Override location of bootstrap class files
[ERROR] -extdirs <dirs>            Override location of installed extensions
[ERROR] -endorseddirs <dirs>       Override location of endorsed standards path
[ERROR] -d <directory>             Specify where to place generated class files
[ERROR] -encoding <encoding>       Specify character encoding used by source files
[ERROR] -source <release>          Provide source compatibility with specified release
[ERROR] -target <release>          Generate class files for specific VM version
[ERROR] -version                   Version information
[ERROR] -help                      Print a synopsis of standard options
[ERROR] -X                         Print a synopsis of nonstandard options
[ERROR] -J<flag>                   Pass <flag> directly to the runtime system
[ERROR] -> [Help 1]
[ERROR] Failed to execute goal org.apache.maven.plugins:maven-compiler-plugin:3.2:compile
(default-compile) on project maven-verifier-plugin: Compilation failure
[ERROR] javac: invalid flag: -s
[ERROR] Usage: javac <options> <source files>
[ERROR] where possible options include:
[ERROR] -g                         Generate all debugging info
[ERROR] -g:none                    Generate no debugging info
[ERROR] -g:{lines,vars,source}     Generate only some debugging info
[ERROR] -nowarn                    Generate no warnings
[ERROR] -verbose                   Output messages about what the compiler is doing
[ERROR] -deprecation               Output source locations where deprecated APIs are used
[ERROR] -classpath <path>          Specify where to find user class files
[ERROR] -cp <path>                 Specify where to find user class files
[ERROR] -sourcepath <path>         Specify where to find input source files
[ERROR] -bootclasspath <path>      Override location of bootstrap class files
[ERROR] -extdirs <dirs>            Override location of installed extensions
[ERROR] -endorseddirs <dirs>       Override location of endorsed standards path
[ERROR] -d <directory>             Specify where to place generated class files
[ERROR] -encoding <encoding>       Specify character encoding used by source files
[ERROR] -source <release>          Provide source compatibility with specified release
[ERROR] -target <release>          Generate class files for specific VM version
[ERROR] -version                   Version information
[ERROR] -help                      Print a synopsis of standard options
[ERROR] -X                         Print a synopsis of nonstandard options
[ERROR] -J<flag>                   Pass <flag> directly to the runtime system
[ERROR] -> [Help 1]
[ERROR] Failed to execute goal org.apache.maven.plugins:maven-compiler-plugin:3.2:compile
(default-compile) on project maven-war-plugin: Compilation failure
[ERROR] javac: invalid flag: -s
[ERROR] Usage: javac <options> <source files>
[ERROR] where possible options include:
[ERROR] -g                         Generate all debugging info
[ERROR] -g:none                    Generate no debugging info
[ERROR] -g:{lines,vars,source}     Generate only some debugging info
[ERROR] -nowarn                    Generate no warnings
[ERROR] -verbose                   Output messages about what the compiler is doing
[ERROR] -deprecation               Output source locations where deprecated APIs are used
[ERROR] -classpath <path>          Specify where to find user class files
[ERROR] -cp <path>                 Specify where to find user class files
[ERROR] -sourcepath <path>         Specify where to find input source files
[ERROR] -bootclasspath <path>      Override location of bootstrap class files
[ERROR] -extdirs <dirs>            Override location of installed extensions
[ERROR] -endorseddirs <dirs>       Override location of endorsed standards path
[ERROR] -d <directory>             Specify where to place generated class files
[ERROR] -encoding <encoding>       Specify character encoding used by source files
[ERROR] -source <release>          Provide source compatibility with specified release
[ERROR] -target <release>          Generate class files for specific VM version
[ERROR] -version                   Version information
[ERROR] -help                      Print a synopsis of standard options
[ERROR] -X                         Print a synopsis of nonstandard options
[ERROR] -J<flag>                   Pass <flag> directly to the runtime system
[ERROR] -> [Help 1]
[ERROR] Failed to execute goal org.apache.maven.plugins:maven-invoker-plugin:2.0.0:install
(integration-test) on project maven-plugins: Execution integration-test of goal org.apache.maven.plugins:maven-invoker-plugin:2.0.0:install
failed: Unable to load the mojo 'install' in the plugin 'org.apache.maven.plugins:maven-invoker-plugin:2.0.0'
due to an API incompatibility: org.codehaus.plexus.component.repository.exception.ComponentLookupException:
Bad version number in .class file
[ERROR] -----------------------------------------------------
[ERROR] realm =    plugin>org.apache.maven.plugins:maven-invoker-plugin:2.0.0
[ERROR] strategy = org.codehaus.plexus.classworlds.strategy.SelfFirstStrategy
[ERROR] urls[0] = file:/C:/.m2/repository/org/apache/maven/plugins/maven-invoker-plugin/2.0.0/maven-invoker-plugin-2.0.0.jar
[ERROR] urls[1] = file:/C:/.m2/repository/org/apache/maven/shared/maven-invoker/2.2/maven-invoker-2.2.jar
[ERROR] urls[2] = file:/C:/.m2/repository/org/codehaus/plexus/plexus-component-annotations/1.5.5/plexus-component-annotations-1.5.5.jar
[ERROR] urls[3] = file:/C:/.m2/repository/org/slf4j/slf4j-jdk14/1.5.6/slf4j-jdk14-1.5.6.jar
[ERROR] urls[4] = file:/C:/.m2/repository/org/slf4j/slf4j-api/1.5.6/slf4j-api-1.5.6.jar
[ERROR] urls[5] = file:/C:/.m2/repository/org/slf4j/jcl-over-slf4j/1.5.6/jcl-over-slf4j-1.5.6.jar
[ERROR] urls[6] = file:/C:/.m2/repository/junit/junit/3.8.1/junit-3.8.1.jar
[ERROR] urls[7] = file:/C:/.m2/repository/commons-cli/commons-cli/1.2/commons-cli-1.2.jar
[ERROR] urls[8] = file:/C:/.m2/repository/org/codehaus/plexus/plexus-interactivity-api/1.0-alpha-4/plexus-interactivity-api-1.0-alpha-4.jar
[ERROR] urls[9] = file:/C:/.m2/repository/backport-util-concurrent/backport-util-concurrent/3.1/backport-util-concurrent-3.1.jar
[ERROR] urls[10] = file:/C:/.m2/repository/org/sonatype/plexus/plexus-sec-dispatcher/1.3/plexus-sec-dispatcher-1.3.jar
[ERROR] urls[11] = file:/C:/.m2/repository/org/sonatype/plexus/plexus-cipher/1.4/plexus-cipher-1.4.jar
[ERROR] urls[12] = file:/C:/.m2/repository/org/apache/maven/reporting/maven-reporting-api/3.0/maven-reporting-api-3.0.jar
[ERROR] urls[13] = file:/C:/.m2/repository/org/apache/maven/reporting/maven-reporting-impl/2.2/maven-reporting-impl-2.2.jar
[ERROR] urls[14] = file:/C:/.m2/repository/org/apache/maven/doxia/doxia-core/1.2/doxia-core-1.2.jar
[ERROR] urls[15] = file:/C:/.m2/repository/xerces/xercesImpl/2.9.1/xercesImpl-2.9.1.jar
[ERROR] urls[16] = file:/C:/.m2/repository/xml-apis/xml-apis/1.3.04/xml-apis-1.3.04.jar
[ERROR] urls[17] = file:/C:/.m2/repository/commons-lang/commons-lang/2.4/commons-lang-2.4.jar
[ERROR] urls[18] = file:/C:/.m2/repository/org/apache/httpcomponents/httpclient/4.0.2/httpclient-4.0.2.jar
[ERROR] urls[19] = file:/C:/.m2/repository/org/apache/httpcomponents/httpcore/4.0.1/httpcore-4.0.1.jar
[ERROR] urls[20] = file:/C:/.m2/repository/commons-codec/commons-codec/1.3/commons-codec-1.3.jar
[ERROR] urls[21] = file:/C:/.m2/repository/commons-validator/commons-validator/1.3.1/commons-validator-1.3.1.jar
[ERROR] urls[22] = file:/C:/.m2/repository/commons-beanutils/commons-beanutils/1.7.0/commons-beanutils-1.7.0.jar
[ERROR] urls[23] = file:/C:/.m2/repository/commons-digester/commons-digester/1.6/commons-digester-1.6.jar
[ERROR] urls[24] = file:/C:/.m2/repository/commons-logging/commons-logging/1.0.4/commons-logging-1.0.4.jar
[ERROR] urls[25] = file:/C:/.m2/repository/org/apache/maven/shared/maven-script-interpreter/1.1/maven-script-interpreter-1.1.jar
[ERROR] urls[26] = file:/C:/.m2/repository/org/codehaus/groovy/groovy/2.0.1/groovy-2.0.1.jar
[ERROR] urls[27] = file:/C:/.m2/repository/antlr/antlr/2.7.7/antlr-2.7.7.jar
[ERROR] urls[28] = file:/C:/.m2/repository/org/ow2/asm/asm-tree/4.0/asm-tree-4.0.jar
[ERROR] urls[29] = file:/C:/.m2/repository/org/ow2/asm/asm-commons/4.0/asm-commons-4.0.jar
[ERROR] urls[30] = file:/C:/.m2/repository/org/ow2/asm/asm/4.0/asm-4.0.jar
[ERROR] urls[31] = file:/C:/.m2/repository/org/ow2/asm/asm-util/4.0/asm-util-4.0.jar
[ERROR] urls[32] = file:/C:/.m2/repository/org/ow2/asm/asm-analysis/4.0/asm-analysis-4.0.jar
[ERROR] urls[33] = file:/C:/.m2/repository/org/apache/maven/doxia/doxia-sink-api/1.4/doxia-sink-api-1.4.jar
[ERROR] urls[34] = file:/C:/.m2/repository/org/apache/maven/doxia/doxia-logging-api/1.4/doxia-logging-api-1.4.jar
[ERROR] urls[35] = file:/C:/.m2/repository/org/apache/maven/doxia/doxia-site-renderer/1.1.4/doxia-site-renderer-1.1.4.jar
[ERROR] urls[36] = file:/C:/.m2/repository/org/apache/maven/doxia/doxia-decoration-model/1.1.4/doxia-decoration-model-1.1.4.jar
[ERROR] urls[37] = file:/C:/.m2/repository/org/apache/maven/doxia/doxia-module-xhtml/1.1.4/doxia-module-xhtml-1.1.4.jar
[ERROR] urls[38] = file:/C:/.m2/repository/org/apache/maven/doxia/doxia-module-fml/1.1.4/doxia-module-fml-1.1.4.jar
[ERROR] urls[39] = file:/C:/.m2/repository/org/codehaus/plexus/plexus-velocity/1.1.7/plexus-velocity-1.1.7.jar
[ERROR] urls[40] = file:/C:/.m2/repository/org/apache/velocity/velocity/1.5/velocity-1.5.jar
[ERROR] urls[41] = file:/C:/.m2/repository/oro/oro/2.0.8/oro-2.0.8.jar
[ERROR] urls[42] = file:/C:/.m2/repository/commons-collections/commons-collections/3.2/commons-collections-3.2.jar
[ERROR] urls[43] = file:/C:/.m2/repository/org/beanshell/bsh/2.0b4/bsh-2.0b4.jar
[ERROR] urls[44] = file:/C:/.m2/repository/org/codehaus/groovy/groovy-all/2.0.1/groovy-all-2.0.1.jar
[ERROR] urls[45] = file:/C:/.m2/repository/org/apache/ant/ant/1.8.1/ant-1.8.1.jar
[ERROR] urls[46] = file:/C:/.m2/repository/org/codehaus/plexus/plexus-utils/3.0.21/plexus-utils-3.0.21.jar
[ERROR] urls[47] = file:/C:/.m2/repository/commons-io/commons-io/2.2/commons-io-2.2.jar
[ERROR] urls[48] = file:/C:/.m2/repository/org/codehaus/plexus/plexus-interpolation/1.21/plexus-interpolation-1.21.jar
[ERROR] urls[49] = file:/C:/.m2/repository/org/codehaus/plexus/plexus-i18n/1.0-beta-7/plexus-i18n-1.0-beta-7.jar
[ERROR] Number of foreign imports: 1
[ERROR] import: Entry[import  from realm ClassRealm[maven.api, parent: null]]
[ERROR] 
[ERROR] -----------------------------------------------------
[ERROR] -> [Help 2]
[ERROR] Failed to execute goal org.apache.maven.plugins:maven-compiler-plugin:3.2:compile
(default-compile) on project maven-project-info-reports-plugin: Compilation failure
[ERROR] javac: invalid flag: -s
[ERROR] Usage: javac <options> <source files>
[ERROR] where possible options include:
[ERROR] -g                         Generate all debugging info
[ERROR] -g:none                    Generate no debugging info
[ERROR] -g:{lines,vars,source}     Generate only some debugging info
[ERROR] -nowarn                    Generate no warnings
[ERROR] -verbose                   Output messages about what the compiler is doing
[ERROR] -deprecation               Output source locations where deprecated APIs are used
[ERROR] -classpath <path>          Specify where to find user class files
[ERROR] -cp <path>                 Specify where to find user class files
[ERROR] -sourcepath <path>         Specify where to find input source files
[ERROR] -bootclasspath <path>      Override location of bootstrap class files
[ERROR] -extdirs <dirs>            Override location of installed extensions
[ERROR] -endorseddirs <dirs>       Override location of endorsed standards path
[ERROR] -d <directory>             Specify where to place generated class files
[ERROR] -encoding <encoding>       Specify character encoding used by source files
[ERROR] -source <release>          Provide source compatibility with specified release
[ERROR] -target <release>          Generate class files for specific VM version
[ERROR] -version                   Version information
[ERROR] -help                      Print a synopsis of standard options
[ERROR] -X                         Print a synopsis of nonstandard options
[ERROR] -J<flag>                   Pass <flag> directly to the runtime system
[ERROR] -> [Help 1]
[ERROR] Failed to execute goal org.apache.maven.plugins:maven-compiler-plugin:3.2:compile
(default-compile) on project maven-remote-resources-plugin: Compilation failure
[ERROR] javac: invalid flag: -s
[ERROR] Usage: javac <options> <source files>
[ERROR] where possible options include:
[ERROR] -g                         Generate all debugging info
[ERROR] -g:none                    Generate no debugging info
[ERROR] -g:{lines,vars,source}     Generate only some debugging info
[ERROR] -nowarn                    Generate no warnings
[ERROR] -verbose                   Output messages about what the compiler is doing
[ERROR] -deprecation               Output source locations where deprecated APIs are used
[ERROR] -classpath <path>          Specify where to find user class files
[ERROR] -cp <path>                 Specify where to find user class files
[ERROR] -sourcepath <path>         Specify where to find input source files
[ERROR] -bootclasspath <path>      Override location of bootstrap class files
[ERROR] -extdirs <dirs>            Override location of installed extensions
[ERROR] -endorseddirs <dirs>       Override location of endorsed standards path
[ERROR] -d <directory>             Specify where to place generated class files
[ERROR] -encoding <encoding>       Specify character encoding used by source files
[ERROR] -source <release>          Provide source compatibility with specified release
[ERROR] -target <release>          Generate class files for specific VM version
[ERROR] -version                   Version information
[ERROR] -help                      Print a synopsis of standard options
[ERROR] -X                         Print a synopsis of nonstandard options
[ERROR] -J<flag>                   Pass <flag> directly to the runtime system
[ERROR] -> [Help 1]
[ERROR] Failed to execute goal org.apache.maven.plugins:maven-compiler-plugin:3.2:compile
(default-compile) on project maven-shade-plugin: Compilation failure
[ERROR] javac: invalid flag: -s
[ERROR] Usage: javac <options> <source files>
[ERROR] where possible options include:
[ERROR] -g                         Generate all debugging info
[ERROR] -g:none                    Generate no debugging info
[ERROR] -g:{lines,vars,source}     Generate only some debugging info
[ERROR] -nowarn                    Generate no warnings
[ERROR] -verbose                   Output messages about what the compiler is doing
[ERROR] -deprecation               Output source locations where deprecated APIs are used
[ERROR] -classpath <path>          Specify where to find user class files
[ERROR] -cp <path>                 Specify where to find user class files
[ERROR] -sourcepath <path>         Specify where to find input source files
[ERROR] -bootclasspath <path>      Override location of bootstrap class files
[ERROR] -extdirs <dirs>            Override location of installed extensions
[ERROR] -endorseddirs <dirs>       Override location of endorsed standards path
[ERROR] -d <directory>             Specify where to place generated class files
[ERROR] -encoding <encoding>       Specify character encoding used by source files
[ERROR] -source <release>          Provide source compatibility with specified release
[ERROR] -target <release>          Generate class files for specific VM version
[ERROR] -version                   Version information
[ERROR] -help                      Print a synopsis of standard options
[ERROR] -X                         Print a synopsis of nonstandard options
[ERROR] -J<flag>                   Pass <flag> directly to the runtime system
[ERROR] -> [Help 1]
[ERROR] Failed to execute goal org.apache.maven.plugins:maven-compiler-plugin:3.2:compile
(default-compile) on project maven-scm-publish-plugin: Compilation failure
[ERROR] javac: invalid flag: -s
[ERROR] Usage: javac <options> <source files>
[ERROR] where possible options include:
[ERROR] -g                         Generate all debugging info
[ERROR] -g:none                    Generate no debugging info
[ERROR] -g:{lines,vars,source}     Generate only some debugging info
[ERROR] -nowarn                    Generate no warnings
[ERROR] -verbose                   Output messages about what the compiler is doing
[ERROR] -deprecation               Output source locations where deprecated APIs are used
[ERROR] -classpath <path>          Specify where to find user class files
[ERROR] -cp <path>                 Specify where to find user class files
[ERROR] -sourcepath <path>         Specify where to find input source files
[ERROR] -bootclasspath <path>      Override location of bootstrap class files
[ERROR] -extdirs <dirs>            Override location of installed extensions
[ERROR] -endorseddirs <dirs>       Override location of endorsed standards path
[ERROR] -d <directory>             Specify where to place generated class files
[ERROR] -encoding <encoding>       Specify character encoding used by source files
[ERROR] -source <release>          Provide source compatibility with specified release
[ERROR] -target <release>          Generate class files for specific VM version
[ERROR] -version                   Version information
[ERROR] -help                      Print a synopsis of standard options
[ERROR] -X                         Print a synopsis of nonstandard options
[ERROR] -J<flag>                   Pass <flag> directly to the runtime system
[ERROR] -> [Help 1]
[ERROR] 
[ERROR] To see the full stack trace of the errors, re-run Maven with the -e switch.
[ERROR] Re-run Maven using the -X switch to enable full debug logging.
[ERROR] 
[ERROR] For more information about the errors and possible solutions, please read the following
articles:
[ERROR] [Help 1] http://cwiki.apache.org/confluence/display/MAVEN/MojoFailureException
[ERROR] [Help 2] http://cwiki.apache.org/confluence/display/MAVEN/PluginContainerException
Build step 'Invoke top-level Maven targets' marked build as failure
Deleting 1 temporary files
Recording test results
ERROR: Publisher 'Publish JUnit test result report' failed: No test report files were found.
Configuration error?


Mime
View raw message