maven-notifications mailing list archives

Site index · List index
Message view « Date » · « Thread »
Top « Date » · « Thread »
From Apache Jenkins Server <jenk...@builds.apache.org>
Subject Build failed in Jenkins: maven-plugins #4771
Date Thu, 22 Oct 2015 11:39:16 GMT
See <https://builds.apache.org/job/maven-plugins/4771/changes>

Changes:

[Michael Osipov] [MPH-110] Cannot run ITs successfully

------------------------------------------
[...truncated 19493 lines...]
A         maven-scm-publish-plugin/src/it/004-publish-scm/src/site
AU        maven-scm-publish-plugin/src/it/004-publish-scm/src/site/site.xml
A         maven-scm-publish-plugin/src/it/004-publish-scm/src/site/apt
AU        maven-scm-publish-plugin/src/it/004-publish-scm/src/site/apt/index.apt
A         maven-scm-publish-plugin/src/it/004-publish-scm/src/site/resources
A         maven-scm-publish-plugin/src/it/004-publish-scm/src/site/resources/trunk
AU        maven-scm-publish-plugin/src/it/004-publish-scm/src/site/resources/trunk/readme.txt
A         maven-scm-publish-plugin/src/it/003-lifecycle
A         maven-scm-publish-plugin/src/it/003-lifecycle/src
A         maven-scm-publish-plugin/src/it/003-lifecycle/src/main
A         maven-scm-publish-plugin/src/it/003-lifecycle/src/main/java
A         maven-scm-publish-plugin/src/it/003-lifecycle/src/main/java/org
A         maven-scm-publish-plugin/src/it/003-lifecycle/src/main/java/org/apache
A         maven-scm-publish-plugin/src/it/003-lifecycle/src/main/java/org/apache/maven
A         maven-scm-publish-plugin/src/it/003-lifecycle/src/main/java/org/apache/maven/it
AU        maven-scm-publish-plugin/src/it/003-lifecycle/src/main/java/org/apache/maven/it/ThisHasJavadoc.java
A         maven-scm-publish-plugin/src/it/003-lifecycle/src/site
AU        maven-scm-publish-plugin/src/it/003-lifecycle/src/site/site.xml
A         maven-scm-publish-plugin/src/it/003-lifecycle/src/site/apt
AU        maven-scm-publish-plugin/src/it/003-lifecycle/src/site/apt/index.apt
AU        maven-scm-publish-plugin/src/it/003-lifecycle/invoker.properties
AU        maven-scm-publish-plugin/src/it/003-lifecycle/pom.xml
AU        maven-scm-publish-plugin/src/it/003-lifecycle/setup.bsh
AU        maven-scm-publish-plugin/src/it/settings.xml
A         maven-scm-publish-plugin/src/it/006-site-multi-module
A         maven-scm-publish-plugin/src/it/006-site-multi-module/module
A         maven-scm-publish-plugin/src/it/006-site-multi-module/module/src
A         maven-scm-publish-plugin/src/it/006-site-multi-module/module/src/main
A         maven-scm-publish-plugin/src/it/006-site-multi-module/module/src/main/java
A         maven-scm-publish-plugin/src/it/006-site-multi-module/module/src/main/java/org
A         maven-scm-publish-plugin/src/it/006-site-multi-module/module/src/main/java/org/apache
A         maven-scm-publish-plugin/src/it/006-site-multi-module/module/src/main/java/org/apache/maven
A         maven-scm-publish-plugin/src/it/006-site-multi-module/module/src/main/java/org/apache/maven/it
AU        maven-scm-publish-plugin/src/it/006-site-multi-module/module/src/main/java/org/apache/maven/it/ThisHasJavadoc.java
AU        maven-scm-publish-plugin/src/it/006-site-multi-module/module/pom.xml
AU        maven-scm-publish-plugin/src/it/006-site-multi-module/invoker.properties
AU        maven-scm-publish-plugin/src/it/006-site-multi-module/pom.xml
AU        maven-scm-publish-plugin/src/it/006-site-multi-module/setup.bsh
A         maven-scm-publish-plugin/src/it/005-site-lifecycle
A         maven-scm-publish-plugin/src/it/005-site-lifecycle/src
A         maven-scm-publish-plugin/src/it/005-site-lifecycle/src/main
A         maven-scm-publish-plugin/src/it/005-site-lifecycle/src/main/java
A         maven-scm-publish-plugin/src/it/005-site-lifecycle/src/main/java/org
A         maven-scm-publish-plugin/src/it/005-site-lifecycle/src/main/java/org/apache
A         maven-scm-publish-plugin/src/it/005-site-lifecycle/src/main/java/org/apache/maven
A         maven-scm-publish-plugin/src/it/005-site-lifecycle/src/main/java/org/apache/maven/it
AU        maven-scm-publish-plugin/src/it/005-site-lifecycle/src/main/java/org/apache/maven/it/ThisHasJavadoc.java
A         maven-scm-publish-plugin/src/it/005-site-lifecycle/src/site
A         maven-scm-publish-plugin/src/it/005-site-lifecycle/src/site/resources
A         maven-scm-publish-plugin/src/it/005-site-lifecycle/src/site/resources/trunk
AU        maven-scm-publish-plugin/src/it/005-site-lifecycle/src/site/resources/trunk/readme.txt
AU        maven-scm-publish-plugin/src/it/005-site-lifecycle/src/site/site.xml
A         maven-scm-publish-plugin/src/it/005-site-lifecycle/src/site/apt
AU        maven-scm-publish-plugin/src/it/005-site-lifecycle/src/site/apt/index.apt
AU        maven-scm-publish-plugin/src/it/005-site-lifecycle/invoker.properties
AU        maven-scm-publish-plugin/src/it/005-site-lifecycle/pom.xml
AU        maven-scm-publish-plugin/src/it/005-site-lifecycle/setup.bsh
A         maven-scm-publish-plugin/src/main
A         maven-scm-publish-plugin/src/main/java
A         maven-scm-publish-plugin/src/main/java/org
A         maven-scm-publish-plugin/src/main/java/org/apache
A         maven-scm-publish-plugin/src/main/java/org/apache/maven
A         maven-scm-publish-plugin/src/main/java/org/apache/maven/plugins
A         maven-scm-publish-plugin/src/main/java/org/apache/maven/plugins/scmpublish
AU        maven-scm-publish-plugin/src/main/java/org/apache/maven/plugins/scmpublish/ScmPublishLifecycleMojo.java
AU        maven-scm-publish-plugin/src/main/java/org/apache/maven/plugins/scmpublish/AbstractScmPublishMojo.java
AU        maven-scm-publish-plugin/src/main/java/org/apache/maven/plugins/scmpublish/ScmPublishPublishScmMojo.java
A         maven-scm-publish-plugin/src/main/resources
A         maven-scm-publish-plugin/src/main/resources/META-INF
A         maven-scm-publish-plugin/src/main/resources/META-INF/maven
AU        maven-scm-publish-plugin/src/main/resources/META-INF/maven/lifecycle.xml
A         maven-scm-publish-plugin/src/main/resources/META-INF/plexus
AU        maven-scm-publish-plugin/src/main/resources/META-INF/plexus/components.xml
A         maven-scm-publish-plugin/src/site
AU        maven-scm-publish-plugin/src/site/site.xml
A         maven-scm-publish-plugin/src/site/apt
AU        maven-scm-publish-plugin/src/site/apt/various-tips.apt.vm
AU        maven-scm-publish-plugin/src/site/apt/index.apt.vm
A         maven-scm-publish-plugin/src/site/apt/examples
AU        maven-scm-publish-plugin/src/site/apt/examples/one-module-configuration.apt.vm
AU        maven-scm-publish-plugin/src/site/apt/examples/importing-maven-site.apt
AU        maven-scm-publish-plugin/src/site/apt/examples/multi-module-configuration.apt.vm
A         maven-scm-publish-plugin/src/site/apt/usage.apt.vm
A         maven-scm-publish-plugin/src/site/resources
AU        maven-scm-publish-plugin/src/site/resources/download.cgi
A         maven-scm-publish-plugin/src/site/xdoc
AU        maven-scm-publish-plugin/src/site/xdoc/download.xml.vm
AU        maven-scm-publish-plugin/pom.xml
 U        .
At revision 1709994
Parsing POMs
Downloaded artifact http://repo.maven.apache.org/maven2/org/apache/maven/plugins/maven-plugins/28/maven-plugins-28.pom
Downloaded artifact http://repo.maven.apache.org/maven2/org/apache/maven/maven-parent/27/maven-parent-27.pom
Downloaded artifact http://repo.maven.apache.org/maven2/org/apache/apache/17/apache-17.pom
Failed to transfer Could not find metadata org.apache.maven.plugins:maven-plugins:28-SNAPSHOT/maven-metadata.xml
in plexus-snapshots (https://oss.sonatype.org/content/repositories/plexus-snapshots)
Failed to transfer Could not find artifact org.apache.maven.plugins:maven-plugins:pom:28-SNAPSHOT
in plexus-snapshots (https://oss.sonatype.org/content/repositories/plexus-snapshots)
ERROR: Failed to parse POMs
java.io.IOException: remote file operation failed: <https://builds.apache.org/job/maven-plugins/ws/>
at hudson.remoting.Channel@6e1c1999:jenkins-ubuntu-1404-4gb-abc: hudson.remoting.ProxyException:
hudson.maven.MavenModuleSetBuild$MavenExecutionException: org.apache.maven.project.ProjectBuildingException:
Some problems were encountered while processing the POMs:
[FATAL] Non-resolvable parent POM: Could not find artifact org.apache.maven.plugins:maven-plugins:pom:28-SNAPSHOT
and 'parent.relativePath' points at wrong local POM @ line 25, column 11
[FATAL] Non-resolvable parent POM: Could not find artifact org.apache.maven.plugins:maven-plugins:pom:28-SNAPSHOT
and 'parent.relativePath' points at wrong local POM @ line 25, column 11
[FATAL] Non-resolvable parent POM: Could not find artifact org.apache.maven.plugins:maven-plugins:pom:28-SNAPSHOT
and 'parent.relativePath' points at wrong local POM @ line 25, column 11
[FATAL] Non-resolvable parent POM: Could not find artifact org.apache.maven.plugins:maven-plugins:pom:28-SNAPSHOT
and 'parent.relativePath' points at wrong local POM @ line 25, column 11
[FATAL] Non-resolvable parent POM: Could not find artifact org.apache.maven.plugins:maven-plugins:pom:28-SNAPSHOT
and 'parent.relativePath' points at wrong local POM @ line 25, column 11
[FATAL] Non-resolvable parent POM: Could not find artifact org.apache.maven.plugins:maven-plugins:pom:28-SNAPSHOT
in plexus-snapshots (https://oss.sonatype.org/content/repositories/plexus-snapshots) and 'parent.relativePath'
points at wrong local POM @ line 25, column 11
[FATAL] Non-resolvable parent POM: Could not find artifact org.apache.maven.plugins:maven-plugins:pom:28-SNAPSHOT
and 'parent.relativePath' points at wrong local POM @ line 25, column 11
[FATAL] Non-resolvable parent POM: Could not find artifact org.apache.maven.plugins:maven-plugins:pom:28-SNAPSHOT
and 'parent.relativePath' points at wrong local POM @ line 25, column 11
[FATAL] Non-resolvable parent POM: Could not find artifact org.apache.maven.plugins:maven-plugins:pom:28-SNAPSHOT
and 'parent.relativePath' points at wrong local POM @ line 25, column 11
[FATAL] Non-resolvable parent POM: Could not find artifact org.apache.maven.plugins:maven-plugins:pom:28-SNAPSHOT
and 'parent.relativePath' points at wrong local POM @ line 25, column 11
[FATAL] Non-resolvable parent POM: Could not find artifact org.apache.maven.plugins:maven-plugins:pom:28-SNAPSHOT
and 'parent.relativePath' points at wrong local POM @ line 25, column 11
[FATAL] Non-resolvable parent POM: Could not find artifact org.apache.maven.plugins:maven-plugins:pom:28-SNAPSHOT
and 'parent.relativePath' points at wrong local POM @ line 25, column 11
[FATAL] Non-resolvable parent POM: Could not find artifact org.apache.maven.plugins:maven-plugins:pom:28-SNAPSHOT
and 'parent.relativePath' points at wrong local POM @ line 25, column 11
[FATAL] Non-resolvable parent POM: Could not find artifact org.apache.maven.plugins:maven-plugins:pom:28-SNAPSHOT
and 'parent.relativePath' points at wrong local POM @ line 25, column 11
[FATAL] Non-resolvable parent POM: Could not find artifact org.apache.maven.plugins:maven-plugins:pom:28-SNAPSHOT
and 'parent.relativePath' points at wrong local POM @ line 25, column 11
[FATAL] Non-resolvable parent POM: Could not find artifact org.apache.maven.plugins:maven-plugins:pom:28-SNAPSHOT
and 'parent.relativePath' points at wrong local POM @ line 25, column 11
[FATAL] Non-resolvable parent POM: Could not find artifact org.apache.maven.plugins:maven-plugins:pom:28-SNAPSHOT
and 'parent.relativePath' points at wrong local POM @ line 25, column 11
[FATAL] Non-resolvable parent POM: Could not find artifact org.apache.maven.plugins:maven-plugins:pom:28-SNAPSHOT
and 'parent.relativePath' points at wrong local POM @ line 25, column 11
[FATAL] Non-resolvable parent POM: Could not find artifact org.apache.maven.plugins:maven-plugins:pom:28-SNAPSHOT
and 'parent.relativePath' points at wrong local POM @ line 25, column 11
[FATAL] Non-resolvable parent POM: Could not find artifact org.apache.maven.plugins:maven-plugins:pom:28-SNAPSHOT
and 'parent.relativePath' points at wrong local POM @ line 25, column 11
[FATAL] Non-resolvable parent POM: Could not find artifact org.apache.maven.plugins:maven-plugins:pom:28-SNAPSHOT
and 'parent.relativePath' points at wrong local POM @ line 25, column 11
[FATAL] Non-resolvable parent POM: Could not find artifact org.apache.maven.plugins:maven-plugins:pom:28-SNAPSHOT
and 'parent.relativePath' points at wrong local POM @ line 25, column 11
[FATAL] Non-resolvable parent POM: Could not find artifact org.apache.maven.plugins:maven-plugins:pom:28-SNAPSHOT
and 'parent.relativePath' points at wrong local POM @ line 25, column 11
[FATAL] Non-resolvable parent POM: Could not find artifact org.apache.maven.plugins:maven-plugins:pom:28-SNAPSHOT
and 'parent.relativePath' points at wrong local POM @ line 25, column 11
[FATAL] Non-resolvable parent POM: Could not find artifact org.apache.maven.plugins:maven-plugins:pom:28-SNAPSHOT
and 'parent.relativePath' points at wrong local POM @ line 25, column 11
[FATAL] Non-resolvable parent POM: Could not find artifact org.apache.maven.plugins:maven-plugins:pom:28-SNAPSHOT
and 'parent.relativePath' points at wrong local POM @ line 25, column 11
[FATAL] Non-resolvable parent POM: Could not find artifact org.apache.maven.plugins:maven-plugins:pom:28-SNAPSHOT
and 'parent.relativePath' points at wrong local POM @ line 25, column 11
[FATAL] Non-resolvable parent POM: Could not find artifact org.apache.maven.plugins:maven-plugins:pom:28-SNAPSHOT
and 'parent.relativePath' points at wrong local POM @ line 25, column 11
[FATAL] Non-resolvable parent POM: Could not find artifact org.apache.maven.plugins:maven-plugins:pom:28-SNAPSHOT
and 'parent.relativePath' points at wrong local POM @ line 25, column 11
[FATAL] Non-resolvable parent POM: Could not find artifact org.apache.maven.plugins:maven-plugins:pom:28-SNAPSHOT
and 'parent.relativePath' points at wrong local POM @ line 25, column 11
[FATAL] Non-resolvable parent POM: Could not find artifact org.apache.maven.plugins:maven-plugins:pom:28-SNAPSHOT
and 'parent.relativePath' points at wrong local POM @ line 28, column 11
[FATAL] Non-resolvable parent POM: Could not find artifact org.apache.maven.plugins:maven-plugins:pom:28-SNAPSHOT
and 'parent.relativePath' points at wrong local POM @ line 25, column 11
[FATAL] Non-resolvable parent POM: Could not find artifact org.apache.maven.plugins:maven-plugins:pom:28-SNAPSHOT
and 'parent.relativePath' points at wrong local POM @ line 26, column 11
[FATAL] Non-resolvable parent POM: Could not find artifact org.apache.maven.plugins:maven-plugins:pom:28-SNAPSHOT
and 'parent.relativePath' points at wrong local POM @ line 25, column 11
[FATAL] Non-resolvable parent POM: Could not find artifact org.apache.maven.plugins:maven-plugins:pom:28-SNAPSHOT
and 'parent.relativePath' points at wrong local POM @ line 25, column 11

	at hudson.FilePath.act(FilePath.java:985)
	at hudson.FilePath.act(FilePath.java:967)
	at hudson.maven.MavenModuleSetBuild$MavenModuleSetBuildExecution.parsePoms(MavenModuleSetBuild.java:960)
	at hudson.maven.MavenModuleSetBuild$MavenModuleSetBuildExecution.doRun(MavenModuleSetBuild.java:679)
	at hudson.model.AbstractBuild$AbstractBuildExecution.run(AbstractBuild.java:536)
	at hudson.model.Run.execute(Run.java:1738)
	at hudson.maven.MavenModuleSetBuild.run(MavenModuleSetBuild.java:531)
	at hudson.model.ResourceController.execute(ResourceController.java:98)
	at hudson.model.Executor.run(Executor.java:381)
Caused by: hudson.remoting.ProxyException: hudson.maven.MavenModuleSetBuild$MavenExecutionException:
org.apache.maven.project.ProjectBuildingException: Some problems were encountered while processing
the POMs:
[FATAL] Non-resolvable parent POM: Could not find artifact org.apache.maven.plugins:maven-plugins:pom:28-SNAPSHOT
and 'parent.relativePath' points at wrong local POM @ line 25, column 11
[FATAL] Non-resolvable parent POM: Could not find artifact org.apache.maven.plugins:maven-plugins:pom:28-SNAPSHOT
and 'parent.relativePath' points at wrong local POM @ line 25, column 11
[FATAL] Non-resolvable parent POM: Could not find artifact org.apache.maven.plugins:maven-plugins:pom:28-SNAPSHOT
and 'parent.relativePath' points at wrong local POM @ line 25, column 11
[FATAL] Non-resolvable parent POM: Could not find artifact org.apache.maven.plugins:maven-plugins:pom:28-SNAPSHOT
and 'parent.relativePath' points at wrong local POM @ line 25, column 11
[FATAL] Non-resolvable parent POM: Could not find artifact org.apache.maven.plugins:maven-plugins:pom:28-SNAPSHOT
and 'parent.relativePath' points at wrong local POM @ line 25, column 11
[FATAL] Non-resolvable parent POM: Could not find artifact org.apache.maven.plugins:maven-plugins:pom:28-SNAPSHOT
in plexus-snapshots (https://oss.sonatype.org/content/repositories/plexus-snapshots) and 'parent.relativePath'
points at wrong local POM @ line 25, column 11
[FATAL] Non-resolvable parent POM: Could not find artifact org.apache.maven.plugins:maven-plugins:pom:28-SNAPSHOT
and 'parent.relativePath' points at wrong local POM @ line 25, column 11
[FATAL] Non-resolvable parent POM: Could not find artifact org.apache.maven.plugins:maven-plugins:pom:28-SNAPSHOT
and 'parent.relativePath' points at wrong local POM @ line 25, column 11
[FATAL] Non-resolvable parent POM: Could not find artifact org.apache.maven.plugins:maven-plugins:pom:28-SNAPSHOT
and 'parent.relativePath' points at wrong local POM @ line 25, column 11
[FATAL] Non-resolvable parent POM: Could not find artifact org.apache.maven.plugins:maven-plugins:pom:28-SNAPSHOT
and 'parent.relativePath' points at wrong local POM @ line 25, column 11
[FATAL] Non-resolvable parent POM: Could not find artifact org.apache.maven.plugins:maven-plugins:pom:28-SNAPSHOT
and 'parent.relativePath' points at wrong local POM @ line 25, column 11
[FATAL] Non-resolvable parent POM: Could not find artifact org.apache.maven.plugins:maven-plugins:pom:28-SNAPSHOT
and 'parent.relativePath' points at wrong local POM @ line 25, column 11
[FATAL] Non-resolvable parent POM: Could not find artifact org.apache.maven.plugins:maven-plugins:pom:28-SNAPSHOT
and 'parent.relativePath' points at wrong local POM @ line 25, column 11
[FATAL] Non-resolvable parent POM: Could not find artifact org.apache.maven.plugins:maven-plugins:pom:28-SNAPSHOT
and 'parent.relativePath' points at wrong local POM @ line 25, column 11
[FATAL] Non-resolvable parent POM: Could not find artifact org.apache.maven.plugins:maven-plugins:pom:28-SNAPSHOT
and 'parent.relativePath' points at wrong local POM @ line 25, column 11
[FATAL] Non-resolvable parent POM: Could not find artifact org.apache.maven.plugins:maven-plugins:pom:28-SNAPSHOT
and 'parent.relativePath' points at wrong local POM @ line 25, column 11
[FATAL] Non-resolvable parent POM: Could not find artifact org.apache.maven.plugins:maven-plugins:pom:28-SNAPSHOT
and 'parent.relativePath' points at wrong local POM @ line 25, column 11
[FATAL] Non-resolvable parent POM: Could not find artifact org.apache.maven.plugins:maven-plugins:pom:28-SNAPSHOT
and 'parent.relativePath' points at wrong local POM @ line 25, column 11
[FATAL] Non-resolvable parent POM: Could not find artifact org.apache.maven.plugins:maven-plugins:pom:28-SNAPSHOT
and 'parent.relativePath' points at wrong local POM @ line 25, column 11
[FATAL] Non-resolvable parent POM: Could not find artifact org.apache.maven.plugins:maven-plugins:pom:28-SNAPSHOT
and 'parent.relativePath' points at wrong local POM @ line 25, column 11
[FATAL] Non-resolvable parent POM: Could not find artifact org.apache.maven.plugins:maven-plugins:pom:28-SNAPSHOT
and 'parent.relativePath' points at wrong local POM @ line 25, column 11
[FATAL] Non-resolvable parent POM: Could not find artifact org.apache.maven.plugins:maven-plugins:pom:28-SNAPSHOT
and 'parent.relativePath' points at wrong local POM @ line 25, column 11
[FATAL] Non-resolvable parent POM: Could not find artifact org.apache.maven.plugins:maven-plugins:pom:28-SNAPSHOT
and 'parent.relativePath' points at wrong local POM @ line 25, column 11
[FATAL] Non-resolvable parent POM: Could not find artifact org.apache.maven.plugins:maven-plugins:pom:28-SNAPSHOT
and 'parent.relativePath' points at wrong local POM @ line 25, column 11
[FATAL] Non-resolvable parent POM: Could not find artifact org.apache.maven.plugins:maven-plugins:pom:28-SNAPSHOT
and 'parent.relativePath' points at wrong local POM @ line 25, column 11
[FATAL] Non-resolvable parent POM: Could not find artifact org.apache.maven.plugins:maven-plugins:pom:28-SNAPSHOT
and 'parent.relativePath' points at wrong local POM @ line 25, column 11
[FATAL] Non-resolvable parent POM: Could not find artifact org.apache.maven.plugins:maven-plugins:pom:28-SNAPSHOT
and 'parent.relativePath' points at wrong local POM @ line 25, column 11
[FATAL] Non-resolvable parent POM: Could not find artifact org.apache.maven.plugins:maven-plugins:pom:28-SNAPSHOT
and 'parent.relativePath' points at wrong local POM @ line 25, column 11
[FATAL] Non-resolvable parent POM: Could not find artifact org.apache.maven.plugins:maven-plugins:pom:28-SNAPSHOT
and 'parent.relativePath' points at wrong local POM @ line 25, column 11
[FATAL] Non-resolvable parent POM: Could not find artifact org.apache.maven.plugins:maven-plugins:pom:28-SNAPSHOT
and 'parent.relativePath' points at wrong local POM @ line 25, column 11
[FATAL] Non-resolvable parent POM: Could not find artifact org.apache.maven.plugins:maven-plugins:pom:28-SNAPSHOT
and 'parent.relativePath' points at wrong local POM @ line 28, column 11
[FATAL] Non-resolvable parent POM: Could not find artifact org.apache.maven.plugins:maven-plugins:pom:28-SNAPSHOT
and 'parent.relativePath' points at wrong local POM @ line 25, column 11
[FATAL] Non-resolvable parent POM: Could not find artifact org.apache.maven.plugins:maven-plugins:pom:28-SNAPSHOT
and 'parent.relativePath' points at wrong local POM @ line 26, column 11
[FATAL] Non-resolvable parent POM: Could not find artifact org.apache.maven.plugins:maven-plugins:pom:28-SNAPSHOT
and 'parent.relativePath' points at wrong local POM @ line 25, column 11
[FATAL] Non-resolvable parent POM: Could not find artifact org.apache.maven.plugins:maven-plugins:pom:28-SNAPSHOT
and 'parent.relativePath' points at wrong local POM @ line 25, column 11

	at hudson.maven.MavenModuleSetBuild$PomParser.invoke(MavenModuleSetBuild.java:1364)
	at hudson.maven.MavenModuleSetBuild$PomParser.invoke(MavenModuleSetBuild.java:1098)
	at hudson.FilePath$FileCallableWrapper.call(FilePath.java:2688)
	at hudson.remoting.UserRequest.perform(UserRequest.java:121)
	at hudson.remoting.UserRequest.perform(UserRequest.java:49)
	at hudson.remoting.Request$2.run(Request.java:326)
	at hudson.remoting.InterceptingExecutorService$1.call(InterceptingExecutorService.java:68)
	at java.util.concurrent.FutureTask.run(FutureTask.java:262)
	at java.util.concurrent.ThreadPoolExecutor.runWorker(ThreadPoolExecutor.java:1145)
	at java.util.concurrent.ThreadPoolExecutor$Worker.run(ThreadPoolExecutor.java:615)
	at java.lang.Thread.run(Thread.java:745)
	at ......remote call to jenkins-ubuntu-1404-4gb-abc(Native Method)
	at hudson.remoting.Channel.attachCallSiteStackTrace(Channel.java:1413)
	at hudson.remoting.UserResponse.retrieve(UserRequest.java:221)
	at hudson.remoting.Channel.call(Channel.java:778)
	at hudson.FilePath.act(FilePath.java:978)
	... 8 more
Caused by: hudson.remoting.ProxyException: org.apache.maven.project.ProjectBuildingException:
Some problems were encountered while processing the POMs:
[FATAL] Non-resolvable parent POM: Could not find artifact org.apache.maven.plugins:maven-plugins:pom:28-SNAPSHOT
and 'parent.relativePath' points at wrong local POM @ line 25, column 11
[FATAL] Non-resolvable parent POM: Could not find artifact org.apache.maven.plugins:maven-plugins:pom:28-SNAPSHOT
and 'parent.relativePath' points at wrong local POM @ line 25, column 11
[FATAL] Non-resolvable parent POM: Could not find artifact org.apache.maven.plugins:maven-plugins:pom:28-SNAPSHOT
and 'parent.relativePath' points at wrong local POM @ line 25, column 11
[FATAL] Non-resolvable parent POM: Could not find artifact org.apache.maven.plugins:maven-plugins:pom:28-SNAPSHOT
and 'parent.relativePath' points at wrong local POM @ line 25, column 11
[FATAL] Non-resolvable parent POM: Could not find artifact org.apache.maven.plugins:maven-plugins:pom:28-SNAPSHOT
and 'parent.relativePath' points at wrong local POM @ line 25, column 11
[FATAL] Non-resolvable parent POM: Could not find artifact org.apache.maven.plugins:maven-plugins:pom:28-SNAPSHOT
in plexus-snapshots (https://oss.sonatype.org/content/repositories/plexus-snapshots) and 'parent.relativePath'
points at wrong local POM @ line 25, column 11
[FATAL] Non-resolvable parent POM: Could not find artifact org.apache.maven.plugins:maven-plugins:pom:28-SNAPSHOT
and 'parent.relativePath' points at wrong local POM @ line 25, column 11
[FATAL] Non-resolvable parent POM: Could not find artifact org.apache.maven.plugins:maven-plugins:pom:28-SNAPSHOT
and 'parent.relativePath' points at wrong local POM @ line 25, column 11
[FATAL] Non-resolvable parent POM: Could not find artifact org.apache.maven.plugins:maven-plugins:pom:28-SNAPSHOT
and 'parent.relativePath' points at wrong local POM @ line 25, column 11
[FATAL] Non-resolvable parent POM: Could not find artifact org.apache.maven.plugins:maven-plugins:pom:28-SNAPSHOT
and 'parent.relativePath' points at wrong local POM @ line 25, column 11
[FATAL] Non-resolvable parent POM: Could not find artifact org.apache.maven.plugins:maven-plugins:pom:28-SNAPSHOT
and 'parent.relativePath' points at wrong local POM @ line 25, column 11
[FATAL] Non-resolvable parent POM: Could not find artifact org.apache.maven.plugins:maven-plugins:pom:28-SNAPSHOT
and 'parent.relativePath' points at wrong local POM @ line 25, column 11
[FATAL] Non-resolvable parent POM: Could not find artifact org.apache.maven.plugins:maven-plugins:pom:28-SNAPSHOT
and 'parent.relativePath' points at wrong local POM @ line 25, column 11
[FATAL] Non-resolvable parent POM: Could not find artifact org.apache.maven.plugins:maven-plugins:pom:28-SNAPSHOT
and 'parent.relativePath' points at wrong local POM @ line 25, column 11
[FATAL] Non-resolvable parent POM: Could not find artifact org.apache.maven.plugins:maven-plugins:pom:28-SNAPSHOT
and 'parent.relativePath' points at wrong local POM @ line 25, column 11
[FATAL] Non-resolvable parent POM: Could not find artifact org.apache.maven.plugins:maven-plugins:pom:28-SNAPSHOT
and 'parent.relativePath' points at wrong local POM @ line 25, column 11
[FATAL] Non-resolvable parent POM: Could not find artifact org.apache.maven.plugins:maven-plugins:pom:28-SNAPSHOT
and 'parent.relativePath' points at wrong local POM @ line 25, column 11
[FATAL] Non-resolvable parent POM: Could not find artifact org.apache.maven.plugins:maven-plugins:pom:28-SNAPSHOT
and 'parent.relativePath' points at wrong local POM @ line 25, column 11
[FATAL] Non-resolvable parent POM: Could not find artifact org.apache.maven.plugins:maven-plugins:pom:28-SNAPSHOT
and 'parent.relativePath' points at wrong local POM @ line 25, column 11
[FATAL] Non-resolvable parent POM: Could not find artifact org.apache.maven.plugins:maven-plugins:pom:28-SNAPSHOT
and 'parent.relativePath' points at wrong local POM @ line 25, column 11
[FATAL] Non-resolvable parent POM: Could not find artifact org.apache.maven.plugins:maven-plugins:pom:28-SNAPSHOT
and 'parent.relativePath' points at wrong local POM @ line 25, column 11
[FATAL] Non-resolvable parent POM: Could not find artifact org.apache.maven.plugins:maven-plugins:pom:28-SNAPSHOT
and 'parent.relativePath' points at wrong local POM @ line 25, column 11
[FATAL] Non-resolvable parent POM: Could not find artifact org.apache.maven.plugins:maven-plugins:pom:28-SNAPSHOT
and 'parent.relativePath' points at wrong local POM @ line 25, column 11
[FATAL] Non-resolvable parent POM: Could not find artifact org.apache.maven.plugins:maven-plugins:pom:28-SNAPSHOT
and 'parent.relativePath' points at wrong local POM @ line 25, column 11
[FATAL] Non-resolvable parent POM: Could not find artifact org.apache.maven.plugins:maven-plugins:pom:28-SNAPSHOT
and 'parent.relativePath' points at wrong local POM @ line 25, column 11
[FATAL] Non-resolvable parent POM: Could not find artifact org.apache.maven.plugins:maven-plugins:pom:28-SNAPSHOT
and 'parent.relativePath' points at wrong local POM @ line 25, column 11
[FATAL] Non-resolvable parent POM: Could not find artifact org.apache.maven.plugins:maven-plugins:pom:28-SNAPSHOT
and 'parent.relativePath' points at wrong local POM @ line 25, column 11
[FATAL] Non-resolvable parent POM: Could not find artifact org.apache.maven.plugins:maven-plugins:pom:28-SNAPSHOT
and 'parent.relativePath' points at wrong local POM @ line 25, column 11
[FATAL] Non-resolvable parent POM: Could not find artifact org.apache.maven.plugins:maven-plugins:pom:28-SNAPSHOT
and 'parent.relativePath' points at wrong local POM @ line 25, column 11
[FATAL] Non-resolvable parent POM: Could not find artifact org.apache.maven.plugins:maven-plugins:pom:28-SNAPSHOT
and 'parent.relativePath' points at wrong local POM @ line 25, column 11
[FATAL] Non-resolvable parent POM: Could not find artifact org.apache.maven.plugins:maven-plugins:pom:28-SNAPSHOT
and 'parent.relativePath' points at wrong local POM @ line 28, column 11
[FATAL] Non-resolvable parent POM: Could not find artifact org.apache.maven.plugins:maven-plugins:pom:28-SNAPSHOT
and 'parent.relativePath' points at wrong local POM @ line 25, column 11
[FATAL] Non-resolvable parent POM: Could not find artifact org.apache.maven.plugins:maven-plugins:pom:28-SNAPSHOT
and 'parent.relativePath' points at wrong local POM @ line 26, column 11
[FATAL] Non-resolvable parent POM: Could not find artifact org.apache.maven.plugins:maven-plugins:pom:28-SNAPSHOT
and 'parent.relativePath' points at wrong local POM @ line 25, column 11
[FATAL] Non-resolvable parent POM: Could not find artifact org.apache.maven.plugins:maven-plugins:pom:28-SNAPSHOT
and 'parent.relativePath' points at wrong local POM @ line 25, column 11

	at org.apache.maven.project.DefaultProjectBuilder.build(DefaultProjectBuilder.java:364)
	at hudson.maven.MavenEmbedder.buildProjects(MavenEmbedder.java:361)
	at hudson.maven.MavenEmbedder.readProjects(MavenEmbedder.java:331)
	at hudson.maven.MavenModuleSetBuild$PomParser.invoke(MavenModuleSetBuild.java:1301)
	at hudson.maven.MavenModuleSetBuild$PomParser.invoke(MavenModuleSetBuild.java:1098)
	at hudson.FilePath$FileCallableWrapper.call(FilePath.java:2688)
	at hudson.remoting.UserRequest.perform(UserRequest.java:121)
	at hudson.remoting.UserRequest.perform(UserRequest.java:49)
	at hudson.remoting.Request$2.run(Request.java:326)
	at hudson.remoting.InterceptingExecutorService$1.call(InterceptingExecutorService.java:68)
	at java.util.concurrent.FutureTask.run(FutureTask.java:262)
	at java.util.concurrent.ThreadPoolExecutor.runWorker(ThreadPoolExecutor.java:1145)
	at java.util.concurrent.ThreadPoolExecutor$Worker.run(ThreadPoolExecutor.java:615)
	at java.lang.Thread.run(Thread.java:745)
[WARNINGS] Skipping publisher since build result is FAILURE

Mime
View raw message