maven-notifications mailing list archives

Site index · List index
Message view « Date » · « Thread »
Top « Date » · « Thread »
From Apache Jenkins Server <jenk...@builds.apache.org>
Subject Build failed in Jenkins: core-it-maven-3-win #1010
Date Fri, 16 Oct 2015 17:20:58 GMT
See <https://builds.apache.org/job/core-it-maven-3-win/1010/changes>

Changes:

[Michael Osipov] [MNG-5649] Use Commons Lang's Validate to intercept invalid input

------------------------------------------
[...truncated 10594 lines...]
mng1073AggregatorForksReactor(itForkLifecycle)..............OK (5.2 s)
mng1073AggregatorForksReactor(itForkGoal)...................OK (9.5 s)
mng1052PluginMngtConfig(itMNG1052)..........................OK (4.9 s)
mng1021EqualAttachmentBuildNumber(itMNG1021)................OK (4.1 s)
mng0985NonExecutedPluginMngtGoals(itMNG0985)................OK (3.1 s)
mng0956ComponentInjectionViaProjectLevelPluginDep(itMNG0956)OK (3.4 s)
mng0947OptionalDependency(it)...............................OK (6.7 s)
mng0870ReactorAwarePluginDiscovery(itMNG0870)...............OK (4.8 s)
mng0866EvaluateDefaultValue(itMNG866).......................OK (4.5 s)
mng0848SystemPropOverridesDefaultValue(itMNG848)............OK (3.2 s)
mng0836PluginParentResolution(itMNG836).....................OK (2.8 s)
mng0823MojoContextPassing(itMNG0823)........................OK (2.8 s)
mng0820ConflictResolution(itMNG0820)........................OK (4.3 s)
mng0818WarDepsNotTransitive(itMNG0818)......................OK (4.6 s)
mng0814ExplicitProfileActivation(itMNG814)..................OK (3.9 s)
mng0786ProfileAwareReactor(itMNG0786).......................OK (3.0 s)
mng0781PluginConfigVsExecConfig(itMNG0781)..................OK (2.5 s)
mng0773SettingsProfileReactorPollution(itMNG773)............OK (2.6 s)
mng0768OfflineMode(itMNG768)................................OK (8.7 s)
mng0761MissingSnapshotDistRepo(itMNG761)....................OK (2.8 s)
mng0731LegacyRepoLayout(itMNG731)...........................SKIPPED - Maven version 3.3.7-SNAPSHOT
not in range [2.0,3.0-alpha-3)
mng0680ParentBasedir(itMNG680)..............................OK (2.5 s)
mng0674PluginParameterAlias(itLifecycle)....................OK (2.9 s)
mng0674PluginParameterAlias(itCli)..........................OK (2.9 s)
mng0666IgnoreLegacyPom(itMNG666)............................OK (2.8 s)
mng0557UserSettingsCliOption(itMNG557)......................OK (2.5 s)
mng0553SettingsAuthzEncryption(itRelocation)................OK (3.4 s)
mng0553SettingsAuthzEncryption(itEncryption)................OK (4.9 s)
mng0553SettingsAuthzEncryption(itBasic).....................OK (4.4 s)
mng0522InheritedPluginMgmtConfig(itMNG522)..................OK (3.1 s)
mng0507ArtifactRelocation(itMNG507).........................OK (3.5 s)
mng0505VersionRange(itMNG505)...............................OK (3.6 s)
mng0496IgnoreUnknownPluginParameters(itMNG496)..............OK (2.9 s)
mng0479OverrideCentralRepo(itResolution)....................OK (9.8 s)
mng0479OverrideCentralRepo(itModel).........................OK (4.9 s)
mng0471CustomLifecycle(itMNG471)............................OK (2.4 s)
mng0469ReportConfig(itReportConfigOverridesBuildDefaults)...SKIPPED - Maven version 3.3.7-SNAPSHOT
not in range [2.0.0,3.0-alpha-1)
mng0469ReportConfig(itBuildConfigDominantDuringBuild).......OK (2.4 s)
mng0469ReportConfig(itBuildConfigIrrelevantForReports)......OK (2.6 s)
mng0461TolerateMissingDependencyPom(it).....................OK (2.8 s)
mng0449PluginVersionResolution(itLifecycleInvocation).......OK (2.9 s)
mng0449PluginVersionResolution(itCliInvocation).............OK (2.6 s)
mng0377PluginLookupFromPrefix(itMNG377).....................OK (3.3 s)
mng0294MergeGlobalAndUserSettings(itMNG294).................OK (2.8 s)
mng0282NonReactorExecWhenProjectIndependent(itMNG282).......OK (2.6 s)
mng0249ResolveDepsFromReactor(itMNG0249)....................OK (3.1 s)
mng0187CollectedProjects(it)................................OK (2.8 s)
mng0095ReactorFailureBehavior(itFailFast)...................OK (2.9 s)
mng0095ReactorFailureBehavior(itFailNever)..................OK (2.5 s)
mng0095ReactorFailureBehavior(itFailAtEnd)..................OK (2.6 s)
0145ReactorWithIncludesExcludes(itCustomIncludes)...........SKIPPED - Maven version 3.3.7-SNAPSHOT
not in range [2.0,3.0-alpha-1)
0145ReactorWithIncludesExcludes(itCustomExcludes)...........SKIPPED - Maven version 3.3.7-SNAPSHOT
not in range [2.0,3.0-alpha-1)
0145ReactorWithIncludesExcludes(itDefaultIncludesExcludes)..SKIPPED - Maven version 3.3.7-SNAPSHOT
not in range [2.0,3.0-alpha-1)
0144LifecycleExecutionOrder(it0144).........................OK (3.1 s)
0143TransitiveDependencyScopes(itCompileScope)..............OK (2.8 s)
0143TransitiveDependencyScopes(itProvidedScope).............OK (2.9 s)
0143TransitiveDependencyScopes(itRuntimeScope)..............OK (2.8 s)
0143TransitiveDependencyScopes(itTestScope).................OK (2.8 s)
0142DirectDependencyScopes(it0142)..........................OK (2.8 s)
0140InterpolationWithPomPrefix(it0140)......................OK (2.4 s)
0139InterpolationWithProjectPrefix(it0139)..................OK (2.5 s)
0138PluginLifecycle(it0138).................................OK (3.0 s)
0137EarLifecycle(it0137)....................................OK (3.0 s)
0136RarLifecycle(it0136)....................................OK (3.1 s)
0135EjbLifecycle(it0135)....................................OK (2.9 s)
0134WarLifecycle(it0134)....................................OK (2.9 s)
0133JarLifecycle(it0133)....................................OK (2.9 s)
0132PomLifecycle(it0132)....................................OK (2.6 s)
0131SiteLifecycle(it0131)...................................OK (2.4 s)
0130CleanLifecycle(it0130)..................................OK (2.6 s)
0113ServerAuthzAvailableToWagonMgrInPlugin(it0113)..........OK (2.7 s)
0090EnvVarInterpolation(it0090).............................OK (2.5 s)
0087PluginRealmWithProjectLevelDeps(it0087).................OK (2.8 s)
0086PluginRealm(it0086).....................................OK (2.8 s)
0085TransitiveSystemScope(it0085)...........................OK (3.0 s)
0072InterpolationWithDottedProperty(it0072).................OK (2.6 s)
0071PluginConfigWithDottedProperty(it0071)..................OK (2.8 s)
0064MojoConfigViaSetters(it0064)............................OK (2.5 s)
0063SystemScopeDependency(it0063)...........................OK (2.6 s)
0056MultipleGoalExecutions(it0056)..........................OK (2.4 s)
0052ReleaseProfile(it0052)..................................OK (2.8 s)
0051ReleaseProfile(it0051)..................................OK (3.1 s)
0041ArtifactTypeFromPluginExtension(it0041).................OK (3.6 s)
0040PackagingFromPluginExtension(it0040)....................OK (2.5 s)
0039ReleasePomInReactor(it0039).............................SKIPPED - Maven version 3.3.7-SNAPSHOT
not in range [2.0,3.0-alpha-1)
0038AlternatePomFileDifferentDir(it0038)....................OK (2.4 s)
0037AlternatePomFileSameDir(it0037).........................OK (2.4 s)
0036ReleasePom(it0036)......................................SKIPPED - Maven version 3.3.7-SNAPSHOT
not in range (2.0,3.0-alpha-1)
0032MavenPrerequisite(it0032)...............................OK (2.1 s)
0030DepPomDepMngtInheritance(it0030)........................OK (6.1 s)
0025MultipleExecutionLevelConfigs(it0025)...................OK (2.7 s)
0024MultipleGoalExecutions(it0024)..........................OK (2.9 s)
0023SettingsProfile(it0023).................................OK (3.3 s)
0021PomProfile(it0021)......................................OK (3.1 s)
0019PluginVersionMngtBySuperPom(it0019).....................OK (3.3 s)
0018DependencyManagement(it0018)............................OK (2.8 s)
0012PomInterpolation(it0012)................................OK (2.5 s)
0011DefaultVersionByDependencyManagement(it0011)............OK (2.8 s)
0010DependencyClosureResolution(it0010).....................OK (2.8 s)
0009GoalConfiguration(it0009)...............................OK (2.7 s)
0008SimplePlugin(it0008)....................................OK (2.8 s)
Tests run: 767, Failures: 1, Errors: 0, Skipped: 0, Time elapsed: 2,745.668 sec <<<
FAILURE! - in org.apache.maven.it.IntegrationTestSuite
testitTestPhase(org.apache.maven.it.MavenITmng5214DontMapWsdlToJar)  Time elapsed: 5.389 sec
 <<< FAILURE!
junit.framework.AssertionFailedError: null
	at junit.framework.Assert.fail(Assert.java:47)
	at junit.framework.Assert.assertTrue(Assert.java:20)
	at junit.framework.Assert.assertFalse(Assert.java:34)
	at junit.framework.Assert.assertFalse(Assert.java:41)
	at org.apache.maven.it.MavenITmng5214DontMapWsdlToJar.testitTestPhase(MavenITmng5214DontMapWsdlToJar.java:70)


Results :

Failed tests: 
  MavenITmng5214DontMapWsdlToJar>AbstractMavenIntegrationTestCase.runTest:219->testitTestPhase:70
null

Tests run: 767, Failures: 1, Errors: 0, Skipped: 0

[INFO] ------------------------------------------------------------------------
[INFO] Reactor Summary:
[INFO] 
[INFO] Maven Core ITs .................................... SUCCESS [42.785s]
[INFO] Maven IT Support .................................. SUCCESS [0.961s]
[INFO] Maven IT :: Plugins ............................... SUCCESS [0.741s]
[INFO] Maven IT Plugin :: Active Collection .............. SUCCESS [8.785s]
[INFO] Maven IT Plugin :: Ant-Based ...................... SUCCESS [6.062s]
[INFO] Maven IT Plugin :: Artifact ....................... SUCCESS [2.340s]
[INFO] Maven IT Plugin :: Class Loader :: Dependency A ... SUCCESS [0.801s]
[INFO] Maven IT Plugin :: Class Loader :: Dependency B ... SUCCESS [0.782s]
[INFO] Maven IT Plugin :: Class Loader :: Dependency C ... SUCCESS [0.538s]
[INFO] Maven IT Plugin :: Class Loader ................... SUCCESS [1.926s]
[INFO] Maven IT Plugin :: Class Loader :: Aggregator ..... SUCCESS [0.637s]
[INFO] Maven IT Plugin :: Configuration .................. SUCCESS [1.232s]
[INFO] Maven IT Plugin :: Context Passing ................ SUCCESS [0.671s]
[INFO] Maven ITs :: Core Plugin Stubs .................... SUCCESS [0.522s]
[INFO] Maven IT Clean Plugin Stub ........................ SUCCESS [0.830s]
[INFO] Maven IT Compiler Plugin Stub ..................... SUCCESS [0.973s]
[INFO] Maven IT Deploy Plugin Stub ....................... SUCCESS [0.964s]
[INFO] Maven IT EAR Plugin Stub .......................... SUCCESS [0.763s]
[INFO] Maven IT EJB Plugin Stub .......................... SUCCESS [0.731s]
[INFO] Maven IT Install Plugin Stub ...................... SUCCESS [0.729s]
[INFO] Maven IT JAR Plugin Stub .......................... SUCCESS [0.760s]
[INFO] Maven IT Javadoc Plugin Stub ...................... SUCCESS [0.675s]
[INFO] Maven IT Plugin Plugin Stub ....................... SUCCESS [0.849s]
[INFO] Maven IT RAR Plugin Stub .......................... SUCCESS [0.800s]
[INFO] Maven IT Resources Plugin Stub .................... SUCCESS [0.763s]
[INFO] Maven IT Site Plugin Stub ......................... SUCCESS [0.906s]
[INFO] Maven IT Source Plugin Stub ....................... SUCCESS [0.696s]
[INFO] Maven IT Surefire Plugin Stub ..................... SUCCESS [0.757s]
[INFO] Maven IT WAR Plugin Stub .......................... SUCCESS [0.654s]
[INFO] Maven IT Plugin :: Dependency Collection .......... SUCCESS [0.862s]
[INFO] Maven IT Plugin :: Dependency Resolution .......... SUCCESS [6.845s]
[INFO] Maven IT Plugin :: Expression ..................... SUCCESS [1.134s]
[INFO] Maven IT Plugin :: Error Mojos .................... SUCCESS [2.526s]
[INFO] Maven IT Component ................................ SUCCESS [0.569s]
[INFO] Maven IT Plugin :: Extension Consumer ............. SUCCESS [0.672s]
[INFO] Maven IT Plugin :: Extension Provider ............. SUCCESS [0.557s]
[INFO] Maven IT Plugin :: Fork ........................... SUCCESS [0.721s]
[INFO] Maven IT Plugin :: Invalid Descriptor ............. SUCCESS [0.569s]
[INFO] Maven IT Plugin :: Log File ....................... SUCCESS [0.613s]
[INFO] Maven IT Helper Library ........................... SUCCESS [2.156s]
[INFO] Maven IT Plugin :: Model Interpolation ............ SUCCESS [1.062s]
[INFO] Maven IT Plugin :: No Default Component ........... SUCCESS [0.589s]
[INFO] Maven IT Plugin :: No Project ..................... SUCCESS [0.787s]
[INFO] Maven IT Plugin :: Online ......................... SUCCESS [0.592s]
[INFO] Maven IT Plugin :: Optional Mojos ................. SUCCESS [0.734s]
[INFO] Maven IT Plugin :: Packaging ...................... SUCCESS [0.612s]
[INFO] Maven IT Plugin :: Parameter Implementation ....... SUCCESS [0.588s]
[INFO] Maven IT Plugin :: Plugin Dependency .............. SUCCESS [0.562s]
[INFO] Maven IT Plugin :: Project ........................ SUCCESS [0.773s]
[INFO] Maven IT Plugin :: Project Interpolation .......... SUCCESS [0.762s]
[INFO] Maven IT Plugin :: Setter ......................... SUCCESS [0.726s]
[INFO] Maven IT Plugin :: Singleton Component ............ SUCCESS [0.755s]
[INFO] Maven IT Plugin :: Site ........................... SUCCESS [2.522s]
[INFO] Maven IT Plugin :: Toolchain ...................... SUCCESS [5.052s]
[INFO] Maven IT Plugin :: Touch .......................... SUCCESS [1.047s]
[INFO] Maven IT Plugin :: Uses Properties Plugin ......... SUCCESS [0.587s]
[INFO] Maven IT Plugin :: Uses Wagon Plugin .............. SUCCESS [2.017s]
[INFO] Maven IT Plugin :: This plugin should contain the mojos needed by all tests.  SUCCESS
[0.528s]
[INFO] Maven IT Plugin :: Plexus Utils 1.1 ............... SUCCESS [0.747s]
[INFO] Maven IT Plugin :: Plexus Utils New ............... SUCCESS [0.844s]
[INFO] Maven IT Plugin :: Plexus Component API ........... SUCCESS [1.479s]
[INFO] Maven IT Plugin :: Log4J Client ................... SUCCESS [0.936s]
[INFO] Maven IT Plugin :: Extension 1 .................... SUCCESS [0.554s]
[INFO] Maven IT Plugin :: Extension 2 .................... SUCCESS [0.496s]
[INFO] Maven IT Plugin :: Plexus Lifecycle ............... SUCCESS [1.642s]
[INFO] Maven IT Plugin :: Settings ....................... SUCCESS [0.695s]
[INFO] Maven IT Plugin :: mng-5805 extension ............. SUCCESS [0.511s]
[INFO] Maven IT Plugin :: mng-5805 plugin ................ SUCCESS [0.759s]
[INFO] Maven IT Plugin :: mng-5805 plugin-dep ............ SUCCESS [0.634s]
[INFO] Maven IT Toolchain ................................ SUCCESS [0.877s]
[INFO] Maven IT Wagon .................................... SUCCESS [0.948s]
[INFO] Maven IT Support Artifacts ........................ SUCCESS [2.052s]
[INFO] Maven IT Extension ................................ SUCCESS [0.501s]
[INFO] Maven ITs ......................................... FAILURE [46:18.080s]
[INFO] ------------------------------------------------------------------------
[INFO] BUILD FAILURE
[INFO] ------------------------------------------------------------------------
[INFO] Total time: 48:32.880s
[INFO] Finished at: Fri Oct 16 18:21:43 BST 2015
[INFO] Final Memory: 45M/766M
[INFO] ------------------------------------------------------------------------
[ERROR] Failed to execute goal org.apache.maven.plugins:maven-surefire-plugin:2.17:test (default-test)
on project core-it-suite: There are test failures.
[ERROR] 
[ERROR] Please refer to F:\ws\m3-its\core-integration-testing-trunk\core-it-suite\target\surefire-reports
for the individual test results.
[ERROR] -> [Help 1]
org.apache.maven.lifecycle.LifecycleExecutionException: Failed to execute goal org.apache.maven.plugins:maven-surefire-plugin:2.17:test
(default-test) on project core-it-suite: There are test failures.

Please refer to F:\ws\m3-its\core-integration-testing-trunk\core-it-suite\target\surefire-reports
for the individual test results.
	at org.apache.maven.lifecycle.internal.MojoExecutor.execute(MojoExecutor.java:213)
	at org.apache.maven.lifecycle.internal.MojoExecutor.execute(MojoExecutor.java:153)
	at org.apache.maven.lifecycle.internal.MojoExecutor.execute(MojoExecutor.java:145)
	at org.apache.maven.lifecycle.internal.LifecycleModuleBuilder.buildProject(LifecycleModuleBuilder.java:84)
	at org.apache.maven.lifecycle.internal.LifecycleModuleBuilder.buildProject(LifecycleModuleBuilder.java:59)
	at org.apache.maven.lifecycle.internal.LifecycleStarter.singleThreadedBuild(LifecycleStarter.java:183)
	at org.apache.maven.lifecycle.internal.LifecycleStarter.execute(LifecycleStarter.java:161)
	at org.apache.maven.DefaultMaven.doExecute(DefaultMaven.java:320)
	at org.apache.maven.DefaultMaven.execute(DefaultMaven.java:156)
	at org.apache.maven.cli.MavenCli.execute(MavenCli.java:537)
	at org.apache.maven.cli.MavenCli.doMain(MavenCli.java:196)
	at org.apache.maven.cli.MavenCli.main(MavenCli.java:141)
	at sun.reflect.NativeMethodAccessorImpl.invoke0(Native Method)
	at sun.reflect.NativeMethodAccessorImpl.invoke(NativeMethodAccessorImpl.java:57)
	at sun.reflect.DelegatingMethodAccessorImpl.invoke(DelegatingMethodAccessorImpl.java:43)
	at java.lang.reflect.Method.invoke(Method.java:601)
	at org.codehaus.plexus.classworlds.launcher.Launcher.launchEnhanced(Launcher.java:290)
	at org.codehaus.plexus.classworlds.launcher.Launcher.launch(Launcher.java:230)
	at org.codehaus.plexus.classworlds.launcher.Launcher.mainWithExitCode(Launcher.java:409)
	at org.codehaus.plexus.classworlds.launcher.Launcher.main(Launcher.java:352)
Caused by: org.apache.maven.plugin.MojoFailureException: There are test failures.

Please refer to F:\ws\m3-its\core-integration-testing-trunk\core-it-suite\target\surefire-reports
for the individual test results.
	at org.apache.maven.plugin.surefire.SurefireHelper.reportExecution(SurefireHelper.java:82)
	at org.apache.maven.plugin.surefire.SurefirePlugin.handleSummary(SurefirePlugin.java:195)
	at org.apache.maven.plugin.surefire.AbstractSurefireMojo.executeAfterPreconditionsChecked(AbstractSurefireMojo.java:861)
	at org.apache.maven.plugin.surefire.AbstractSurefireMojo.execute(AbstractSurefireMojo.java:729)
	at org.apache.maven.plugin.DefaultBuildPluginManager.executeMojo(DefaultBuildPluginManager.java:101)
	at org.apache.maven.lifecycle.internal.MojoExecutor.execute(MojoExecutor.java:209)
	... 19 more
[ERROR] 
[ERROR] Re-run Maven using the -X switch to enable full debug logging.
[ERROR] 
[ERROR] For more information about the errors and possible solutions, please read the following
articles:
[ERROR] [Help 1] http://cwiki.apache.org/confluence/display/MAVEN/MojoFailureException
[ERROR] 
[ERROR] After correcting the problems, you can resume the build with the command
[ERROR]   mvn <goals> -rf :core-it-suite
Build step 'Invoke top-level Maven targets' marked build as failure
Recording test results

Mime
View raw message