maven-notifications mailing list archives

Site index · List index
Message view « Date » · « Thread »
Top « Date » · « Thread »
From Apache Jenkins Server <jenk...@builds.apache.org>
Subject Build failed in Jenkins: maven-plugins-ITs-m3.0.4 #1310
Date Fri, 25 Sep 2015 07:08:55 GMT
See <https://builds.apache.org/job/maven-plugins-ITs-m3.0.4/1310/changes>

Changes:

[dennisl] Ignore IDEA-directory.

[dennisl] [MCHANGELOG-79] Add support for "tag" type report of Subversion.
Submitted by: Jerome Lacoste and Samuel Van Reeth
Reviewed by: Dennis Lundberg

After removing all the whitespace changed I applied the patch from Samuel, which was based
in part on the one from Jerome. I also added some error handling in case you configure a non-existing
tag.

------------------------------------------
[...truncated 24260 lines...]
[ERROR] -deprecation               Output source locations where deprecated APIs are used
[ERROR] -classpath <path>          Specify where to find user class files
[ERROR] -cp <path>                 Specify where to find user class files
[ERROR] -sourcepath <path>         Specify where to find input source files
[ERROR] -bootclasspath <path>      Override location of bootstrap class files
[ERROR] -extdirs <dirs>            Override location of installed extensions
[ERROR] -endorseddirs <dirs>       Override location of endorsed standards path
[ERROR] -d <directory>             Specify where to place generated class files
[ERROR] -encoding <encoding>       Specify character encoding used by source files
[ERROR] -source <release>          Provide source compatibility with specified release
[ERROR] -target <release>          Generate class files for specific VM version
[ERROR] -version                   Version information
[ERROR] -help                      Print a synopsis of standard options
[ERROR] -X                         Print a synopsis of nonstandard options
[ERROR] -J<flag>                   Pass <flag> directly to the runtime system
[ERROR] -> [Help 1]
[ERROR] Failed to execute goal org.apache.maven.plugins:maven-compiler-plugin:3.2:compile
(default-compile) on project maven-repository-plugin: Compilation failure
[ERROR] javac: invalid flag: -s
[ERROR] Usage: javac <options> <source files>
[ERROR] where possible options include:
[ERROR] -g                         Generate all debugging info
[ERROR] -g:none                    Generate no debugging info
[ERROR] -g:{lines,vars,source}     Generate only some debugging info
[ERROR] -nowarn                    Generate no warnings
[ERROR] -verbose                   Output messages about what the compiler is doing
[ERROR] -deprecation               Output source locations where deprecated APIs are used
[ERROR] -classpath <path>          Specify where to find user class files
[ERROR] -cp <path>                 Specify where to find user class files
[ERROR] -sourcepath <path>         Specify where to find input source files
[ERROR] -bootclasspath <path>      Override location of bootstrap class files
[ERROR] -extdirs <dirs>            Override location of installed extensions
[ERROR] -endorseddirs <dirs>       Override location of endorsed standards path
[ERROR] -d <directory>             Specify where to place generated class files
[ERROR] -encoding <encoding>       Specify character encoding used by source files
[ERROR] -source <release>          Provide source compatibility with specified release
[ERROR] -target <release>          Generate class files for specific VM version
[ERROR] -version                   Version information
[ERROR] -help                      Print a synopsis of standard options
[ERROR] -X                         Print a synopsis of nonstandard options
[ERROR] -J<flag>                   Pass <flag> directly to the runtime system
[ERROR] -> [Help 1]
[ERROR] Failed to execute goal org.apache.maven.plugins:maven-compiler-plugin:3.2:compile
(default-compile) on project maven-resources-plugin: Compilation failure
[ERROR] javac: invalid flag: -s
[ERROR] Usage: javac <options> <source files>
[ERROR] where possible options include:
[ERROR] -g                         Generate all debugging info
[ERROR] -g:none                    Generate no debugging info
[ERROR] -g:{lines,vars,source}     Generate only some debugging info
[ERROR] -nowarn                    Generate no warnings
[ERROR] -verbose                   Output messages about what the compiler is doing
[ERROR] -deprecation               Output source locations where deprecated APIs are used
[ERROR] -classpath <path>          Specify where to find user class files
[ERROR] -cp <path>                 Specify where to find user class files
[ERROR] -sourcepath <path>         Specify where to find input source files
[ERROR] -bootclasspath <path>      Override location of bootstrap class files
[ERROR] -extdirs <dirs>            Override location of installed extensions
[ERROR] -endorseddirs <dirs>       Override location of endorsed standards path
[ERROR] -d <directory>             Specify where to place generated class files
[ERROR] -encoding <encoding>       Specify character encoding used by source files
[ERROR] -source <release>          Provide source compatibility with specified release
[ERROR] -target <release>          Generate class files for specific VM version
[ERROR] -version                   Version information
[ERROR] -help                      Print a synopsis of standard options
[ERROR] -X                         Print a synopsis of nonstandard options
[ERROR] -J<flag>                   Pass <flag> directly to the runtime system
[ERROR] -> [Help 1]
[ERROR] Failed to execute goal org.apache.maven.plugins:maven-compiler-plugin:3.2:compile
(default-compile) on project maven-site-plugin: Compilation failure
[ERROR] javac: invalid flag: -s
[ERROR] Usage: javac <options> <source files>
[ERROR] where possible options include:
[ERROR] -g                         Generate all debugging info
[ERROR] -g:none                    Generate no debugging info
[ERROR] -g:{lines,vars,source}     Generate only some debugging info
[ERROR] -nowarn                    Generate no warnings
[ERROR] -verbose                   Output messages about what the compiler is doing
[ERROR] -deprecation               Output source locations where deprecated APIs are used
[ERROR] -classpath <path>          Specify where to find user class files
[ERROR] -cp <path>                 Specify where to find user class files
[ERROR] -sourcepath <path>         Specify where to find input source files
[ERROR] -bootclasspath <path>      Override location of bootstrap class files
[ERROR] -extdirs <dirs>            Override location of installed extensions
[ERROR] -endorseddirs <dirs>       Override location of endorsed standards path
[ERROR] -d <directory>             Specify where to place generated class files
[ERROR] -encoding <encoding>       Specify character encoding used by source files
[ERROR] -source <release>          Provide source compatibility with specified release
[ERROR] -target <release>          Generate class files for specific VM version
[ERROR] -version                   Version information
[ERROR] -help                      Print a synopsis of standard options
[ERROR] -X                         Print a synopsis of nonstandard options
[ERROR] -J<flag>                   Pass <flag> directly to the runtime system
[ERROR] -> [Help 1]
[ERROR] Failed to execute goal org.apache.maven.plugins:maven-compiler-plugin:3.2:compile
(default-compile) on project maven-source-plugin: Compilation failure
[ERROR] javac: invalid flag: -s
[ERROR] Usage: javac <options> <source files>
[ERROR] where possible options include:
[ERROR] -g                         Generate all debugging info
[ERROR] -g:none                    Generate no debugging info
[ERROR] -g:{lines,vars,source}     Generate only some debugging info
[ERROR] -nowarn                    Generate no warnings
[ERROR] -verbose                   Output messages about what the compiler is doing
[ERROR] -deprecation               Output source locations where deprecated APIs are used
[ERROR] -classpath <path>          Specify where to find user class files
[ERROR] -cp <path>                 Specify where to find user class files
[ERROR] -sourcepath <path>         Specify where to find input source files
[ERROR] -bootclasspath <path>      Override location of bootstrap class files
[ERROR] -extdirs <dirs>            Override location of installed extensions
[ERROR] -endorseddirs <dirs>       Override location of endorsed standards path
[ERROR] -d <directory>             Specify where to place generated class files
[ERROR] -encoding <encoding>       Specify character encoding used by source files
[ERROR] -source <release>          Provide source compatibility with specified release
[ERROR] -target <release>          Generate class files for specific VM version
[ERROR] -version                   Version information
[ERROR] -help                      Print a synopsis of standard options
[ERROR] -X                         Print a synopsis of nonstandard options
[ERROR] -J<flag>                   Pass <flag> directly to the runtime system
[ERROR] -> [Help 1]
[ERROR] Failed to execute goal org.apache.maven.plugins:maven-compiler-plugin:3.2:compile
(default-compile) on project maven-stage-plugin: Compilation failure
[ERROR] javac: invalid flag: -s
[ERROR] Usage: javac <options> <source files>
[ERROR] where possible options include:
[ERROR] -g                         Generate all debugging info
[ERROR] -g:none                    Generate no debugging info
[ERROR] -g:{lines,vars,source}     Generate only some debugging info
[ERROR] -nowarn                    Generate no warnings
[ERROR] -verbose                   Output messages about what the compiler is doing
[ERROR] -deprecation               Output source locations where deprecated APIs are used
[ERROR] -classpath <path>          Specify where to find user class files
[ERROR] -cp <path>                 Specify where to find user class files
[ERROR] -sourcepath <path>         Specify where to find input source files
[ERROR] -bootclasspath <path>      Override location of bootstrap class files
[ERROR] -extdirs <dirs>            Override location of installed extensions
[ERROR] -endorseddirs <dirs>       Override location of endorsed standards path
[ERROR] -d <directory>             Specify where to place generated class files
[ERROR] -encoding <encoding>       Specify character encoding used by source files
[ERROR] -source <release>          Provide source compatibility with specified release
[ERROR] -target <release>          Generate class files for specific VM version
[ERROR] -version                   Version information
[ERROR] -help                      Print a synopsis of standard options
[ERROR] -X                         Print a synopsis of nonstandard options
[ERROR] -J<flag>                   Pass <flag> directly to the runtime system
[ERROR] -> [Help 1]
[ERROR] Failed to execute goal org.apache.maven.plugins:maven-compiler-plugin:3.2:compile
(default-compile) on project maven-toolchains-plugin: Compilation failure
[ERROR] javac: invalid flag: -s
[ERROR] Usage: javac <options> <source files>
[ERROR] where possible options include:
[ERROR] -g                         Generate all debugging info
[ERROR] -g:none                    Generate no debugging info
[ERROR] -g:{lines,vars,source}     Generate only some debugging info
[ERROR] -nowarn                    Generate no warnings
[ERROR] -verbose                   Output messages about what the compiler is doing
[ERROR] -deprecation               Output source locations where deprecated APIs are used
[ERROR] -classpath <path>          Specify where to find user class files
[ERROR] -cp <path>                 Specify where to find user class files
[ERROR] -sourcepath <path>         Specify where to find input source files
[ERROR] -bootclasspath <path>      Override location of bootstrap class files
[ERROR] -extdirs <dirs>            Override location of installed extensions
[ERROR] -endorseddirs <dirs>       Override location of endorsed standards path
[ERROR] -d <directory>             Specify where to place generated class files
[ERROR] -encoding <encoding>       Specify character encoding used by source files
[ERROR] -source <release>          Provide source compatibility with specified release
[ERROR] -target <release>          Generate class files for specific VM version
[ERROR] -version                   Version information
[ERROR] -help                      Print a synopsis of standard options
[ERROR] -X                         Print a synopsis of nonstandard options
[ERROR] -J<flag>                   Pass <flag> directly to the runtime system
[ERROR] -> [Help 1]
[ERROR] Failed to execute goal org.apache.maven.plugins:maven-compiler-plugin:3.2:compile
(default-compile) on project maven-verifier-plugin: Compilation failure
[ERROR] javac: invalid flag: -s
[ERROR] Usage: javac <options> <source files>
[ERROR] where possible options include:
[ERROR] -g                         Generate all debugging info
[ERROR] -g:none                    Generate no debugging info
[ERROR] -g:{lines,vars,source}     Generate only some debugging info
[ERROR] -nowarn                    Generate no warnings
[ERROR] -verbose                   Output messages about what the compiler is doing
[ERROR] -deprecation               Output source locations where deprecated APIs are used
[ERROR] -classpath <path>          Specify where to find user class files
[ERROR] -cp <path>                 Specify where to find user class files
[ERROR] -sourcepath <path>         Specify where to find input source files
[ERROR] -bootclasspath <path>      Override location of bootstrap class files
[ERROR] -extdirs <dirs>            Override location of installed extensions
[ERROR] -endorseddirs <dirs>       Override location of endorsed standards path
[ERROR] -d <directory>             Specify where to place generated class files
[ERROR] -encoding <encoding>       Specify character encoding used by source files
[ERROR] -source <release>          Provide source compatibility with specified release
[ERROR] -target <release>          Generate class files for specific VM version
[ERROR] -version                   Version information
[ERROR] -help                      Print a synopsis of standard options
[ERROR] -X                         Print a synopsis of nonstandard options
[ERROR] -J<flag>                   Pass <flag> directly to the runtime system
[ERROR] -> [Help 1]
[ERROR] Failed to execute goal org.apache.maven.plugins:maven-compiler-plugin:3.2:compile
(default-compile) on project maven-war-plugin: Compilation failure
[ERROR] javac: invalid flag: -s
[ERROR] Usage: javac <options> <source files>
[ERROR] where possible options include:
[ERROR] -g                         Generate all debugging info
[ERROR] -g:none                    Generate no debugging info
[ERROR] -g:{lines,vars,source}     Generate only some debugging info
[ERROR] -nowarn                    Generate no warnings
[ERROR] -verbose                   Output messages about what the compiler is doing
[ERROR] -deprecation               Output source locations where deprecated APIs are used
[ERROR] -classpath <path>          Specify where to find user class files
[ERROR] -cp <path>                 Specify where to find user class files
[ERROR] -sourcepath <path>         Specify where to find input source files
[ERROR] -bootclasspath <path>      Override location of bootstrap class files
[ERROR] -extdirs <dirs>            Override location of installed extensions
[ERROR] -endorseddirs <dirs>       Override location of endorsed standards path
[ERROR] -d <directory>             Specify where to place generated class files
[ERROR] -encoding <encoding>       Specify character encoding used by source files
[ERROR] -source <release>          Provide source compatibility with specified release
[ERROR] -target <release>          Generate class files for specific VM version
[ERROR] -version                   Version information
[ERROR] -help                      Print a synopsis of standard options
[ERROR] -X                         Print a synopsis of nonstandard options
[ERROR] -J<flag>                   Pass <flag> directly to the runtime system
[ERROR] -> [Help 1]
[ERROR] Failed to execute goal org.apache.maven.plugins:maven-compiler-plugin:3.2:compile
(default-compile) on project maven-gpg-plugin: Compilation failure
[ERROR] javac: invalid flag: -s
[ERROR] Usage: javac <options> <source files>
[ERROR] where possible options include:
[ERROR] -g                         Generate all debugging info
[ERROR] -g:none                    Generate no debugging info
[ERROR] -g:{lines,vars,source}     Generate only some debugging info
[ERROR] -nowarn                    Generate no warnings
[ERROR] -verbose                   Output messages about what the compiler is doing
[ERROR] -deprecation               Output source locations where deprecated APIs are used
[ERROR] -classpath <path>          Specify where to find user class files
[ERROR] -cp <path>                 Specify where to find user class files
[ERROR] -sourcepath <path>         Specify where to find input source files
[ERROR] -bootclasspath <path>      Override location of bootstrap class files
[ERROR] -extdirs <dirs>            Override location of installed extensions
[ERROR] -endorseddirs <dirs>       Override location of endorsed standards path
[ERROR] -d <directory>             Specify where to place generated class files
[ERROR] -encoding <encoding>       Specify character encoding used by source files
[ERROR] -source <release>          Provide source compatibility with specified release
[ERROR] -target <release>          Generate class files for specific VM version
[ERROR] -version                   Version information
[ERROR] -help                      Print a synopsis of standard options
[ERROR] -X                         Print a synopsis of nonstandard options
[ERROR] -J<flag>                   Pass <flag> directly to the runtime system
[ERROR] -> [Help 1]
[ERROR] 
[ERROR] To see the full stack trace of the errors, re-run Maven with the -e switch.
[ERROR] Re-run Maven using the -X switch to enable full debug logging.
[ERROR] 
[ERROR] For more information about the errors and possible solutions, please read the following
articles:
[ERROR] [Help 1] http://cwiki.apache.org/confluence/display/MAVEN/MojoFailureException
Build step 'Invoke top-level Maven targets' marked build as failure
Recording test results

Mime
View raw message