maven-notifications mailing list archives

Site index · List index
Message view « Date » · « Thread »
Top « Date » · « Thread »
From Apache Jenkins Server <jenk...@builds.apache.org>
Subject Build failed in Jenkins: core-it-maven-3-win #961
Date Wed, 22 Jul 2015 01:22:42 GMT
See <https://builds.apache.org/job/core-it-maven-3-win/961/changes>

Changes:

[ifedorenko] MNG-2199 local parent pom matches parent version range

------------------------------------------
[...truncated 10606 lines...]
0132PomLifecycle(it0132)....................................OK (2.7 s)
0131SiteLifecycle(it0131)...................................OK (2.7 s)
0130CleanLifecycle(it0130)..................................OK (2.6 s)
0113ServerAuthzAvailableToWagonMgrInPlugin(it0113)..........OK (2.9 s)
0090EnvVarInterpolation(it0090).............................OK (2.6 s)
0087PluginRealmWithProjectLevelDeps(it0087).................OK (2.7 s)
0086PluginRealm(it0086).....................................OK (2.7 s)
0085TransitiveSystemScope(it0085)...........................OK (2.9 s)
0072InterpolationWithDottedProperty(it0072).................OK (2.5 s)
0071PluginConfigWithDottedProperty(it0071)..................OK (3.5 s)
0064MojoConfigViaSetters(it0064)............................OK (2.8 s)
0063SystemScopeDependency(it0063)...........................OK (3.2 s)
0056MultipleGoalExecutions(it0056)..........................OK (2.5 s)
0052ReleaseProfile(it0052)..................................OK (3.0 s)
0051ReleaseProfile(it0051)..................................OK (3.2 s)
0041ArtifactTypeFromPluginExtension(it0041).................OK (3.6 s)
0040PackagingFromPluginExtension(it0040)....................OK (3.0 s)
0039ReleasePomInReactor(it0039).............................SKIPPED - Maven version 3.3.6-SNAPSHOT
not in range [2.0,3.0-alpha-1)
0038AlternatePomFileDifferentDir(it0038)....................OK (2.6 s)
0037AlternatePomFileSameDir(it0037).........................OK (2.5 s)
0036ReleasePom(it0036)......................................SKIPPED - Maven version 3.3.6-SNAPSHOT
not in range (2.0,3.0-alpha-1)
0032MavenPrerequisite(it0032)...............................OK (2.4 s)
0030DepPomDepMngtInheritance(it0030)........................OK (7.0 s)
0025MultipleExecutionLevelConfigs(it0025)...................OK (2.8 s)
0024MultipleGoalExecutions(it0024)..........................OK (2.8 s)
0023SettingsProfile(it0023).................................OK (2.7 s)
0021PomProfile(it0021)......................................OK (2.9 s)
0019PluginVersionMngtBySuperPom(it0019).....................OK (3.1 s)
0018DependencyManagement(it0018)............................OK (3.0 s)
0012PomInterpolation(it0012)................................OK (2.7 s)
0011DefaultVersionByDependencyManagement(it0011)............OK (2.9 s)
0010DependencyClosureResolution(it0010).....................OK (2.9 s)
0009GoalConfiguration(it0009)...............................OK (3.1 s)
0008SimplePlugin(it0008)....................................OK (2.9 s)
Tests run: 767, Failures: 0, Errors: 1, Skipped: 0, Time elapsed: 2,797.29 sec <<<
FAILURE! - in org.apache.maven.it.IntegrationTestSuite
testValidLocalParentVersionRange(org.apache.maven.it.MavenITmng2199ParentVersionRangeTest)
 Time elapsed: 3.375 sec  <<< ERROR!
org.apache.maven.it.VerificationException: Exit code was non-zero: 1; command line and log
= 
<https://builds.apache.org/job/core-it-maven-3-win/ws/apache-maven-3-SNAPSHOT\bin\mvn>
--global-settings F:\ws\m3-its\core-integration-testing-trunk\core-it-suite\target\test-classes\settings-remote.xml
-U -e --batch-mode -Dmaven.repo.local=<https://builds.apache.org/job/core-it-maven-3-win/ws/it-local-repo>
verify
[INFO] Error stacktraces are turned on.
[INFO] Scanning for projects...
[INFO] Downloading: http://repo1.maven.org/maven2/org/apache/maven/its/mng2199/local-parent/maven-metadata.xml
[ERROR] [ERROR] Some problems were encountered while processing the POMs:
[FATAL] Non-resolvable parent POM org.apache.maven.its.mng2199:local-parent:[1.0,2) for org.apache.maven.its.mng2199:local-parent-module:[unknown-version]:
No versions matched the requested range '[1.0,2)' and 'parent.relativePath' points at wrong
local POM @ line 5, column 11
 @ 
[ERROR] The build could not read 1 project -> [Help 1]
org.apache.maven.project.ProjectBuildingException: Some problems were encountered while processing
the POMs:
[FATAL] Non-resolvable parent POM org.apache.maven.its.mng2199:local-parent:[1.0,2) for org.apache.maven.its.mng2199:local-parent-module:[unknown-version]:
No versions matched the requested range '[1.0,2)' and 'parent.relativePath' points at wrong
local POM @ line 5, column 11

	at org.apache.maven.project.DefaultProjectBuilder.build(DefaultProjectBuilder.java:422)
	at org.apache.maven.graph.DefaultGraphBuilder.collectProjects(DefaultGraphBuilder.java:419)
	at org.apache.maven.graph.DefaultGraphBuilder.getProjectsForMavenReactor(DefaultGraphBuilder.java:410)
	at org.apache.maven.graph.DefaultGraphBuilder.build(DefaultGraphBuilder.java:83)
	at org.apache.maven.DefaultMaven.buildGraph(DefaultMaven.java:491)
	at org.apache.maven.DefaultMaven.doExecute(DefaultMaven.java:219)
	at org.apache.maven.DefaultMaven.doExecute(DefaultMaven.java:193)
	at org.apache.maven.DefaultMaven.execute(DefaultMaven.java:106)
	at org.apache.maven.cli.MavenCli.execute(MavenCli.java:861)
	at org.apache.maven.cli.MavenCli.doMain(MavenCli.java:286)
	at org.apache.maven.cli.MavenCli.main(MavenCli.java:197)
	at sun.reflect.NativeMethodAccessorImpl.invoke0(Native Method)
	at sun.reflect.NativeMethodAccessorImpl.invoke(NativeMethodAccessorImpl.java:57)
	at sun.reflect.DelegatingMethodAccessorImpl.invoke(DelegatingMethodAccessorImpl.java:43)
	at java.lang.reflect.Method.invoke(Method.java:601)
	at org.codehaus.plexus.classworlds.launcher.Launcher.launchEnhanced(Launcher.java:289)
	at org.codehaus.plexus.classworlds.launcher.Launcher.launch(Launcher.java:229)
	at org.codehaus.plexus.classworlds.launcher.Launcher.mainWithExitCode(Launcher.java:415)
	at org.codehaus.plexus.classworlds.launcher.Launcher.main(Launcher.java:356)
[ERROR]   
[ERROR]   The project org.apache.maven.its.mng2199:local-parent-module:[unknown-version] (F:\ws\m3-its\core-integration-testing-trunk\core-it-suite\target\test-classes\mng-2199-parent-version-range\local-parent\module\pom.xml)
has 1 error
[ERROR]     Non-resolvable parent POM org.apache.maven.its.mng2199:local-parent:[1.0,2) for
org.apache.maven.its.mng2199:local-parent-module:[unknown-version]: No versions matched the
requested range '[1.0,2)' and 'parent.relativePath' points at wrong local POM @ line 5, column
11 -> [Help 2]
org.apache.maven.model.resolution.UnresolvableModelException: No versions matched the requested
range '[1.0,2)'
	at org.apache.maven.project.ProjectModelResolver.resolveModel(ProjectModelResolver.java:221)
	at org.apache.maven.model.building.DefaultModelBuilder.readParentExternally(DefaultModelBuilder.java:983)
	at org.apache.maven.model.building.DefaultModelBuilder.readParent(DefaultModelBuilder.java:796)
	at org.apache.maven.model.building.DefaultModelBuilder.build(DefaultModelBuilder.java:325)
	at org.apache.maven.project.DefaultProjectBuilder.build(DefaultProjectBuilder.java:469)
	at org.apache.maven.project.DefaultProjectBuilder.build(DefaultProjectBuilder.java:438)
	at org.apache.maven.project.DefaultProjectBuilder.build(DefaultProjectBuilder.java:555)
	at org.apache.maven.project.DefaultProjectBuilder.build(DefaultProjectBuilder.java:438)
	at org.apache.maven.project.DefaultProjectBuilder.build(DefaultProjectBuilder.java:401)
	at org.apache.maven.graph.DefaultGraphBuilder.collectProjects(DefaultGraphBuilder.java:419)
	at org.apache.maven.graph.DefaultGraphBuilder.getProjectsForMavenReactor(DefaultGraphBuilder.java:410)
	at org.apache.maven.graph.DefaultGraphBuilder.build(DefaultGraphBuilder.java:83)
	at org.apache.maven.DefaultMaven.buildGraph(DefaultMaven.java:491)
	at org.apache.maven.DefaultMaven.doExecute(DefaultMaven.java:219)
	at org.apache.maven.DefaultMaven.doExecute(DefaultMaven.java:193)
	at org.apache.maven.DefaultMaven.execute(DefaultMaven.java:106)
	at org.apache.maven.cli.MavenCli.execute(MavenCli.java:861)
	at org.apache.maven.cli.MavenCli.doMain(MavenCli.java:286)
	at org.apache.maven.cli.MavenCli.main(MavenCli.java:197)
	at sun.reflect.NativeMethodAccessorImpl.invoke0(Native Method)
	at sun.reflect.NativeMethodAccessorImpl.invoke(NativeMethodAccessorImpl.java:57)
	at sun.reflect.DelegatingMethodAccessorImpl.invoke(DelegatingMethodAccessorImpl.java:43)
	at java.lang.reflect.Method.invoke(Method.java:601)
	at org.codehaus.plexus.classworlds.launcher.Launcher.launchEnhanced(Launcher.java:289)
	at org.codehaus.plexus.classworlds.launcher.Launcher.launch(Launcher.java:229)
	at org.codehaus.plexus.classworlds.launcher.Launcher.mainWithExitCode(Launcher.java:415)
	at org.codehaus.plexus.classworlds.launcher.Launcher.main(Launcher.java:356)
[ERROR] 
[ERROR] Re-run Maven using the -X switch to enable full debug logging.
[ERROR] 
[ERROR] For more information about the errors and possible solutions, please read the following
articles:
[ERROR] [Help 1] http://cwiki.apache.org/confluence/display/MAVEN/ProjectBuildingException
[ERROR] [Help 2] http://cwiki.apache.org/confluence/display/MAVEN/UnresolvableModelException

	at org.apache.maven.it.Verifier.executeGoals(Verifier.java:1369)
	at org.apache.maven.it.Verifier.executeGoal(Verifier.java:1254)
	at org.apache.maven.it.Verifier.executeGoal(Verifier.java:1248)
	at org.apache.maven.it.MavenITmng2199ParentVersionRangeTest.testValidLocalParentVersionRange(MavenITmng2199ParentVersionRangeTest.java:172)


Results :

Tests in error: 
  MavenITmng2199ParentVersionRangeTest>AbstractMavenIntegrationTestCase.runTest:219->testValidLocalParentVersionRange:172
ยป Verification

Tests run: 767, Failures: 0, Errors: 1, Skipped: 0

[INFO] ------------------------------------------------------------------------
[INFO] Reactor Summary:
[INFO] 
[INFO] Maven Core ITs .................................... SUCCESS [1:07.375s]
[INFO] Maven IT Support .................................. SUCCESS [1.634s]
[INFO] Maven IT :: Plugins ............................... SUCCESS [0.796s]
[INFO] Maven IT Plugin :: Active Collection .............. SUCCESS [13.780s]
[INFO] Maven IT Plugin :: Ant-Based ...................... SUCCESS [6.344s]
[INFO] Maven IT Plugin :: Artifact ....................... SUCCESS [3.480s]
[INFO] Maven IT Plugin :: Class Loader :: Dependency A ... SUCCESS [0.848s]
[INFO] Maven IT Plugin :: Class Loader :: Dependency B ... SUCCESS [0.820s]
[INFO] Maven IT Plugin :: Class Loader :: Dependency C ... SUCCESS [0.519s]
[INFO] Maven IT Plugin :: Class Loader ................... SUCCESS [2.899s]
[INFO] Maven IT Plugin :: Class Loader :: Aggregator ..... SUCCESS [0.399s]
[INFO] Maven IT Plugin :: Configuration .................. SUCCESS [1.416s]
[INFO] Maven IT Plugin :: Context Passing ................ SUCCESS [0.579s]
[INFO] Maven ITs :: Core Plugin Stubs .................... SUCCESS [0.481s]
[INFO] Maven IT Clean Plugin Stub ........................ SUCCESS [0.777s]
[INFO] Maven IT Compiler Plugin Stub ..................... SUCCESS [1.410s]
[INFO] Maven IT Deploy Plugin Stub ....................... SUCCESS [1.218s]
[INFO] Maven IT EAR Plugin Stub .......................... SUCCESS [0.744s]
[INFO] Maven IT EJB Plugin Stub .......................... SUCCESS [0.708s]
[INFO] Maven IT Install Plugin Stub ...................... SUCCESS [0.690s]
[INFO] Maven IT JAR Plugin Stub .......................... SUCCESS [0.760s]
[INFO] Maven IT Javadoc Plugin Stub ...................... SUCCESS [0.666s]
[INFO] Maven IT Plugin Plugin Stub ....................... SUCCESS [0.717s]
[INFO] Maven IT RAR Plugin Stub .......................... SUCCESS [0.689s]
[INFO] Maven IT Resources Plugin Stub .................... SUCCESS [0.729s]
[INFO] Maven IT Site Plugin Stub ......................... SUCCESS [0.948s]
[INFO] Maven IT Source Plugin Stub ....................... SUCCESS [0.687s]
[INFO] Maven IT Surefire Plugin Stub ..................... SUCCESS [0.733s]
[INFO] Maven IT WAR Plugin Stub .......................... SUCCESS [0.651s]
[INFO] Maven IT Plugin :: Dependency Collection .......... SUCCESS [1.406s]
[INFO] Maven IT Plugin :: Dependency Resolution .......... SUCCESS [9.310s]
[INFO] Maven IT Plugin :: Expression ..................... SUCCESS [1.231s]
[INFO] Maven IT Plugin :: Error Mojos .................... SUCCESS [3.046s]
[INFO] Maven IT Component ................................ SUCCESS [0.481s]
[INFO] Maven IT Plugin :: Extension Consumer ............. SUCCESS [0.787s]
[INFO] Maven IT Plugin :: Extension Provider ............. SUCCESS [0.650s]
[INFO] Maven IT Plugin :: Fork ........................... SUCCESS [0.648s]
[INFO] Maven IT Plugin :: Invalid Descriptor ............. SUCCESS [0.758s]
[INFO] Maven IT Plugin :: Log File ....................... SUCCESS [0.874s]
[INFO] Maven IT Helper Library ........................... SUCCESS [2.896s]
[INFO] Maven IT Plugin :: Model Interpolation ............ SUCCESS [1.169s]
[INFO] Maven IT Plugin :: No Default Component ........... SUCCESS [0.513s]
[INFO] Maven IT Plugin :: No Project ..................... SUCCESS [0.455s]
[INFO] Maven IT Plugin :: Online ......................... SUCCESS [0.460s]
[INFO] Maven IT Plugin :: Optional Mojos ................. SUCCESS [0.914s]
[INFO] Maven IT Plugin :: Packaging ...................... SUCCESS [0.888s]
[INFO] Maven IT Plugin :: Parameter Implementation ....... SUCCESS [0.499s]
[INFO] Maven IT Plugin :: Plugin Dependency .............. SUCCESS [0.498s]
[INFO] Maven IT Plugin :: Project ........................ SUCCESS [1.270s]
[INFO] Maven IT Plugin :: Project Interpolation .......... SUCCESS [0.751s]
[INFO] Maven IT Plugin :: Setter ......................... SUCCESS [0.791s]
[INFO] Maven IT Plugin :: Singleton Component ............ SUCCESS [0.491s]
[INFO] Maven IT Plugin :: Site ........................... SUCCESS [3.051s]
[INFO] Maven IT Plugin :: Toolchain ...................... SUCCESS [6.764s]
[INFO] Maven IT Plugin :: Touch .......................... SUCCESS [0.976s]
[INFO] Maven IT Plugin :: Uses Properties Plugin ......... SUCCESS [0.459s]
[INFO] Maven IT Plugin :: Uses Wagon Plugin .............. SUCCESS [4.562s]
[INFO] Maven IT Plugin :: This plugin should contain the mojos needed by all tests.  SUCCESS
[0.490s]
[INFO] Maven IT Plugin :: Plexus Utils 1.1 ............... SUCCESS [1.088s]
[INFO] Maven IT Plugin :: Plexus Utils New ............... SUCCESS [0.643s]
[INFO] Maven IT Plugin :: Plexus Component API ........... SUCCESS [1.951s]
[INFO] Maven IT Plugin :: Log4J Client ................... SUCCESS [1.334s]
[INFO] Maven IT Plugin :: Extension 1 .................... SUCCESS [0.414s]
[INFO] Maven IT Plugin :: Extension 2 .................... SUCCESS [1.243s]
[INFO] Maven IT Plugin :: Plexus Lifecycle ............... SUCCESS [2.772s]
[INFO] Maven IT Plugin :: Settings ....................... SUCCESS [0.640s]
[INFO] Maven IT Plugin :: mng-5805 extension ............. SUCCESS [0.392s]
[INFO] Maven IT Plugin :: mng-5805 plugin ................ SUCCESS [0.563s]
[INFO] Maven IT Plugin :: mng-5805 plugin-dep ............ SUCCESS [0.435s]
[INFO] Maven IT Toolchain ................................ SUCCESS [1.823s]
[INFO] Maven IT Wagon .................................... SUCCESS [0.902s]
[INFO] Maven IT Support Artifacts ........................ SUCCESS [3.173s]
[INFO] Maven IT Extension ................................ SUCCESS [0.408s]
[INFO] Maven ITs ......................................... FAILURE [47:18.342s]
[INFO] ------------------------------------------------------------------------
[INFO] BUILD FAILURE
[INFO] ------------------------------------------------------------------------
[INFO] Total time: 50:20.898s
[INFO] Finished at: Tue Jul 21 18:23:01 PDT 2015
[INFO] Final Memory: 48M/742M
[INFO] ------------------------------------------------------------------------
[ERROR] Failed to execute goal org.apache.maven.plugins:maven-surefire-plugin:2.17:test (default-test)
on project core-it-suite: There are test failures.
[ERROR] 
[ERROR] Please refer to F:\ws\m3-its\core-integration-testing-trunk\core-it-suite\target\surefire-reports
for the individual test results.
[ERROR] -> [Help 1]
org.apache.maven.lifecycle.LifecycleExecutionException: Failed to execute goal org.apache.maven.plugins:maven-surefire-plugin:2.17:test
(default-test) on project core-it-suite: There are test failures.

Please refer to F:\ws\m3-its\core-integration-testing-trunk\core-it-suite\target\surefire-reports
for the individual test results.
	at org.apache.maven.lifecycle.internal.MojoExecutor.execute(MojoExecutor.java:213)
	at org.apache.maven.lifecycle.internal.MojoExecutor.execute(MojoExecutor.java:153)
	at org.apache.maven.lifecycle.internal.MojoExecutor.execute(MojoExecutor.java:145)
	at org.apache.maven.lifecycle.internal.LifecycleModuleBuilder.buildProject(LifecycleModuleBuilder.java:84)
	at org.apache.maven.lifecycle.internal.LifecycleModuleBuilder.buildProject(LifecycleModuleBuilder.java:59)
	at org.apache.maven.lifecycle.internal.LifecycleStarter.singleThreadedBuild(LifecycleStarter.java:183)
	at org.apache.maven.lifecycle.internal.LifecycleStarter.execute(LifecycleStarter.java:161)
	at org.apache.maven.DefaultMaven.doExecute(DefaultMaven.java:320)
	at org.apache.maven.DefaultMaven.execute(DefaultMaven.java:156)
	at org.apache.maven.cli.MavenCli.execute(MavenCli.java:537)
	at org.apache.maven.cli.MavenCli.doMain(MavenCli.java:196)
	at org.apache.maven.cli.MavenCli.main(MavenCli.java:141)
	at sun.reflect.NativeMethodAccessorImpl.invoke0(Native Method)
	at sun.reflect.NativeMethodAccessorImpl.invoke(NativeMethodAccessorImpl.java:57)
	at sun.reflect.DelegatingMethodAccessorImpl.invoke(DelegatingMethodAccessorImpl.java:43)
	at java.lang.reflect.Method.invoke(Method.java:601)
	at org.codehaus.plexus.classworlds.launcher.Launcher.launchEnhanced(Launcher.java:290)
	at org.codehaus.plexus.classworlds.launcher.Launcher.launch(Launcher.java:230)
	at org.codehaus.plexus.classworlds.launcher.Launcher.mainWithExitCode(Launcher.java:409)
	at org.codehaus.plexus.classworlds.launcher.Launcher.main(Launcher.java:352)
Caused by: org.apache.maven.plugin.MojoFailureException: There are test failures.

Please refer to F:\ws\m3-its\core-integration-testing-trunk\core-it-suite\target\surefire-reports
for the individual test results.
	at org.apache.maven.plugin.surefire.SurefireHelper.reportExecution(SurefireHelper.java:82)
	at org.apache.maven.plugin.surefire.SurefirePlugin.handleSummary(SurefirePlugin.java:195)
	at org.apache.maven.plugin.surefire.AbstractSurefireMojo.executeAfterPreconditionsChecked(AbstractSurefireMojo.java:861)
	at org.apache.maven.plugin.surefire.AbstractSurefireMojo.execute(AbstractSurefireMojo.java:729)
	at org.apache.maven.plugin.DefaultBuildPluginManager.executeMojo(DefaultBuildPluginManager.java:101)
	at org.apache.maven.lifecycle.internal.MojoExecutor.execute(MojoExecutor.java:209)
	... 19 more
[ERROR] 
[ERROR] Re-run Maven using the -X switch to enable full debug logging.
[ERROR] 
[ERROR] For more information about the errors and possible solutions, please read the following
articles:
[ERROR] [Help 1] http://cwiki.apache.org/confluence/display/MAVEN/MojoFailureException
[ERROR] 
[ERROR] After correcting the problems, you can resume the build with the command
[ERROR]   mvn <goals> -rf :core-it-suite
Build step 'Invoke top-level Maven targets' marked build as failure
Recording test results

Mime
View raw message