maven-notifications mailing list archives

Site index · List index
Message view « Date » · « Thread »
Top « Date » · « Thread »
From Apache Jenkins Server <jenk...@builds.apache.org>
Subject Build failed in Jenkins: core-it-maven-3-win #941
Date Fri, 05 Jun 2015 11:51:14 GMT
See <https://builds.apache.org/job/core-it-maven-3-win/941/changes>

Changes:

[stephen.alan.connolly] [FIXES MNG-5840] if the pom.xml at <relativePath> is the same
groupId:artifactId but different version fall back to the repository for parent resolution

------------------------------------------
[...truncated 10427 lines...]
0135EjbLifecycle(it0135)....................................OK (5.2 s)
0134WarLifecycle(it0134)....................................OK (4.6 s)
0133JarLifecycle(it0133)....................................OK (8.4 s)
0132PomLifecycle(it0132)....................................OK (3.8 s)
0131SiteLifecycle(it0131)...................................OK (7.0 s)
0130CleanLifecycle(it0130)..................................OK (5.8 s)
0113ServerAuthzAvailableToWagonMgrInPlugin(it0113)..........OK (3.8 s)
0090EnvVarInterpolation(it0090).............................OK (9.2 s)
0087PluginRealmWithProjectLevelDeps(it0087).................OK (4.0 s)
0086PluginRealm(it0086).....................................OK (4.0 s)
0085TransitiveSystemScope(it0085)...........................OK (8.6 s)
0072InterpolationWithDottedProperty(it0072).................OK (5.1 s)
0071PluginConfigWithDottedProperty(it0071)..................OK (2.8 s)
0064MojoConfigViaSetters(it0064)............................OK (2.8 s)
0063SystemScopeDependency(it0063)...........................OK (8.1 s)
0056MultipleGoalExecutions(it0056)..........................OK (2.7 s)
0052ReleaseProfile(it0052)..................................OK (3.0 s)
0051ReleaseProfile(it0051)..................................OK (3.4 s)
0041ArtifactTypeFromPluginExtension(it0041).................OK (6.0 s)
0040PackagingFromPluginExtension(it0040)....................OK (3.4 s)
0039ReleasePomInReactor(it0039).............................SKIPPED - Maven version 3.3.4-SNAPSHOT
not in range [2.0,3.0-alpha-1)
0038AlternatePomFileDifferentDir(it0038)....................OK (2.7 s)
0037AlternatePomFileSameDir(it0037).........................OK (2.6 s)
0036ReleasePom(it0036)......................................SKIPPED - Maven version 3.3.4-SNAPSHOT
not in range (2.0,3.0-alpha-1)
0032MavenPrerequisite(it0032)...............................OK (2.7 s)
0030DepPomDepMngtInheritance(it0030)........................OK (8.6 s)
0025MultipleExecutionLevelConfigs(it0025)...................OK (6.4 s)
0024MultipleGoalExecutions(it0024)..........................OK (4.1 s)
0023SettingsProfile(it0023).................................OK (3.9 s)
0021PomProfile(it0021)......................................OK (8.4 s)
0019PluginVersionMngtBySuperPom(it0019).....................OK (4.3 s)
0018DependencyManagement(it0018)............................OK (7.4 s)
0012PomInterpolation(it0012)................................OK (3.6 s)
0011DefaultVersionByDependencyManagement(it0011)............OK (5.0 s)
0010DependencyClosureResolution(it0010).....................OK (5.2 s)
0009GoalConfiguration(it0009)...............................OK (7.9 s)
0008SimplePlugin(it0008)....................................OK (4.5 s)
Tests run: 766, Failures: 0, Errors: 1, Skipped: 0, Time elapsed: 4,248.325 sec <<<
FAILURE! - in org.apache.maven.it.IntegrationTestSuite
testPkgTypeMojoConfiguration(org.apache.maven.it.MavenITmng5805PkgTypeMojoConfiguration) 
Time elapsed: 3.323 sec  <<< ERROR!
org.apache.maven.it.VerificationException: Exit code was non-zero: 1; command line and log
= 
<https://builds.apache.org/job/core-it-maven-3-win/ws/apache-maven-3-SNAPSHOT\bin\mvn>
--global-settings F:\ws\m3-its\core-integration-testing-trunk\core-it-suite\target\test-classes\settings.xml
-e --batch-mode -Dmaven.repo.local=<https://builds.apache.org/job/core-it-maven-3-win/ws/it-local-repo>
install
[INFO] Error stacktraces are turned on.
[INFO] Scanning for projects...
[INFO]                                                                         
[INFO] ------------------------------------------------------------------------
[INFO] Building mng-5805-pkg-type-mojo-configuration-extension 0.1
[INFO] ------------------------------------------------------------------------
[INFO] Downloading: file:target/null/org/apache/maven/plugins/maven-jar-plugin/2.4/maven-jar-plugin-2.4.pom
[WARNING] The POM for org.apache.maven.plugins:maven-jar-plugin:jar:2.4 is missing, no dependency
information available
[INFO] Downloading: file:target/null/org/apache/maven/plugins/maven-jar-plugin/2.4/maven-jar-plugin-2.4.jar
[INFO] ------------------------------------------------------------------------
[INFO] BUILD FAILURE
[INFO] ------------------------------------------------------------------------
[INFO] Total time: 0.675 s
[INFO] Finished at: 2015-06-05T03:40:35-07:00
[INFO] Final Memory: 21M/742M
[INFO] ------------------------------------------------------------------------
[ERROR] Plugin org.apache.maven.plugins:maven-jar-plugin:2.4 or one of its dependencies could
not be resolved: Could not find artifact org.apache.maven.plugins:maven-jar-plugin:jar:2.4
in central (file:target/null) -> [Help 1]
org.apache.maven.plugin.PluginResolutionException: Plugin org.apache.maven.plugins:maven-jar-plugin:2.4
or one of its dependencies could not be resolved: Could not find artifact org.apache.maven.plugins:maven-jar-plugin:jar:2.4
in central (file:target/null)
	at org.apache.maven.plugin.internal.DefaultPluginDependenciesResolver.resolve(DefaultPluginDependenciesResolver.java:128)
	at org.apache.maven.plugin.internal.DefaultMavenPluginManager.getPluginDescriptor(DefaultMavenPluginManager.java:179)
	at org.apache.maven.plugin.internal.DefaultMavenPluginManager.getMojoDescriptor(DefaultMavenPluginManager.java:298)
	at org.apache.maven.plugin.DefaultBuildPluginManager.getMojoDescriptor(DefaultBuildPluginManager.java:241)
	at org.apache.maven.lifecycle.internal.DefaultLifecycleExecutionPlanCalculator.setupMojoExecution(DefaultLifecycleExecutionPlanCalculator.java:169)
	at org.apache.maven.lifecycle.internal.DefaultLifecycleExecutionPlanCalculator.setupMojoExecutions(DefaultLifecycleExecutionPlanCalculator.java:155)
	at org.apache.maven.lifecycle.internal.DefaultLifecycleExecutionPlanCalculator.calculateExecutionPlan(DefaultLifecycleExecutionPlanCalculator.java:131)
	at org.apache.maven.lifecycle.internal.DefaultLifecycleExecutionPlanCalculator.calculateExecutionPlan(DefaultLifecycleExecutionPlanCalculator.java:145)
	at org.apache.maven.lifecycle.internal.builder.BuilderCommon.resolveBuildPlan(BuilderCommon.java:96)
	at org.apache.maven.lifecycle.internal.LifecycleModuleBuilder.buildProject(LifecycleModuleBuilder.java:109)
	at org.apache.maven.lifecycle.internal.LifecycleModuleBuilder.buildProject(LifecycleModuleBuilder.java:80)
	at org.apache.maven.lifecycle.internal.builder.singlethreaded.SingleThreadedBuilder.build(SingleThreadedBuilder.java:51)
	at org.apache.maven.lifecycle.internal.LifecycleStarter.execute(LifecycleStarter.java:128)
	at org.apache.maven.DefaultMaven.doExecute(DefaultMaven.java:307)
	at org.apache.maven.DefaultMaven.doExecute(DefaultMaven.java:193)
	at org.apache.maven.DefaultMaven.execute(DefaultMaven.java:106)
	at org.apache.maven.cli.MavenCli.execute(MavenCli.java:862)
	at org.apache.maven.cli.MavenCli.doMain(MavenCli.java:286)
	at org.apache.maven.cli.MavenCli.main(MavenCli.java:197)
	at sun.reflect.NativeMethodAccessorImpl.invoke0(Native Method)
	at sun.reflect.NativeMethodAccessorImpl.invoke(NativeMethodAccessorImpl.java:57)
	at sun.reflect.DelegatingMethodAccessorImpl.invoke(DelegatingMethodAccessorImpl.java:43)
	at java.lang.reflect.Method.invoke(Method.java:601)
	at org.codehaus.plexus.classworlds.launcher.Launcher.launchEnhanced(Launcher.java:289)
	at org.codehaus.plexus.classworlds.launcher.Launcher.launch(Launcher.java:229)
	at org.codehaus.plexus.classworlds.launcher.Launcher.mainWithExitCode(Launcher.java:415)
	at org.codehaus.plexus.classworlds.launcher.Launcher.main(Launcher.java:356)
Caused by: org.eclipse.aether.resolution.ArtifactResolutionException: Could not find artifact
org.apache.maven.plugins:maven-jar-plugin:jar:2.4 in central (file:target/null)
	at org.eclipse.aether.internal.impl.DefaultArtifactResolver.resolve(DefaultArtifactResolver.java:444)
	at org.eclipse.aether.internal.impl.DefaultArtifactResolver.resolveArtifacts(DefaultArtifactResolver.java:246)
	at org.eclipse.aether.internal.impl.DefaultArtifactResolver.resolveArtifact(DefaultArtifactResolver.java:223)
	at org.eclipse.aether.internal.impl.DefaultRepositorySystem.resolveArtifact(DefaultRepositorySystem.java:294)
	at org.apache.maven.plugin.internal.DefaultPluginDependenciesResolver.resolve(DefaultPluginDependenciesResolver.java:124)
	... 26 more
Caused by: org.eclipse.aether.transfer.ArtifactNotFoundException: Could not find artifact
org.apache.maven.plugins:maven-jar-plugin:jar:2.4 in central (file:target/null)
	at org.eclipse.aether.connector.basic.ArtifactTransportListener.transferFailed(ArtifactTransportListener.java:39)
	at org.eclipse.aether.connector.basic.BasicRepositoryConnector$TaskRunner.run(BasicRepositoryConnector.java:355)
	at org.eclipse.aether.util.concurrency.RunnableErrorForwarder$1.run(RunnableErrorForwarder.java:67)
	at org.eclipse.aether.connector.basic.BasicRepositoryConnector$DirectExecutor.execute(BasicRepositoryConnector.java:581)
	at org.eclipse.aether.connector.basic.BasicRepositoryConnector.get(BasicRepositoryConnector.java:249)
	at org.eclipse.aether.internal.impl.DefaultArtifactResolver.performDownloads(DefaultArtifactResolver.java:520)
	at org.eclipse.aether.internal.impl.DefaultArtifactResolver.resolve(DefaultArtifactResolver.java:421)
	... 30 more
[ERROR] 
[ERROR] Re-run Maven using the -X switch to enable full debug logging.
[ERROR] 
[ERROR] For more information about the errors and possible solutions, please read the following
articles:
[ERROR] [Help 1] http://cwiki.apache.org/confluence/display/MAVEN/PluginResolutionException

	at org.apache.maven.it.Verifier.executeGoals(Verifier.java:1353)
	at org.apache.maven.it.Verifier.executeGoal(Verifier.java:1236)
	at org.apache.maven.it.Verifier.executeGoal(Verifier.java:1230)
	at org.apache.maven.it.MavenITmng5805PkgTypeMojoConfiguration.testPkgTypeMojoConfiguration(MavenITmng5805PkgTypeMojoConfiguration.java:24)


Results :

Tests in error: 
  MavenITmng5805PkgTypeMojoConfiguration>AbstractMavenIntegrationTestCase.runTest:220->testPkgTypeMojoConfiguration:24
ยป Verification

Tests run: 766, Failures: 0, Errors: 1, Skipped: 0

[INFO] ------------------------------------------------------------------------
[INFO] Reactor Summary:
[INFO] 
[INFO] Maven Core ITs .................................... SUCCESS [1:29.074s]
[INFO] Maven IT Support .................................. SUCCESS [1.168s]
[INFO] Maven IT :: Plugins ............................... SUCCESS [1.150s]
[INFO] Maven IT Plugin :: Active Collection .............. SUCCESS [13.017s]
[INFO] Maven IT Plugin :: Ant-Based ...................... SUCCESS [12.362s]
[INFO] Maven IT Plugin :: Artifact ....................... SUCCESS [4.066s]
[INFO] Maven IT Plugin :: Class Loader :: Dependency A ... SUCCESS [1.257s]
[INFO] Maven IT Plugin :: Class Loader :: Dependency B ... SUCCESS [0.847s]
[INFO] Maven IT Plugin :: Class Loader :: Dependency C ... SUCCESS [1.160s]
[INFO] Maven IT Plugin :: Class Loader ................... SUCCESS [2.451s]
[INFO] Maven IT Plugin :: Class Loader :: Aggregator ..... SUCCESS [0.473s]
[INFO] Maven IT Plugin :: Configuration .................. SUCCESS [1.679s]
[INFO] Maven IT Plugin :: Context Passing ................ SUCCESS [0.604s]
[INFO] Maven ITs :: Core Plugin Stubs .................... SUCCESS [0.914s]
[INFO] Maven IT Clean Plugin Stub ........................ SUCCESS [0.752s]
[INFO] Maven IT Compiler Plugin Stub ..................... SUCCESS [1.035s]
[INFO] Maven IT Deploy Plugin Stub ....................... SUCCESS [1.420s]
[INFO] Maven IT EAR Plugin Stub .......................... SUCCESS [0.793s]
[INFO] Maven IT EJB Plugin Stub .......................... SUCCESS [0.686s]
[INFO] Maven IT Install Plugin Stub ...................... SUCCESS [0.640s]
[INFO] Maven IT JAR Plugin Stub .......................... SUCCESS [0.797s]
[INFO] Maven IT Javadoc Plugin Stub ...................... SUCCESS [0.633s]
[INFO] Maven IT Plugin Plugin Stub ....................... SUCCESS [0.729s]
[INFO] Maven IT RAR Plugin Stub .......................... SUCCESS [0.790s]
[INFO] Maven IT Resources Plugin Stub .................... SUCCESS [0.786s]
[INFO] Maven IT Site Plugin Stub ......................... SUCCESS [1.179s]
[INFO] Maven IT Source Plugin Stub ....................... SUCCESS [0.903s]
[INFO] Maven IT Surefire Plugin Stub ..................... SUCCESS [1.770s]
[INFO] Maven IT WAR Plugin Stub .......................... SUCCESS [1.695s]
[INFO] Maven IT Plugin :: Dependency Collection .......... SUCCESS [2.667s]
[INFO] Maven IT Plugin :: Dependency Resolution .......... SUCCESS [25.833s]
[INFO] Maven IT Plugin :: Expression ..................... SUCCESS [1.173s]
[INFO] Maven IT Plugin :: Error Mojos .................... SUCCESS [3.342s]
[INFO] Maven IT Component ................................ SUCCESS [1.049s]
[INFO] Maven IT Plugin :: Extension Consumer ............. SUCCESS [1.197s]
[INFO] Maven IT Plugin :: Extension Provider ............. SUCCESS [0.844s]
[INFO] Maven IT Plugin :: Fork ........................... SUCCESS [1.543s]
[INFO] Maven IT Plugin :: Invalid Descriptor ............. SUCCESS [1.630s]
[INFO] Maven IT Plugin :: Log File ....................... SUCCESS [1.672s]
[INFO] Maven IT Helper Library ........................... SUCCESS [4.970s]
[INFO] Maven IT Plugin :: Model Interpolation ............ SUCCESS [0.982s]
[INFO] Maven IT Plugin :: No Default Component ........... SUCCESS [0.615s]
[INFO] Maven IT Plugin :: No Project ..................... SUCCESS [0.762s]
[INFO] Maven IT Plugin :: Online ......................... SUCCESS [0.614s]
[INFO] Maven IT Plugin :: Optional Mojos ................. SUCCESS [1.062s]
[INFO] Maven IT Plugin :: Packaging ...................... SUCCESS [0.550s]
[INFO] Maven IT Plugin :: Parameter Implementation ....... SUCCESS [0.514s]
[INFO] Maven IT Plugin :: Plugin Dependency .............. SUCCESS [0.496s]
[INFO] Maven IT Plugin :: Project ........................ SUCCESS [1.013s]
[INFO] Maven IT Plugin :: Project Interpolation .......... SUCCESS [1.115s]
[INFO] Maven IT Plugin :: Setter ......................... SUCCESS [0.886s]
[INFO] Maven IT Plugin :: Singleton Component ............ SUCCESS [1.098s]
[INFO] Maven IT Plugin :: Site ........................... SUCCESS [9.404s]
[INFO] Maven IT Plugin :: Toolchain ...................... SUCCESS [16.715s]
[INFO] Maven IT Plugin :: Touch .......................... SUCCESS [1.498s]
[INFO] Maven IT Plugin :: Uses Properties Plugin ......... SUCCESS [0.538s]
[INFO] Maven IT Plugin :: Uses Wagon Plugin .............. SUCCESS [4.358s]
[INFO] Maven IT Plugin :: This plugin should contain the mojos needed by all tests.  SUCCESS
[0.461s]
[INFO] Maven IT Plugin :: Plexus Utils 1.1 ............... SUCCESS [0.798s]
[INFO] Maven IT Plugin :: Plexus Utils New ............... SUCCESS [0.740s]
[INFO] Maven IT Plugin :: Plexus Component API ........... SUCCESS [3.690s]
[INFO] Maven IT Plugin :: Log4J Client ................... SUCCESS [1.674s]
[INFO] Maven IT Plugin :: Extension 1 .................... SUCCESS [0.524s]
[INFO] Maven IT Plugin :: Extension 2 .................... SUCCESS [1.231s]
[INFO] Maven IT Plugin :: Plexus Lifecycle ............... SUCCESS [5.326s]
[INFO] Maven IT Plugin :: Settings ....................... SUCCESS [1.541s]
[INFO] Maven IT Toolchain ................................ SUCCESS [2.963s]
[INFO] Maven IT Wagon .................................... SUCCESS [1.621s]
[INFO] Maven IT Support Artifacts ........................ SUCCESS [4.590s]
[INFO] Maven IT Extension ................................ SUCCESS [0.438s]
[INFO] Maven ITs ......................................... FAILURE [1:11:30.712s]
[INFO] ------------------------------------------------------------------------
[INFO] BUILD FAILURE
[INFO] ------------------------------------------------------------------------
[INFO] Total time: 1:15:53.056s
[INFO] Finished at: Fri Jun 05 04:50:56 PDT 2015
[INFO] Final Memory: 47M/742M
[INFO] ------------------------------------------------------------------------
[ERROR] Failed to execute goal org.apache.maven.plugins:maven-surefire-plugin:2.17:test (default-test)
on project core-it-suite: There are test failures.
[ERROR] 
[ERROR] Please refer to F:\ws\m3-its\core-integration-testing-trunk\core-it-suite\target\surefire-reports
for the individual test results.
[ERROR] -> [Help 1]
org.apache.maven.lifecycle.LifecycleExecutionException: Failed to execute goal org.apache.maven.plugins:maven-surefire-plugin:2.17:test
(default-test) on project core-it-suite: There are test failures.

Please refer to F:\ws\m3-its\core-integration-testing-trunk\core-it-suite\target\surefire-reports
for the individual test results.
	at org.apache.maven.lifecycle.internal.MojoExecutor.execute(MojoExecutor.java:213)
	at org.apache.maven.lifecycle.internal.MojoExecutor.execute(MojoExecutor.java:153)
	at org.apache.maven.lifecycle.internal.MojoExecutor.execute(MojoExecutor.java:145)
	at org.apache.maven.lifecycle.internal.LifecycleModuleBuilder.buildProject(LifecycleModuleBuilder.java:84)
	at org.apache.maven.lifecycle.internal.LifecycleModuleBuilder.buildProject(LifecycleModuleBuilder.java:59)
	at org.apache.maven.lifecycle.internal.LifecycleStarter.singleThreadedBuild(LifecycleStarter.java:183)
	at org.apache.maven.lifecycle.internal.LifecycleStarter.execute(LifecycleStarter.java:161)
	at org.apache.maven.DefaultMaven.doExecute(DefaultMaven.java:320)
	at org.apache.maven.DefaultMaven.execute(DefaultMaven.java:156)
	at org.apache.maven.cli.MavenCli.execute(MavenCli.java:537)
	at org.apache.maven.cli.MavenCli.doMain(MavenCli.java:196)
	at org.apache.maven.cli.MavenCli.main(MavenCli.java:141)
	at sun.reflect.NativeMethodAccessorImpl.invoke0(Native Method)
	at sun.reflect.NativeMethodAccessorImpl.invoke(NativeMethodAccessorImpl.java:57)
	at sun.reflect.DelegatingMethodAccessorImpl.invoke(DelegatingMethodAccessorImpl.java:43)
	at java.lang.reflect.Method.invoke(Method.java:601)
	at org.codehaus.plexus.classworlds.launcher.Launcher.launchEnhanced(Launcher.java:290)
	at org.codehaus.plexus.classworlds.launcher.Launcher.launch(Launcher.java:230)
	at org.codehaus.plexus.classworlds.launcher.Launcher.mainWithExitCode(Launcher.java:409)
	at org.codehaus.plexus.classworlds.launcher.Launcher.main(Launcher.java:352)
Caused by: org.apache.maven.plugin.MojoFailureException: There are test failures.

Please refer to F:\ws\m3-its\core-integration-testing-trunk\core-it-suite\target\surefire-reports
for the individual test results.
	at org.apache.maven.plugin.surefire.SurefireHelper.reportExecution(SurefireHelper.java:82)
	at org.apache.maven.plugin.surefire.SurefirePlugin.handleSummary(SurefirePlugin.java:195)
	at org.apache.maven.plugin.surefire.AbstractSurefireMojo.executeAfterPreconditionsChecked(AbstractSurefireMojo.java:861)
	at org.apache.maven.plugin.surefire.AbstractSurefireMojo.execute(AbstractSurefireMojo.java:729)
	at org.apache.maven.plugin.DefaultBuildPluginManager.executeMojo(DefaultBuildPluginManager.java:101)
	at org.apache.maven.lifecycle.internal.MojoExecutor.execute(MojoExecutor.java:209)
	... 19 more
[ERROR] 
[ERROR] Re-run Maven using the -X switch to enable full debug logging.
[ERROR] 
[ERROR] For more information about the errors and possible solutions, please read the following
articles:
[ERROR] [Help 1] http://cwiki.apache.org/confluence/display/MAVEN/MojoFailureException
[ERROR] 
[ERROR] After correcting the problems, you can resume the build with the command
[ERROR]   mvn <goals> -rf :core-it-suite
Build step 'Invoke top-level Maven targets' marked build as failure
Recording test results

Mime
View raw message