maven-notifications mailing list archives

Site index · List index
Message view « Date » · « Thread »
Top « Date » · « Thread »
From Apache Jenkins Server <jenk...@builds.apache.org>
Subject Build failed in Jenkins: maven-plugins-windows » Apache Maven Dependency Plugin #1212
Date Sat, 27 Jun 2015 14:39:19 GMT
See <https://builds.apache.org/job/maven-plugins-windows/org.apache.maven.plugins$maven-dependency-plugin/1212/>

------------------------------------------
[...truncated 58 lines...]
[INFO] Mojo extractor for language: java found 0 mojo descriptors.
[INFO] Applying mojo extractor for language: bsh
[INFO] Mojo extractor for language: bsh found 0 mojo descriptors.
[INFO] 
[INFO] --- maven-resources-plugin:2.6:testResources (default-testResources) @ maven-dependency-plugin
---
[INFO] Using 'UTF-8' encoding to copy filtered resources.
[INFO] Copying 16 resources
[INFO] Copying 3 resources
[INFO] 
[INFO] --- maven-compiler-plugin:3.1:testCompile (default-testCompile) @ maven-dependency-plugin
---
[INFO] Changes detected - recompiling the module!
[INFO] Compiling 40 source files to F:\jenkins\jenkins-slave\workspace\maven-plugins-windows\maven-dependency-plugin\target\test-classes
[WARNING] /F:/jenkins/jenkins-slave/workspace/maven-plugins-windows/maven-dependency-plugin/src/test/java/org/apache/maven/plugin/dependency/testUtils/stubs/DependencyProjectStub.java:
Some input files use or override a deprecated API.
[WARNING] /F:/jenkins/jenkins-slave/workspace/maven-plugins-windows/maven-dependency-plugin/src/test/java/org/apache/maven/plugin/dependency/testUtils/stubs/DependencyProjectStub.java:
Recompile with -Xlint:deprecation for details.
[WARNING] /F:/jenkins/jenkins-slave/workspace/maven-plugins-windows/maven-dependency-plugin/src/test/java/org/apache/maven/plugin/dependency/testUtils/stubs/DependencyProjectStub.java:
F:\jenkins\jenkins-slave\workspace\maven-plugins-windows\maven-dependency-plugin\src\test\java\org\apache\maven\plugin\dependency\testUtils\stubs\DependencyProjectStub.java
uses unchecked or unsafe operations.
[WARNING] /F:/jenkins/jenkins-slave/workspace/maven-plugins-windows/maven-dependency-plugin/src/test/java/org/apache/maven/plugin/dependency/testUtils/stubs/DependencyProjectStub.java:
Recompile with -Xlint:unchecked for details.
[INFO] 
[INFO] --- maven-surefire-plugin:2.17:test (default-test) @ maven-dependency-plugin ---
[INFO] Surefire report directory: F:\jenkins\jenkins-slave\workspace\maven-plugins-windows\maven-dependency-plugin\target\surefire-reports

-------------------------------------------------------
 T E S T S
-------------------------------------------------------
Running org.apache.maven.plugin.dependency.analyze.TestAnalyzeDepMgt
[info] Found Resolved Dependency / DependencyManagement mismatches:
[info]    Nothing in DepMgt.
[info] Found Resolved Dependency / DependencyManagement mismatches:
[info] testGroupId:release:jar was excluded in DepMgt, but version 1.0 has been found in the
dependency tree.
[info] 	Dependency: testGroupId:release:jar
[info] 		DepMgt  : 3.0
[info] 		Resolved: 1.0
[warn] Potential problems found in Dependency Management 
[info] Found Resolved Dependency / DependencyManagement mismatches:
[info] testGroupId:release:jar was excluded in DepMgt, but version 1.0 has been found in the
dependency tree.
[info] 	Dependency: testGroupId:release:jar
[info] 		DepMgt  : 3.0
[info] 		Resolved: 1.0
Caught Expected Exception:Found Dependency errors.
[info] Found Resolved Dependency / DependencyManagement mismatches:
[info] 	Ignoring Direct Dependencies.
[info]    None
Tests run: 5, Failures: 0, Errors: 0, Skipped: 0, Time elapsed: 0.052 sec - in org.apache.maven.plugin.dependency.analyze.TestAnalyzeDepMgt
Running org.apache.maven.plugin.dependency.analyze.TestAnalyzeDuplicateMojo
Tests run: 2, Failures: 0, Errors: 0, Skipped: 0, Time elapsed: 6.429 sec - in org.apache.maven.plugin.dependency.analyze.TestAnalyzeDuplicateMojo
Running org.apache.maven.plugin.dependency.fromConfiguration.TestArtifactItem
Tests run: 2, Failures: 0, Errors: 0, Skipped: 0, Time elapsed: 0.913 sec - in org.apache.maven.plugin.dependency.fromConfiguration.TestArtifactItem
Running org.apache.maven.plugin.dependency.fromConfiguration.TestCopyMojo
Tests run: 27, Failures: 0, Errors: 0, Skipped: 0, Time elapsed: 30.235 sec - in org.apache.maven.plugin.dependency.fromConfiguration.TestCopyMojo
Running org.apache.maven.plugin.dependency.fromConfiguration.TestIncludeExcludeUnpackMojo
[INFO] Configured Artifact: test:test:1.0:jar
[INFO] Unpacking F:\jenkins\jenkins-slave\workspace\maven-plugins-windows\maven-dependency-plugin\target\unit-tests\unpack\localTestRepo\test-1.0.jar
to F:\jenkins\jenkins-slave\workspace\maven-plugins-windows\maven-dependency-plugin\target\unit-tests\unpack\outputDirectory
with includes "" and excludes ""
[INFO] Configured Artifact: test:test:1.0:jar
[INFO] Unpacking F:\jenkins\jenkins-slave\workspace\maven-plugins-windows\maven-dependency-plugin\target\unit-tests\unpack\localTestRepo\test-1.0.jar
to F:\jenkins\jenkins-slave\workspace\maven-plugins-windows\maven-dependency-plugin\target\unit-tests\unpack\outputDirectory
with includes "**/*" and excludes ""
[INFO] Configured Artifact: test:test:1.0:jar
[INFO] Unpacking F:\jenkins\jenkins-slave\workspace\maven-plugins-windows\maven-dependency-plugin\target\unit-tests\unpack\localTestRepo\test-1.0.jar
to F:\jenkins\jenkins-slave\workspace\maven-plugins-windows\maven-dependency-plugin\target\unit-tests\unpack\outputDirectory
with includes "**/*1.txt" and excludes ""
[INFO] Configured Artifact: test:test:1.0:jar
[INFO] Unpacking F:\jenkins\jenkins-slave\workspace\maven-plugins-windows\maven-dependency-plugin\target\unit-tests\unpack\localTestRepo\test-1.0.jar
to F:\jenkins\jenkins-slave\workspace\maven-plugins-windows\maven-dependency-plugin\target\unit-tests\unpack\outputDirectory
with includes "" and excludes "**/*"
[INFO] Configured Artifact: test:test:1.0:jar
[INFO] Unpacking F:\jenkins\jenkins-slave\workspace\maven-plugins-windows\maven-dependency-plugin\target\unit-tests\unpack\localTestRepo\test-1.0.jar
to F:\jenkins\jenkins-slave\workspace\maven-plugins-windows\maven-dependency-plugin\target\unit-tests\unpack\outputDirectory
with includes "" and excludes "**/*"
[INFO] Configured Artifact: test:test:1.0:jar
[INFO] Unpacking F:\jenkins\jenkins-slave\workspace\maven-plugins-windows\maven-dependency-plugin\target\unit-tests\unpack\localTestRepo\test-1.0.jar
to F:\jenkins\jenkins-slave\workspace\maven-plugins-windows\maven-dependency-plugin\target\unit-tests\unpack\outputDirectory
with includes "**/*" and excludes ""
[INFO] Configured Artifact: test:test:1.0:jar
[INFO] Configured Artifact: test:test:1.0:jar
[INFO] Unpacking F:\jenkins\jenkins-slave\workspace\maven-plugins-windows\maven-dependency-plugin\target\unit-tests\unpack\localTestRepo\test-1.0.jar
to F:\jenkins\jenkins-slave\workspace\maven-plugins-windows\maven-dependency-plugin\target\unit-tests\unpack\outputDirectory
with includes "**/test2.txt" and excludes ""
[INFO] Unpacking F:\jenkins\jenkins-slave\workspace\maven-plugins-windows\maven-dependency-plugin\target\unit-tests\unpack\localTestRepo\test-1.0.jar
to F:\jenkins\jenkins-slave\workspace\maven-plugins-windows\maven-dependency-plugin\target\unit-tests\unpack\outputDirectory
with includes "**/test3.txt" and excludes ""
[INFO] Configured Artifact: test:test:1.0:jar
[INFO] Unpacking F:\jenkins\jenkins-slave\workspace\maven-plugins-windows\maven-dependency-plugin\target\unit-tests\unpack\localTestRepo\test-1.0.jar
to F:\jenkins\jenkins-slave\workspace\maven-plugins-windows\maven-dependency-plugin\target\unit-tests\unpack\outputDirectory
with includes "**/test2.txt" and excludes ""
[INFO] Configured Artifact: test:test:1.0:jar
[INFO] Unpacking F:\jenkins\jenkins-slave\workspace\maven-plugins-windows\maven-dependency-plugin\target\unit-tests\unpack\localTestRepo\test-1.0.jar
to F:\jenkins\jenkins-slave\workspace\maven-plugins-windows\maven-dependency-plugin\target\unit-tests\unpack\outputDirectory
with includes "" and excludes "**/test2.txt"
[INFO] Configured Artifact: test:test:1.0:jar
[INFO] Configured Artifact: test:test:1.0:jar
[INFO] Unpacking F:\jenkins\jenkins-slave\workspace\maven-plugins-windows\maven-dependency-plugin\target\unit-tests\unpack\localTestRepo\test-1.0.jar
to F:\jenkins\jenkins-slave\workspace\maven-plugins-windows\maven-dependency-plugin\target\unit-tests\unpack\outputDirectory
with includes "**/test2.txt" and excludes ""
[INFO] Unpacking F:\jenkins\jenkins-slave\workspace\maven-plugins-windows\maven-dependency-plugin\target\unit-tests\unpack\localTestRepo\test-1.0.jar
to F:\jenkins\jenkins-slave\workspace\maven-plugins-windows\maven-dependency-plugin\target\unit-tests\unpack\outputDirectory
with includes "**/test3.txt" and excludes ""
[INFO] Configured Artifact: test:test:1.0:jar
[INFO] Configured Artifact: test:test:1.0:jar
[INFO] test-1.0.jar already unpacked.
[INFO] test-1.0.jar already unpacked.
[INFO] Configured Artifact: test:test:1.0:jar
[INFO] Unpacking F:\jenkins\jenkins-slave\workspace\maven-plugins-windows\maven-dependency-plugin\target\unit-tests\unpack\localTestRepo\test-1.0.jar
to F:\jenkins\jenkins-slave\workspace\maven-plugins-windows\maven-dependency-plugin\target\unit-tests\unpack\outputDirectory
with includes "" and excludes "**/*1.txt"
Tests run: 11, Failures: 0, Errors: 0, Skipped: 0, Time elapsed: 3.343 sec - in org.apache.maven.plugin.dependency.fromConfiguration.TestIncludeExcludeUnpackMojo
Running org.apache.maven.plugin.dependency.fromConfiguration.TestUnpackMojo
[INFO] Configured Artifact: testGroupId:snapshot:2.0-SNAPSHOT:jar
[INFO] Unpacking F:\jenkins\jenkins-slave\workspace\maven-plugins-windows\maven-dependency-plugin\target\unit-tests\unpack\localTestRepo\snapshot-2.0-SNAPSHOT.jar
to F:\jenkins\jenkins-slave\workspace\maven-plugins-windows\maven-dependency-plugin\target\unit-tests\unpack\outputDirectory
with includes "" and excludes ""
unpackedFile 2015-06-27T07:37:36 \target\unit-tests\unpack\outputDirectory\testGroupId-snapshot-2.0-SNAPSHOT-null-jar.txt
artifact     2015-06-27T07:37:41 \target\unit-tests\unpack\localTestRepo\snapshot-2.0-SNAPSHOT.jar
marker       2015-06-27T07:37:36 \target\unit-tests\unpack\markers\testGroupId-snapshot-jar-2.0-SNAPSHOT.marker
mojo.execute()
[INFO] Configured Artifact: testGroupId:snapshot:2.0-SNAPSHOT:jar
[INFO] Unpacking F:\jenkins\jenkins-slave\workspace\maven-plugins-windows\maven-dependency-plugin\target\unit-tests\unpack\localTestRepo\snapshot-2.0-SNAPSHOT.jar
to F:\jenkins\jenkins-slave\workspace\maven-plugins-windows\maven-dependency-plugin\target\unit-tests\unpack\outputDirectory
with includes "" and excludes ""
unpackedFile 2015-06-27T07:36:56 \target\unit-tests\unpack\outputDirectory\testGroupId-snapshot-2.0-SNAPSHOT-null-jar.txt
artifact     2015-06-27T07:37:41 \target\unit-tests\unpack\localTestRepo\snapshot-2.0-SNAPSHOT.jar
marker       2015-06-27T07:37:41 \target\unit-tests\unpack\markers\testGroupId-snapshot-jar-2.0-SNAPSHOT.marker
marker.lastModified() = 1435415861000
unpackedFile.lastModified() = 1435415816000
Tests run: 17, Failures: 0, Errors: 0, Skipped: 0, Time elapsed: 7.366 sec - in org.apache.maven.plugin.dependency.fromConfiguration.TestUnpackMojo
Running org.apache.maven.plugin.dependency.fromDependencies.TestBuildClasspathMojo
[INFO] Dependencies classpath:
F:\jenkins\jenkins-slave\workspace\maven-plugins-windows\maven-dependency-plugin\target\unit-tests\build-classpath\localTestRepo\snapshot-2.0-SNAPSHOT.jar;F:\jenkins\jenkins-slave\workspace\maven-plugins-windows\maven-dependency-plugin\target\unit-tests\build-classpath\localTestRepo\test-1.0.jar;F:\jenkins\jenkins-slave\workspace\maven-plugins-windows\maven-dependency-plugin\target\unit-tests\build-classpath\localTestRepo\provided-1.0.jar;F:\jenkins\jenkins-slave\workspace\maven-plugins-windows\maven-dependency-plugin\target\unit-tests\build-classpath\localTestRepo\release-1.0.jar;F:\jenkins\jenkins-slave\workspace\maven-plugins-windows\maven-dependency-plugin\target\unit-tests\build-classpath\localTestRepo\runtime-1.0.jar;F:\jenkins\jenkins-slave\workspace\maven-plugins-windows\maven-dependency-plugin\target\unit-tests\build-classpath\localTestRepo\compile-1.0.jar;F:\jenkins\jenkins-slave\workspace\maven-plugins-windows\maven-dependency-plugin\target\unit-tests\build-classpath\localTestRepo\system-1.0.jar
[INFO] Wrote classpath file 'F:\jenkins\jenkins-slave\workspace\maven-plugins-windows\maven-dependency-plugin\target\unit-tests\build-classpath\buildClasspath.txt'.
[INFO] Wrote classpath file 'F:\jenkins\jenkins-slave\workspace\maven-plugins-windows\maven-dependency-plugin\target\unit-tests\build-classpath\buildClasspath.txt'.
Tests run: 2, Failures: 0, Errors: 0, Skipped: 0, Time elapsed: 0.273 sec - in org.apache.maven.plugin.dependency.fromDependencies.TestBuildClasspathMojo
Running org.apache.maven.plugin.dependency.fromDependencies.TestCopyDependenciesMojo
Tests run: 33, Failures: 0, Errors: 4, Skipped: 0, Time elapsed: 14.214 sec <<< FAILURE!
- in org.apache.maven.plugin.dependency.fromDependencies.TestCopyDependenciesMojo
testArtifactResolutionException(org.apache.maven.plugin.dependency.fromDependencies.TestCopyDependenciesMojo)
 Time elapsed: 0.106 sec  <<< ERROR!
java.lang.NullPointerException: null
	at org.apache.maven.plugin.dependency.fromDependencies.AbstractDependencyFilterMojo.getClassifierTranslatedDependencies(AbstractDependencyFilterMojo.java:404)
	at org.apache.maven.plugin.dependency.fromDependencies.AbstractDependencyFilterMojo.getDependencySets(AbstractDependencyFilterMojo.java:326)
	at org.apache.maven.plugin.dependency.fromDependencies.CopyDependenciesMojo.doExecute(CopyDependenciesMojo.java:123)
	at org.apache.maven.plugin.dependency.AbstractDependencyMojo.execute(AbstractDependencyMojo.java:168)
	at org.apache.maven.plugin.dependency.fromDependencies.TestCopyDependenciesMojo.dotestArtifactExceptions(TestCopyDependenciesMojo.java:501)
	at org.apache.maven.plugin.dependency.fromDependencies.TestCopyDependenciesMojo.testArtifactResolutionException(TestCopyDependenciesMojo.java:485)

testCDMClassifier(org.apache.maven.plugin.dependency.fromDependencies.TestCopyDependenciesMojo)
 Time elapsed: 0.131 sec  <<< ERROR!
java.lang.NullPointerException: null
	at org.apache.maven.plugin.dependency.fromDependencies.AbstractDependencyFilterMojo.getClassifierTranslatedDependencies(AbstractDependencyFilterMojo.java:404)
	at org.apache.maven.plugin.dependency.fromDependencies.AbstractDependencyFilterMojo.getDependencySets(AbstractDependencyFilterMojo.java:326)
	at org.apache.maven.plugin.dependency.fromDependencies.CopyDependenciesMojo.doExecute(CopyDependenciesMojo.java:123)
	at org.apache.maven.plugin.dependency.AbstractDependencyMojo.execute(AbstractDependencyMojo.java:168)
	at org.apache.maven.plugin.dependency.fromDependencies.TestCopyDependenciesMojo.dotestClassifierType(TestCopyDependenciesMojo.java:446)
	at org.apache.maven.plugin.dependency.fromDependencies.TestCopyDependenciesMojo.testCDMClassifier(TestCopyDependenciesMojo.java:420)

testArtifactNotFound(org.apache.maven.plugin.dependency.fromDependencies.TestCopyDependenciesMojo)
 Time elapsed: 0.31 sec  <<< ERROR!
java.lang.NullPointerException: null
	at org.apache.maven.plugin.dependency.fromDependencies.AbstractDependencyFilterMojo.getClassifierTranslatedDependencies(AbstractDependencyFilterMojo.java:404)
	at org.apache.maven.plugin.dependency.fromDependencies.AbstractDependencyFilterMojo.getDependencySets(AbstractDependencyFilterMojo.java:326)
	at org.apache.maven.plugin.dependency.fromDependencies.CopyDependenciesMojo.doExecute(CopyDependenciesMojo.java:123)
	at org.apache.maven.plugin.dependency.AbstractDependencyMojo.execute(AbstractDependencyMojo.java:168)
	at org.apache.maven.plugin.dependency.fromDependencies.TestCopyDependenciesMojo.dotestArtifactExceptions(TestCopyDependenciesMojo.java:501)
	at org.apache.maven.plugin.dependency.fromDependencies.TestCopyDependenciesMojo.testArtifactNotFound(TestCopyDependenciesMojo.java:479)

testCDMClassifierType(org.apache.maven.plugin.dependency.fromDependencies.TestCopyDependenciesMojo)
 Time elapsed: 0.117 sec  <<< ERROR!
java.lang.NullPointerException: null
	at org.apache.maven.plugin.dependency.fromDependencies.AbstractDependencyFilterMojo.getClassifierTranslatedDependencies(AbstractDependencyFilterMojo.java:404)
	at org.apache.maven.plugin.dependency.fromDependencies.AbstractDependencyFilterMojo.getDependencySets(AbstractDependencyFilterMojo.java:326)
	at org.apache.maven.plugin.dependency.fromDependencies.CopyDependenciesMojo.doExecute(CopyDependenciesMojo.java:123)
	at org.apache.maven.plugin.dependency.AbstractDependencyMojo.execute(AbstractDependencyMojo.java:168)
	at org.apache.maven.plugin.dependency.fromDependencies.TestCopyDependenciesMojo.dotestClassifierType(TestCopyDependenciesMojo.java:446)
	at org.apache.maven.plugin.dependency.fromDependencies.TestCopyDependenciesMojo.testCDMClassifierType(TestCopyDependenciesMojo.java:432)

Running org.apache.maven.plugin.dependency.fromDependencies.TestCopyDependenciesMojo2
Tests run: 11, Failures: 0, Errors: 0, Skipped: 0, Time elapsed: 2.346 sec - in org.apache.maven.plugin.dependency.fromDependencies.TestCopyDependenciesMojo2
Running org.apache.maven.plugin.dependency.fromDependencies.TestIncludeExcludeUnpackDependenciesMojo
Tests run: 7, Failures: 0, Errors: 0, Skipped: 0, Time elapsed: 1.989 sec - in org.apache.maven.plugin.dependency.fromDependencies.TestIncludeExcludeUnpackDependenciesMojo
Running org.apache.maven.plugin.dependency.fromDependencies.TestUnpackDependenciesMojo
Tests run: 28, Failures: 0, Errors: 4, Skipped: 0, Time elapsed: 10.181 sec <<< FAILURE!
- in org.apache.maven.plugin.dependency.fromDependencies.TestUnpackDependenciesMojo
testArtifactResolutionException(org.apache.maven.plugin.dependency.fromDependencies.TestUnpackDependenciesMojo)
 Time elapsed: 0.276 sec  <<< ERROR!
java.lang.NullPointerException: null
	at org.apache.maven.plugin.dependency.fromDependencies.AbstractDependencyFilterMojo.getClassifierTranslatedDependencies(AbstractDependencyFilterMojo.java:404)
	at org.apache.maven.plugin.dependency.fromDependencies.AbstractDependencyFilterMojo.getDependencySets(AbstractDependencyFilterMojo.java:326)
	at org.apache.maven.plugin.dependency.fromDependencies.AbstractDependencyFilterMojo.getDependencySets(AbstractDependencyFilterMojo.java:261)
	at org.apache.maven.plugin.dependency.fromDependencies.UnpackDependenciesMojo.doExecute(UnpackDependenciesMojo.java:84)
	at org.apache.maven.plugin.dependency.AbstractDependencyMojo.execute(AbstractDependencyMojo.java:168)
	at org.apache.maven.plugin.dependency.fromDependencies.TestUnpackDependenciesMojo.dotestArtifactExceptions(TestUnpackDependenciesMojo.java:572)
	at org.apache.maven.plugin.dependency.fromDependencies.TestUnpackDependenciesMojo.testArtifactResolutionException(TestUnpackDependenciesMojo.java:557)

testCDMClassifier(org.apache.maven.plugin.dependency.fromDependencies.TestUnpackDependenciesMojo)
 Time elapsed: 0.272 sec  <<< ERROR!
java.lang.NullPointerException: null
	at org.apache.maven.plugin.dependency.fromDependencies.AbstractDependencyFilterMojo.getClassifierTranslatedDependencies(AbstractDependencyFilterMojo.java:404)
	at org.apache.maven.plugin.dependency.fromDependencies.AbstractDependencyFilterMojo.getDependencySets(AbstractDependencyFilterMojo.java:326)
	at org.apache.maven.plugin.dependency.fromDependencies.AbstractDependencyFilterMojo.getDependencySets(AbstractDependencyFilterMojo.java:261)
	at org.apache.maven.plugin.dependency.fromDependencies.UnpackDependenciesMojo.doExecute(UnpackDependenciesMojo.java:84)
	at org.apache.maven.plugin.dependency.AbstractDependencyMojo.execute(AbstractDependencyMojo.java:168)
	at org.apache.maven.plugin.dependency.fromDependencies.TestUnpackDependenciesMojo.dotestClassifierType(TestUnpackDependenciesMojo.java:528)
	at org.apache.maven.plugin.dependency.fromDependencies.TestUnpackDependenciesMojo.testCDMClassifier(TestUnpackDependenciesMojo.java:496)

testArtifactNotFound(org.apache.maven.plugin.dependency.fromDependencies.TestUnpackDependenciesMojo)
 Time elapsed: 0.726 sec  <<< ERROR!
java.lang.NullPointerException: null
	at org.apache.maven.plugin.dependency.fromDependencies.AbstractDependencyFilterMojo.getClassifierTranslatedDependencies(AbstractDependencyFilterMojo.java:404)
	at org.apache.maven.plugin.dependency.fromDependencies.AbstractDependencyFilterMojo.getDependencySets(AbstractDependencyFilterMojo.java:326)
	at org.apache.maven.plugin.dependency.fromDependencies.AbstractDependencyFilterMojo.getDependencySets(AbstractDependencyFilterMojo.java:261)
	at org.apache.maven.plugin.dependency.fromDependencies.UnpackDependenciesMojo.doExecute(UnpackDependenciesMojo.java:84)
	at org.apache.maven.plugin.dependency.AbstractDependencyMojo.execute(AbstractDependencyMojo.java:168)
	at org.apache.maven.plugin.dependency.fromDependencies.TestUnpackDependenciesMojo.dotestArtifactExceptions(TestUnpackDependenciesMojo.java:572)
	at org.apache.maven.plugin.dependency.fromDependencies.TestUnpackDependenciesMojo.testArtifactNotFound(TestUnpackDependenciesMojo.java:551)

testCDMClassifierType(org.apache.maven.plugin.dependency.fromDependencies.TestUnpackDependenciesMojo)
 Time elapsed: 0.348 sec  <<< ERROR!
java.lang.NullPointerException: null
	at org.apache.maven.plugin.dependency.fromDependencies.AbstractDependencyFilterMojo.getClassifierTranslatedDependencies(AbstractDependencyFilterMojo.java:404)
	at org.apache.maven.plugin.dependency.fromDependencies.AbstractDependencyFilterMojo.getDependencySets(AbstractDependencyFilterMojo.java:326)
	at org.apache.maven.plugin.dependency.fromDependencies.AbstractDependencyFilterMojo.getDependencySets(AbstractDependencyFilterMojo.java:261)
	at org.apache.maven.plugin.dependency.fromDependencies.UnpackDependenciesMojo.doExecute(UnpackDependenciesMojo.java:84)
	at org.apache.maven.plugin.dependency.AbstractDependencyMojo.execute(AbstractDependencyMojo.java:168)
	at org.apache.maven.plugin.dependency.fromDependencies.TestUnpackDependenciesMojo.dotestClassifierType(TestUnpackDependenciesMojo.java:528)
	at org.apache.maven.plugin.dependency.fromDependencies.TestUnpackDependenciesMojo.testCDMClassifierType(TestUnpackDependenciesMojo.java:508)

Running org.apache.maven.plugin.dependency.fromDependencies.TestUnpackDependenciesMojo2
Tests run: 5, Failures: 0, Errors: 0, Skipped: 0, Time elapsed: 11.263 sec - in org.apache.maven.plugin.dependency.fromDependencies.TestUnpackDependenciesMojo2
Running org.apache.maven.plugin.dependency.resolvers.TestResolveMojo
Tests run: 2, Failures: 0, Errors: 0, Skipped: 0, Time elapsed: 0.165 sec - in org.apache.maven.plugin.dependency.resolvers.TestResolveMojo
Running org.apache.maven.plugin.dependency.TestGetMojo
[INFO] Resolving org.apache.maven:maven-model:jar:2.0.9 with transitive dependencies
[INFO] Resolving org.apache.maven:maven-model:jar:2.0.9
[INFO] Resolving org.apache.maven:maven-model:jar:2.0.9
Tests run: 3, Failures: 0, Errors: 0, Skipped: 0, Time elapsed: 4.341 sec - in org.apache.maven.plugin.dependency.TestGetMojo
Running org.apache.maven.plugin.dependency.TestPropertiesMojo
Tests run: 1, Failures: 0, Errors: 0, Skipped: 0, Time elapsed: 0.234 sec - in org.apache.maven.plugin.dependency.TestPropertiesMojo
Running org.apache.maven.plugin.dependency.TestSkip
Tests run: 19, Failures: 0, Errors: 0, Skipped: 0, Time elapsed: 8.175 sec - in org.apache.maven.plugin.dependency.TestSkip
Running org.apache.maven.plugin.dependency.tree.TestTreeMojo
Tests run: 1, Failures: 0, Errors: 0, Skipped: 0, Time elapsed: 0.178 sec - in org.apache.maven.plugin.dependency.tree.TestTreeMojo
Running org.apache.maven.plugin.dependency.utils.filters.TestDestFileFilter
Tests run: 8, Failures: 0, Errors: 0, Skipped: 0, Time elapsed: 0.018 sec - in org.apache.maven.plugin.dependency.utils.filters.TestDestFileFilter
Running org.apache.maven.plugin.dependency.utils.filters.TestMarkerFileFilter
Tests run: 5, Failures: 0, Errors: 0, Skipped: 0, Time elapsed: 0.012 sec - in org.apache.maven.plugin.dependency.utils.filters.TestMarkerFileFilter
Running org.apache.maven.plugin.dependency.utils.filters.TestResolveMarkerFileFilter
Tests run: 1, Failures: 0, Errors: 0, Skipped: 0, Time elapsed: 0.003 sec - in org.apache.maven.plugin.dependency.utils.filters.TestResolveMarkerFileFilter
Running org.apache.maven.plugin.dependency.utils.markers.TestDefaultMarkerFileHandler
Tests run: 6, Failures: 0, Errors: 0, Skipped: 0, Time elapsed: 0.009 sec - in org.apache.maven.plugin.dependency.utils.markers.TestDefaultMarkerFileHandler
Running org.apache.maven.plugin.dependency.utils.markers.TestSourcesMarkerFileHandler
Tests run: 10, Failures: 0, Errors: 0, Skipped: 0, Time elapsed: 0.012 sec - in org.apache.maven.plugin.dependency.utils.markers.TestSourcesMarkerFileHandler
Running org.apache.maven.plugin.dependency.utils.markers.TestUnpackMarkerFileHandler
Tests run: 9, Failures: 0, Errors: 0, Skipped: 0, Time elapsed: 1.293 sec - in org.apache.maven.plugin.dependency.utils.markers.TestUnpackMarkerFileHandler
Running org.apache.maven.plugin.dependency.utils.TestDependencyStatusSets
Tests run: 5, Failures: 0, Errors: 0, Skipped: 0, Time elapsed: 0.914 sec - in org.apache.maven.plugin.dependency.utils.TestDependencyStatusSets
Running org.apache.maven.plugin.dependency.utils.TestDependencyUtil
Tests run: 9, Failures: 0, Errors: 0, Skipped: 0, Time elapsed: 0.008 sec - in org.apache.maven.plugin.dependency.utils.TestDependencyUtil
Running org.apache.maven.plugin.dependency.utils.TestSilentLog
Tests run: 2, Failures: 0, Errors: 0, Skipped: 0, Time elapsed: 0.001 sec - in org.apache.maven.plugin.dependency.utils.TestSilentLog
Running org.apache.maven.plugin.dependency.utils.translators.TestClassifierTypeTranslator
Tests run: 6, Failures: 0, Errors: 0, Skipped: 0, Time elapsed: 1.83 sec - in org.apache.maven.plugin.dependency.utils.translators.TestClassifierTypeTranslator

Results :

Tests in error: 
  TestCopyDependenciesMojo.testArtifactResolutionException:485->dotestArtifactExceptions:501
� NullPointer
  TestCopyDependenciesMojo.testCDMClassifier:420->dotestClassifierType:446 � NullPointer
  TestCopyDependenciesMojo.testArtifactNotFound:479->dotestArtifactExceptions:501 � NullPointer
  TestCopyDependenciesMojo.testCDMClassifierType:432->dotestClassifierType:446 � NullPointer
  TestUnpackDependenciesMojo.testArtifactResolutionException:557->dotestArtifactExceptions:572
� NullPointer
  TestUnpackDependenciesMojo.testCDMClassifier:496->dotestClassifierType:528 � NullPointer
  TestUnpackDependenciesMojo.testArtifactNotFound:551->dotestArtifactExceptions:572 �
NullPointer
  TestUnpackDependenciesMojo.testCDMClassifierType:508->dotestClassifierType:528 � NullPointer

Tests run: 237, Failures: 0, Errors: 8, Skipped: 0

[ERROR] There are test failures.

Please refer to F:\jenkins\jenkins-slave\workspace\maven-plugins-windows\maven-dependency-plugin\target\surefire-reports
for the individual test results.
[JENKINS] Recording test results
[INFO] 
[INFO] --- maven-jar-plugin:2.5:jar (default-jar) @ maven-dependency-plugin ---
[INFO] Building jar: F:\jenkins\jenkins-slave\workspace\maven-plugins-windows\maven-dependency-plugin\target\maven-dependency-plugin-2.11-SNAPSHOT.jar
[INFO] 
[INFO] --- maven-plugin-plugin:3.3:addPluginArtifactMetadata (default-addPluginArtifactMetadata)
@ maven-dependency-plugin ---
[INFO] 
[INFO] --- maven-checkstyle-plugin:2.13:check (checkstyle-check) @ maven-dependency-plugin
---
[INFO] 
[INFO] There are 3 checkstyle errors.
[ERROR] DefaultArtifactsResolver.java[45] (sizes) LineLength: Line is longer than 120 characters
(found 133).

Mime
View raw message