maven-notifications mailing list archives

Site index · List index
Message view « Date » · « Thread »
Top « Date » · « Thread »
From Apache Jenkins Server <jenk...@builds.apache.org>
Subject Build failed in Jenkins: maven-plugins #3533
Date Fri, 08 May 2015 22:32:01 GMT
See <https://builds.apache.org/job/maven-plugins/3533/>

------------------------------------------
[...truncated 19290 lines...]
AU        maven-install-plugin/src/site/apt/index.apt.vm
A         maven-install-plugin/src/site/resources
A         maven-install-plugin/src/site/resources/download.cgi
A         maven-install-plugin/src/it
A         maven-install-plugin/src/it/non-changed-artifact
AU        maven-install-plugin/src/it/non-changed-artifact/invoker.properties
AU        maven-install-plugin/src/it/non-changed-artifact/verify.groovy
AU        maven-install-plugin/src/it/non-changed-artifact/pom.xml
A         maven-install-plugin/src/it/attach-jar-checksum
AU        maven-install-plugin/src/it/attach-jar-checksum/pom.xml
AU        maven-install-plugin/src/it/attach-jar-checksum/setup.bsh
AU        maven-install-plugin/src/it/attach-jar-checksum/verify.bsh
A         maven-install-plugin/src/it/MINSTALL-87
AU        maven-install-plugin/src/it/MINSTALL-87/invoker.properties
A         maven-install-plugin/src/it/install-at-end-pass
AU        maven-install-plugin/src/it/install-at-end-pass/pom.xml
A         maven-install-plugin/src/it/install-at-end-pass/module1
AU        maven-install-plugin/src/it/install-at-end-pass/module1/pom.xml
AU        maven-install-plugin/src/it/install-at-end-pass/verify.groovy
A         maven-install-plugin/src/it/MINSTALL-98
A         maven-install-plugin/src/it/MINSTALL-98/invoker.properties
A         maven-install-plugin/src/it/MINSTALL-98/verify.groovy
A         maven-install-plugin/src/it/MINSTALL-98/pom.xml
A         maven-install-plugin/src/it/MINSTALL-98/module1
A         maven-install-plugin/src/it/MINSTALL-98/module1/pom.xml
A         maven-install-plugin/src/it/MINSTALL-98/module2
A         maven-install-plugin/src/it/MINSTALL-98/module2/pom.xml
A         maven-install-plugin/src/it/MINSTALL-99
A         maven-install-plugin/src/it/MINSTALL-99/module1
A         maven-install-plugin/src/it/MINSTALL-99/module1/pom.xml
A         maven-install-plugin/src/it/MINSTALL-99/module2
A         maven-install-plugin/src/it/MINSTALL-99/module2/pom.xml
A         maven-install-plugin/src/it/MINSTALL-99/verify.groovy
A         maven-install-plugin/src/it/MINSTALL-99/pom.xml
A         maven-install-plugin/src/it/install-at-end-fail
AU        maven-install-plugin/src/it/install-at-end-fail/invoker.properties
AU        maven-install-plugin/src/it/install-at-end-fail/verify.groovy
AU        maven-install-plugin/src/it/install-at-end-fail/pom.xml
A         maven-install-plugin/src/it/install-at-end-fail/module1
AU        maven-install-plugin/src/it/install-at-end-fail/module1/pom.xml
A         maven-install-plugin/src/it/no-main-artifact-1
AU        maven-install-plugin/src/it/no-main-artifact-1/pom.xml
AU        maven-install-plugin/src/it/no-main-artifact-1/setup.bsh
AU        maven-install-plugin/src/it/no-main-artifact-1/verify.bsh
A         maven-install-plugin/src/it/generate-pom-auto-1
AU        maven-install-plugin/src/it/generate-pom-auto-1/invoker.properties
AU        maven-install-plugin/src/it/generate-pom-auto-1/pom.xml
AU        maven-install-plugin/src/it/generate-pom-auto-1/test.jar
AU        maven-install-plugin/src/it/generate-pom-auto-1/test.properties
AU        maven-install-plugin/src/it/generate-pom-auto-1/setup.bsh
AU        maven-install-plugin/src/it/generate-pom-auto-1/verify.bsh
A         maven-install-plugin/src/it/generate-pom-auto-2
AU        maven-install-plugin/src/it/generate-pom-auto-2/invoker.properties
AU        maven-install-plugin/src/it/generate-pom-auto-2/pom.xml
AU        maven-install-plugin/src/it/generate-pom-auto-2/test.jar
AU        maven-install-plugin/src/it/generate-pom-auto-2/test.properties
AU        maven-install-plugin/src/it/generate-pom-auto-2/setup.bsh
AU        maven-install-plugin/src/it/generate-pom-auto-2/verify.bsh
A         maven-install-plugin/src/it/no-main-artifact-2
AU        maven-install-plugin/src/it/no-main-artifact-2/verify.bsh
AU        maven-install-plugin/src/it/no-main-artifact-2/pom.xml
AU        maven-install-plugin/src/it/no-main-artifact-2/setup.bsh
A         maven-install-plugin/src/it/snapshot-pom
AU        maven-install-plugin/src/it/snapshot-pom/pom.xml
AU        maven-install-plugin/src/it/snapshot-pom/setup.bsh
AU        maven-install-plugin/src/it/snapshot-pom/verify.bsh
A         maven-install-plugin/src/it/MINSTALL-108
A         maven-install-plugin/src/it/MINSTALL-108/pom.xml
A         maven-install-plugin/src/it/MINSTALL-108/test.properties
A         maven-install-plugin/src/it/MINSTALL-108/module1
A         maven-install-plugin/src/it/MINSTALL-108/module1/pom.xml
A         maven-install-plugin/src/it/MINSTALL-108/invoker.properties
A         maven-install-plugin/src/it/MINSTALL-108/verify.groovy
A         maven-install-plugin/src/it/release-jar
AU        maven-install-plugin/src/it/release-jar/verify.bsh
AU        maven-install-plugin/src/it/release-jar/pom.xml
AU        maven-install-plugin/src/it/release-jar/setup.bsh
A         maven-install-plugin/src/it/pom-checksum
AU        maven-install-plugin/src/it/pom-checksum/setup.bsh
AU        maven-install-plugin/src/it/pom-checksum/verify.bsh
AU        maven-install-plugin/src/it/pom-checksum/pom.xml
A         maven-install-plugin/src/it/attach-release-jar
AU        maven-install-plugin/src/it/attach-release-jar/verify.bsh
AU        maven-install-plugin/src/it/attach-release-jar/pom.xml
AU        maven-install-plugin/src/it/attach-release-jar/setup.bsh
AU        maven-install-plugin/src/it/settings.xml
A         maven-install-plugin/src/it/jar-sources-javadoc
AU        maven-install-plugin/src/it/jar-sources-javadoc/sources.jar
AU        maven-install-plugin/src/it/jar-sources-javadoc/verify.bsh
AU        maven-install-plugin/src/it/jar-sources-javadoc/javadoc.jar
AU        maven-install-plugin/src/it/jar-sources-javadoc/invoker.properties
AU        maven-install-plugin/src/it/jar-sources-javadoc/pom.xml
AU        maven-install-plugin/src/it/jar-sources-javadoc/test.jar
AU        maven-install-plugin/src/it/jar-sources-javadoc/test.properties
AU        maven-install-plugin/src/it/jar-sources-javadoc/setup.bsh
A         maven-install-plugin/src/it/non-default-pom
AU        maven-install-plugin/src/it/non-default-pom/verify.bsh
AU        maven-install-plugin/src/it/non-default-pom/non-default-pom.xml
AU        maven-install-plugin/src/it/non-default-pom/setup.bsh
A         maven-install-plugin/src/it/gav-validation
AU        maven-install-plugin/src/it/gav-validation/verify.bsh
AU        maven-install-plugin/src/it/gav-validation/invoker.properties
AU        maven-install-plugin/src/it/gav-validation/pom.xml
AU        maven-install-plugin/src/it/gav-validation/test.jar
AU        maven-install-plugin/src/it/gav-validation/test.properties
AU        maven-install-plugin/src/it/gav-validation/setup.bsh
A         maven-install-plugin/src/it/MINSTALL-52
AU        maven-install-plugin/src/it/MINSTALL-52/invoker.properties
AU        maven-install-plugin/src/it/MINSTALL-52/verify.groovy
AU        maven-install-plugin/src/it/MINSTALL-52/pom.xml
AU        maven-install-plugin/src/it/MINSTALL-52/test.properties
A         maven-install-plugin/src/it/snapshot-jar
AU        maven-install-plugin/src/it/snapshot-jar/verify.bsh
AU        maven-install-plugin/src/it/snapshot-jar/pom.xml
AU        maven-install-plugin/src/it/snapshot-jar/setup.bsh
A         maven-install-plugin/src/it/release-pom
AU        maven-install-plugin/src/it/release-pom/pom.xml
AU        maven-install-plugin/src/it/release-pom/setup.bsh
AU        maven-install-plugin/src/it/release-pom/verify.bsh
A         maven-install-plugin/src/it/skip-install
AU        maven-install-plugin/src/it/skip-install/pom.xml
AU        maven-install-plugin/src/it/skip-install/setup.bsh
AU        maven-install-plugin/src/it/skip-install/verify.bsh
A         maven-install-plugin/src/it/local-repo-override
AU        maven-install-plugin/src/it/local-repo-override/invoker.properties
AU        maven-install-plugin/src/it/local-repo-override/pom.xml
AU        maven-install-plugin/src/it/local-repo-override/test.jar
AU        maven-install-plugin/src/it/local-repo-override/test.properties
AU        maven-install-plugin/src/it/local-repo-override/setup.bsh
AU        maven-install-plugin/src/it/local-repo-override/verify.bsh
A         maven-install-plugin/src/it/minstall-55
AU        maven-install-plugin/src/it/minstall-55/verify.bsh
AU        maven-install-plugin/src/it/minstall-55/test-0.1.pom
AU        maven-install-plugin/src/it/minstall-55/test-0.1.jar
AU        maven-install-plugin/src/it/minstall-55/invoker.properties
AU        maven-install-plugin/src/it/minstall-55/pom.xml
AU        maven-install-plugin/src/it/minstall-55/test.properties
AU        maven-install-plugin/src/it/minstall-55/setup.bsh
A         maven-install-plugin/src/test
A         maven-install-plugin/src/test/java
A         maven-install-plugin/src/test/java/org
A         maven-install-plugin/src/test/java/org/apache
A         maven-install-plugin/src/test/java/org/apache/maven
A         maven-install-plugin/src/test/java/org/apache/maven/plugin
A         maven-install-plugin/src/test/java/org/apache/maven/plugin/install
AU        maven-install-plugin/src/test/java/org/apache/maven/plugin/install/InstallFileMojoTest.java
AU        maven-install-plugin/src/test/java/org/apache/maven/plugin/install/InstallMojoTest.java
AU        maven-install-plugin/src/test/java/org/apache/maven/plugin/install/DualDigesterTest.java
AU        maven-install-plugin/src/test/java/org/apache/maven/plugin/install/SimpleDigester.java
AU        maven-install-plugin/src/test/java/org/apache/maven/plugin/install/Utils.java
A         maven-install-plugin/src/test/java/org/apache/maven/plugin/install/stubs
AU        maven-install-plugin/src/test/java/org/apache/maven/plugin/install/stubs/InstallArtifactStub.java
AU        maven-install-plugin/src/test/java/org/apache/maven/plugin/install/stubs/AttachedArtifactStub0.java
AU        maven-install-plugin/src/test/java/org/apache/maven/plugin/install/stubs/AttachedArtifactStub1.java
A         maven-install-plugin/src/test/resources
A         maven-install-plugin/src/test/resources/unit
A         maven-install-plugin/src/test/resources/unit/configured-install-test
A         maven-install-plugin/src/test/resources/unit/configured-install-test/target
AU        maven-install-plugin/src/test/resources/unit/configured-install-test/target/maven-install-test-1.0-SNAPSHOT.jar
AU        maven-install-plugin/src/test/resources/unit/configured-install-test/plugin-config.xml
A         maven-install-plugin/src/test/resources/unit/install-file-with-pom-as-packaging
AU        maven-install-plugin/src/test/resources/unit/install-file-with-pom-as-packaging/plugin-config.xml
A         maven-install-plugin/src/test/resources/unit/install-file-layout-test
A         maven-install-plugin/src/test/resources/unit/install-file-layout-test/target
AU        maven-install-plugin/src/test/resources/unit/install-file-layout-test/target/maven-install-test-1.0-SNAPSHOT.jar
AU        maven-install-plugin/src/test/resources/unit/install-file-layout-test/plugin-config.xml
A         maven-install-plugin/src/test/resources/unit/install-file-with-checksum
AU        maven-install-plugin/src/test/resources/unit/install-file-with-checksum/plugin-config.xml
AU        maven-install-plugin/src/test/resources/unit/install-file-with-checksum/maven-test-jar.jar
A         maven-install-plugin/src/test/resources/unit/basic-install-test-packaging-pom
AU        maven-install-plugin/src/test/resources/unit/basic-install-test-packaging-pom/plugin-config.xml
A         maven-install-plugin/src/test/resources/unit/install-file-with-classifier
A         maven-install-plugin/src/test/resources/unit/install-file-with-classifier/target
AU        maven-install-plugin/src/test/resources/unit/install-file-with-classifier/target/maven-install-test-1.0-SNAPSHOT.jar
AU        maven-install-plugin/src/test/resources/unit/install-file-with-classifier/plugin-config.xml
A         maven-install-plugin/src/test/resources/unit/install-file-basic-test
A         maven-install-plugin/src/test/resources/unit/install-file-basic-test/target
AU        maven-install-plugin/src/test/resources/unit/install-file-basic-test/target/maven-install-test-1.0-SNAPSHOT.jar
AU        maven-install-plugin/src/test/resources/unit/install-file-basic-test/plugin-config.xml
A         maven-install-plugin/src/test/resources/unit/basic-install-test
AU        maven-install-plugin/src/test/resources/unit/basic-install-test/plugin-config.xml
A         maven-install-plugin/src/test/resources/unit/basic-install-test/target
AU        maven-install-plugin/src/test/resources/unit/basic-install-test/target/maven-install-test-1.0-SNAPSHOT.jar
A         maven-install-plugin/src/test/resources/unit/install-file-with-pomFile-test
AU        maven-install-plugin/src/test/resources/unit/install-file-with-pomFile-test/plugin-config.xml
A         maven-install-plugin/src/test/resources/unit/install-file-with-pomFile-test/target
AU        maven-install-plugin/src/test/resources/unit/install-file-with-pomFile-test/target/maven-install-test-1.0-SNAPSHOT.jar
A         maven-install-plugin/src/test/resources/unit/basic-install-test-with-attached-artifacts
AU        maven-install-plugin/src/test/resources/unit/basic-install-test-with-attached-artifacts/plugin-config.xml
A         maven-install-plugin/src/test/resources/unit/basic-install-test-with-attached-artifacts/target
AU        maven-install-plugin/src/test/resources/unit/basic-install-test-with-attached-artifacts/target/maven-install-test-1.0-SNAPSHOT.jar
A         maven-install-plugin/src/test/resources/unit/install-file-test-generatePom
AU        maven-install-plugin/src/test/resources/unit/install-file-test-generatePom/plugin-config.xml
A         maven-install-plugin/src/test/resources/unit/install-file-test-generatePom/target
AU        maven-install-plugin/src/test/resources/unit/install-file-test-generatePom/target/maven-install-test-1.0-SNAPSHOT.jar
A         maven-install-plugin/src/test/resources/unit/basic-install-checksum
AU        maven-install-plugin/src/test/resources/unit/basic-install-checksum/maven-test-jar.jar
AU        maven-install-plugin/src/test/resources/unit/basic-install-checksum/plugin-config.xml
AU        maven-install-plugin/pom.xml
AU        maven-install-plugin/NOTICE
AU        maven-install-plugin/LICENSE
 U        .
At revision 1678453
no change for http://svn.apache.org/repos/asf/maven/plugins/trunk since the previous build
Parsing POMs
Downloaded artifact http://repository.apache.org/snapshots/org/apache/maven/maven-parent/27-SNAPSHOT/maven-metadata.xml
Downloaded artifact http://repository.apache.org/snapshots/org/apache/maven/maven-parent/27-SNAPSHOT/maven-parent-27-20150508.221635-790.pom
Failed to transfer Could not find metadata org.apache:apache:17-SNAPSHOT/maven-metadata.xml
in Nexus (http://repository.apache.org/snapshots)
Failed to transfer Could not find artifact org.apache:apache:pom:17-SNAPSHOT in Nexus (http://repository.apache.org/snapshots)
Downloaded artifact http://repo.maven.apache.org/maven2/org/apache/maven/plugins/maven-plugins/27/maven-plugins-27.pom
Downloaded artifact http://repo.maven.apache.org/maven2/org/apache/maven/maven-parent/26/maven-parent-26.pom
Downloaded artifact http://repo.maven.apache.org/maven2/org/apache/apache/16/apache-16.pom
Downloaded artifact http://repo.maven.apache.org/maven2/org/apache/maven/plugins/maven-plugins/26/maven-plugins-26.pom
Downloaded artifact http://repo.maven.apache.org/maven2/org/apache/maven/maven-parent/25/maven-parent-25.pom
Downloaded artifact http://repo.maven.apache.org/maven2/org/apache/apache/15/apache-15.pom
ERROR: Failed to parse POMs
java.io.IOException: remote file operation failed: <https://builds.apache.org/job/maven-plugins/ws/>
at hudson.remoting.Channel@5cd99e12:jenkins-ubuntu-1404-4gb-800
	at hudson.FilePath.act(FilePath.java:916)
	at hudson.FilePath.act(FilePath.java:893)
	at hudson.maven.MavenModuleSetBuild$MavenModuleSetBuildExecution.parsePoms(MavenModuleSetBuild.java:950)
	at hudson.maven.MavenModuleSetBuild$MavenModuleSetBuildExecution.doRun(MavenModuleSetBuild.java:677)
	at hudson.model.AbstractBuild$AbstractBuildExecution.run(AbstractBuild.java:529)
	at hudson.model.Run.execute(Run.java:1706)
	at hudson.maven.MavenModuleSetBuild.run(MavenModuleSetBuild.java:529)
	at hudson.model.ResourceController.execute(ResourceController.java:88)
	at hudson.model.Executor.run(Executor.java:232)
Caused by: hudson.remoting.ProxyException: hudson.maven.MavenModuleSetBuild$MavenExecutionException:
org.apache.maven.project.ProjectBuildingException: Some problems were encountered while processing
the POMs:
[FATAL] Non-resolvable parent POM for org.apache.maven:maven-parent:27-SNAPSHOT: Could not
find artifact org.apache:apache:pom:17-SNAPSHOT in Nexus (http://repository.apache.org/snapshots)
@ org.apache.maven:maven-parent:27-SNAPSHOT, /jenkins/maven-repositories/0/org/apache/maven/maven-parent/27-SNAPSHOT/maven-parent-27-SNAPSHOT.pom,
line 26, column 11

	at hudson.maven.MavenModuleSetBuild$PomParser.invoke(MavenModuleSetBuild.java:1354)
	at hudson.maven.MavenModuleSetBuild$PomParser.invoke(MavenModuleSetBuild.java:1088)
	at hudson.FilePath$FileCallableWrapper.call(FilePath.java:2474)
	at hudson.remoting.UserRequest.perform(UserRequest.java:118)
	at hudson.remoting.UserRequest.perform(UserRequest.java:48)
	at hudson.remoting.Request$2.run(Request.java:328)
	at hudson.remoting.InterceptingExecutorService$1.call(InterceptingExecutorService.java:72)
	at java.util.concurrent.FutureTask.run(FutureTask.java:262)
	at java.util.concurrent.ThreadPoolExecutor.runWorker(ThreadPoolExecutor.java:1145)
	at java.util.concurrent.ThreadPoolExecutor$Worker.run(ThreadPoolExecutor.java:615)
	at java.lang.Thread.run(Thread.java:745)
Caused by: hudson.remoting.ProxyException: org.apache.maven.project.ProjectBuildingException:
Some problems were encountered while processing the POMs:
[FATAL] Non-resolvable parent POM for org.apache.maven:maven-parent:27-SNAPSHOT: Could not
find artifact org.apache:apache:pom:17-SNAPSHOT in Nexus (http://repository.apache.org/snapshots)
@ org.apache.maven:maven-parent:27-SNAPSHOT, /jenkins/maven-repositories/0/org/apache/maven/maven-parent/27-SNAPSHOT/maven-parent-27-SNAPSHOT.pom,
line 26, column 11

	at org.apache.maven.project.DefaultProjectBuilder.build(DefaultProjectBuilder.java:364)
	at hudson.maven.MavenEmbedder.buildProjects(MavenEmbedder.java:361)
	at hudson.maven.MavenEmbedder.readProjects(MavenEmbedder.java:331)
	at hudson.maven.MavenModuleSetBuild$PomParser.invoke(MavenModuleSetBuild.java:1291)
	... 10 more
[WARNINGS] Skipping publisher since build result is FAILURE

Mime
View raw message