maven-notifications mailing list archives

Site index · List index
Message view « Date » · « Thread »
Top « Date » · « Thread »
From Apache Jenkins Server <jenk...@builds.apache.org>
Subject Build failed in Jenkins: maven-plugins #3681
Date Fri, 29 May 2015 21:44:07 GMT
See <https://builds.apache.org/job/maven-plugins/3681/changes>

Changes:

[khmarbaise] [MSHADE-183] Getting "Error creating shaded jar: java.util.jar.Attributes
Added an appropriate IT and applied the given patch

------------------------------------------
Started by an SCM change
Building remotely on ubuntu-6 (docker Ubuntu ubuntu) in workspace <https://builds.apache.org/job/maven-plugins/ws/>
Updating http://svn.apache.org/repos/asf/maven/plugins/trunk at revision '2015-05-29T21:42:38.573
+0000'
U         maven-shade-plugin/src/main/java/org/apache/maven/plugins/shade/resource/ManifestResourceTransformer.java
A         maven-shade-plugin/src/it/MSHADE-183
A         maven-shade-plugin/src/it/MSHADE-183/verify.bsh
A         maven-shade-plugin/src/it/MSHADE-183/pom.xml
U         maven-shade-plugin/pom.xml
U         maven-dependency-plugin/src/site/apt/examples/copying-artifacts.apt.vm
U         maven-assembly-plugin/src/site/apt/index.apt.vm
U         maven-assembly-plugin/pom.xml
A         maven-pmd-plugin/src/it/MPMD-205-pmd-js-check
A         maven-pmd-plugin/src/it/MPMD-205-pmd-js-check/src
A         maven-pmd-plugin/src/it/MPMD-205-pmd-js-check/src/main
A         maven-pmd-plugin/src/it/MPMD-205-pmd-js-check/src/main/javascript
A         maven-pmd-plugin/src/it/MPMD-205-pmd-js-check/src/main/javascript/PmdJsCheck.js
A         maven-pmd-plugin/src/it/MPMD-205-pmd-js-check/invoker.properties
A         maven-pmd-plugin/src/it/MPMD-205-pmd-js-check/verify.groovy
A         maven-pmd-plugin/src/it/MPMD-205-pmd-js-check/pom.xml
U         maven-pmd-plugin/src/test/java/org/apache/maven/plugin/pmd/CpdReportTest.java
A         maven-pmd-plugin/src/test/resources/unit/default-configuration/jsp/sampleDup.jsp
U         maven-pmd-plugin/src/test/resources/unit/default-configuration/pmd-check-cpd-exclusions-configuration-plugin-config.xml
A         maven-pmd-plugin/src/test/resources/unit/default-configuration/cpd-jsp-plugin-config.xml
U         maven-pmd-plugin/src/test/resources/unit/default-configuration/pmd-check-failonpriority-plugin-config.xml
U         maven-pmd-plugin/src/test/resources/unit/default-configuration/pmd-check-notfailonviolation-plugin-config.xml
U         maven-pmd-plugin/src/test/resources/unit/default-configuration/pmd-check-pmd-exclusions-configuration-plugin-config.xml
A         maven-pmd-plugin/src/test/resources/unit/default-configuration/cpd-javascript-plugin-config.xml
A         maven-pmd-plugin/src/test/resources/unit/default-configuration/js/SampleDup.js
U         maven-pmd-plugin/src/test/resources/unit/default-configuration/pmd-check-failandwarnonpriority-plugin-config.xml
U         maven-pmd-plugin/src/main/java/org/apache/maven/plugin/pmd/CpdReportGenerator.java
U         maven-pmd-plugin/src/main/java/org/apache/maven/plugin/pmd/AbstractPmdViolationCheckMojo.java
U         maven-pmd-plugin/src/main/java/org/apache/maven/plugin/pmd/PmdReport.java
U         maven-pmd-plugin/src/main/java/org/apache/maven/plugin/pmd/CpdReport.java
U         maven-pmd-plugin/pom.xml
U         maven-antrun-plugin/src/main/java/org/apache/maven/plugin/antrun/AntRunMojo.java
AU        maven-antrun-plugin/src/main/java/org/apache/maven/plugin/antrun/MavenLogger.java
At revision 1682555
Parsing POMs
Downloaded artifact http://repository.apache.org/snapshots/org/apache/maven/maven-parent/27-SNAPSHOT/maven-metadata.xml
Downloaded artifact http://repository.apache.org/snapshots/org/apache/maven/maven-parent/27-SNAPSHOT/maven-parent-27-20150529.132015-928.pom
Failed to transfer Could not find metadata org.apache:apache:17-SNAPSHOT/maven-metadata.xml
in Nexus (http://repository.apache.org/snapshots)
Failed to transfer Could not find artifact org.apache:apache:pom:17-SNAPSHOT in Nexus (http://repository.apache.org/snapshots)
ERROR: Failed to parse POMs
java.io.IOException: remote file operation failed: <https://builds.apache.org/job/maven-plugins/ws/>
at hudson.remoting.Channel@7ddeadfa:ubuntu-6
	at hudson.FilePath.act(FilePath.java:916)
	at hudson.FilePath.act(FilePath.java:893)
	at hudson.maven.MavenModuleSetBuild$MavenModuleSetBuildExecution.parsePoms(MavenModuleSetBuild.java:950)
	at hudson.maven.MavenModuleSetBuild$MavenModuleSetBuildExecution.doRun(MavenModuleSetBuild.java:677)
	at hudson.model.AbstractBuild$AbstractBuildExecution.run(AbstractBuild.java:529)
	at hudson.model.Run.execute(Run.java:1706)
	at hudson.maven.MavenModuleSetBuild.run(MavenModuleSetBuild.java:529)
	at hudson.model.ResourceController.execute(ResourceController.java:88)
	at hudson.model.Executor.run(Executor.java:232)
Caused by: hudson.remoting.ProxyException: hudson.maven.MavenModuleSetBuild$MavenExecutionException:
org.apache.maven.project.ProjectBuildingException: Some problems were encountered while processing
the POMs:
[FATAL] Non-resolvable parent POM for org.apache.maven:maven-parent:27-SNAPSHOT: Could not
find artifact org.apache:apache:pom:17-SNAPSHOT in Nexus (http://repository.apache.org/snapshots)
@ org.apache.maven:maven-parent:27-SNAPSHOT, /home/jenkins/jenkins-slave/maven-repositories/0/org/apache/maven/maven-parent/27-SNAPSHOT/maven-parent-27-SNAPSHOT.pom,
line 26, column 11

	at hudson.maven.MavenModuleSetBuild$PomParser.invoke(MavenModuleSetBuild.java:1354)
	at hudson.maven.MavenModuleSetBuild$PomParser.invoke(MavenModuleSetBuild.java:1088)
	at hudson.FilePath$FileCallableWrapper.call(FilePath.java:2474)
	at hudson.remoting.UserRequest.perform(UserRequest.java:118)
	at hudson.remoting.UserRequest.perform(UserRequest.java:48)
	at hudson.remoting.Request$2.run(Request.java:328)
	at hudson.remoting.InterceptingExecutorService$1.call(InterceptingExecutorService.java:72)
	at java.util.concurrent.FutureTask.run(FutureTask.java:262)
	at java.util.concurrent.ThreadPoolExecutor.runWorker(ThreadPoolExecutor.java:1145)
	at java.util.concurrent.ThreadPoolExecutor$Worker.run(ThreadPoolExecutor.java:615)
	at java.lang.Thread.run(Thread.java:745)
Caused by: hudson.remoting.ProxyException: org.apache.maven.project.ProjectBuildingException:
Some problems were encountered while processing the POMs:
[FATAL] Non-resolvable parent POM for org.apache.maven:maven-parent:27-SNAPSHOT: Could not
find artifact org.apache:apache:pom:17-SNAPSHOT in Nexus (http://repository.apache.org/snapshots)
@ org.apache.maven:maven-parent:27-SNAPSHOT, /home/jenkins/jenkins-slave/maven-repositories/0/org/apache/maven/maven-parent/27-SNAPSHOT/maven-parent-27-SNAPSHOT.pom,
line 26, column 11

	at org.apache.maven.project.DefaultProjectBuilder.build(DefaultProjectBuilder.java:364)
	at hudson.maven.MavenEmbedder.buildProjects(MavenEmbedder.java:361)
	at hudson.maven.MavenEmbedder.readProjects(MavenEmbedder.java:331)
	at hudson.maven.MavenModuleSetBuild$PomParser.invoke(MavenModuleSetBuild.java:1291)
	... 10 more
[WARNINGS] Skipping publisher since build result is FAILURE

Mime
View raw message