maven-notifications mailing list archives

Site index · List index
Message view « Date » · « Thread »
Top « Date » · « Thread »
From Apache Jenkins Server <jenk...@builds.apache.org>
Subject Build failed in Jenkins: maven-plugins-ITs-m2 #2076
Date Fri, 29 May 2015 12:16:28 GMT
See <https://builds.apache.org/job/maven-plugins-ITs-m2/2076/changes>

Changes:

[dennisl] [MPMD-207] Support Javascript and JSP for CPD, closes apache/maven-plugins#48
Submitted by: Andreas Dangel
Reviewed by: Dennis Lundberg

[olamy] Move logs from java.lang.System.out to org.apache.maven.plugin.logging.Log

[olamy] Move plugin configuration outside executions

As described by Ron Wheeler at:
http://mail-archives.apache.org/mod_mbox/maven-users/201505.mbox/%3C554C33D1.3000502%40artifact-software.com%3E

------------------------------------------
[...truncated 19313 lines...]
AU        maven-shade-plugin/src/test/java/org/apache/maven/plugins/shade/DefaultShaderTest.java
A         maven-shade-plugin/src/test/java/org/apache/maven/plugins/shade/relocation
AU        maven-shade-plugin/src/test/java/org/apache/maven/plugins/shade/relocation/SimpleRelocatorTest.java
AU        maven-shade-plugin/src/test/java/org/apache/maven/plugins/shade/relocation/SimpleRelocatorParameterTest.java
AU        maven-shade-plugin/src/test/java/org/apache/maven/plugins/shade/MockShader.java
A         maven-shade-plugin/src/test/java/org/apache/maven/plugins/shade/mojo
AU        maven-shade-plugin/src/test/java/org/apache/maven/plugins/shade/mojo/ArtifactSelectorTest.java
AU        maven-shade-plugin/src/test/java/org/apache/maven/plugins/shade/mojo/ShadeMojoTest.java
AU        maven-shade-plugin/src/test/java/org/apache/maven/plugins/shade/mojo/ArtifactIdTest.java
AU        maven-shade-plugin/src/test/java/org/apache/maven/plugins/shade/mojo/RelativizePathTest.java
A         maven-shade-plugin/src/test/java/org/apache/maven/plugins/shade/filter
AU        maven-shade-plugin/src/test/java/org/apache/maven/plugins/shade/filter/SimpleFilterTest.java
A         maven-shade-plugin/src/test/projects
A         maven-shade-plugin/src/test/projects/test-project
A         maven-shade-plugin/src/test/projects/test-project/src
A         maven-shade-plugin/src/test/projects/test-project/src/test
A         maven-shade-plugin/src/test/projects/test-project/src/test/java
A         maven-shade-plugin/src/test/projects/test-project/src/test/java/org
A         maven-shade-plugin/src/test/projects/test-project/src/test/java/org/apache
A         maven-shade-plugin/src/test/projects/test-project/src/test/java/org/apache/maven
A         maven-shade-plugin/src/test/projects/test-project/src/test/java/org/apache/maven/plugins
A         maven-shade-plugin/src/test/projects/test-project/src/test/java/org/apache/maven/plugins/shade
AU        maven-shade-plugin/src/test/projects/test-project/src/test/java/org/apache/maven/plugins/shade/AppTest.java
A         maven-shade-plugin/src/test/projects/test-project/src/main
A         maven-shade-plugin/src/test/projects/test-project/src/main/java
A         maven-shade-plugin/src/test/projects/test-project/src/main/java/org
A         maven-shade-plugin/src/test/projects/test-project/src/main/java/org/apache
A         maven-shade-plugin/src/test/projects/test-project/src/main/java/org/apache/maven
A         maven-shade-plugin/src/test/projects/test-project/src/main/java/org/apache/maven/plugins
A         maven-shade-plugin/src/test/projects/test-project/src/main/java/org/apache/maven/plugins/shade
AU        maven-shade-plugin/src/test/projects/test-project/src/main/java/org/apache/maven/plugins/shade/App.java
A         maven-shade-plugin/src/test/projects/test-project/src/main/resources
A         maven-shade-plugin/src/test/projects/test-project/src/main/resources/META-INF
A         maven-shade-plugin/src/test/projects/test-project/src/main/resources/META-INF/plexus
AU        maven-shade-plugin/src/test/projects/test-project/src/main/resources/META-INF/plexus/components.xml
AU        maven-shade-plugin/src/test/projects/test-project/pom.xml
A         maven-shade-plugin/src/test/projects/shaded-renamed-project
AU        maven-shade-plugin/src/test/projects/shaded-renamed-project/pom.xml
A         maven-shade-plugin/src/test/projects/shaded-attached-project
AU        maven-shade-plugin/src/test/projects/shaded-attached-project/pom.xml
AU        maven-shade-plugin/src/test/projects/pom.xml
A         maven-shade-plugin/src/test/projects/test-artifact
A         maven-shade-plugin/src/test/projects/test-artifact/src
A         maven-shade-plugin/src/test/projects/test-artifact/src/main
A         maven-shade-plugin/src/test/projects/test-artifact/src/main/java
A         maven-shade-plugin/src/test/projects/test-artifact/src/main/java/org
A         maven-shade-plugin/src/test/projects/test-artifact/src/main/java/org/apache
A         maven-shade-plugin/src/test/projects/test-artifact/src/main/java/org/apache/maven
A         maven-shade-plugin/src/test/projects/test-artifact/src/main/java/org/apache/maven/plugins
A         maven-shade-plugin/src/test/projects/test-artifact/src/main/java/org/apache/maven/plugins/shade
AU        maven-shade-plugin/src/test/projects/test-artifact/src/main/java/org/apache/maven/plugins/shade/Lib.java
AU        maven-shade-plugin/src/test/projects/test-artifact/pom.xml
A         maven-shade-plugin/src/test/projects/default-config-project
AU        maven-shade-plugin/src/test/projects/default-config-project/pom.xml
A         maven-shade-plugin/src/test/projects/shaded-project
AU        maven-shade-plugin/src/test/projects/shaded-project/pom.xml
A         maven-shade-plugin/src/test/projects/no-relocation-project
AU        maven-shade-plugin/src/test/projects/no-relocation-project/pom.xml
A         maven-shade-plugin/src/test/resources
AU        maven-shade-plugin/src/test/resources/components-1.xml
AU        maven-shade-plugin/src/test/resources/components-2.xml
AU        maven-shade-plugin/src/test/resources/components-expected.xml
A         maven-shade-plugin/src/test/jars
AU        maven-shade-plugin/src/test/jars/test-artifact-1.0-SNAPSHOT.jar
AU        maven-shade-plugin/src/test/jars/test-project-1.0-SNAPSHOT.jar
AU        maven-shade-plugin/src/test/jars/plexus-utils-1.4.1.jar
A         maven-shade-plugin/src/main
A         maven-shade-plugin/src/main/java
A         maven-shade-plugin/src/main/java/org
A         maven-shade-plugin/src/main/java/org/apache
A         maven-shade-plugin/src/main/java/org/apache/maven
A         maven-shade-plugin/src/main/java/org/apache/maven/plugins
A         maven-shade-plugin/src/main/java/org/apache/maven/plugins/shade
A         maven-shade-plugin/src/main/java/org/apache/maven/plugins/shade/relocation
AU        maven-shade-plugin/src/main/java/org/apache/maven/plugins/shade/relocation/SimpleRelocator.java
AU        maven-shade-plugin/src/main/java/org/apache/maven/plugins/shade/relocation/Relocator.java
A         maven-shade-plugin/src/main/java/org/apache/maven/plugins/shade/mojo
AU        maven-shade-plugin/src/main/java/org/apache/maven/plugins/shade/mojo/ArchiveFilter.java
AU        maven-shade-plugin/src/main/java/org/apache/maven/plugins/shade/mojo/ArtifactSet.java
AU        maven-shade-plugin/src/main/java/org/apache/maven/plugins/shade/mojo/ShadeMojo.java
AU        maven-shade-plugin/src/main/java/org/apache/maven/plugins/shade/mojo/ArtifactId.java
AU        maven-shade-plugin/src/main/java/org/apache/maven/plugins/shade/mojo/PackageRelocation.java
AU        maven-shade-plugin/src/main/java/org/apache/maven/plugins/shade/mojo/RelativizePath.java
AU        maven-shade-plugin/src/main/java/org/apache/maven/plugins/shade/mojo/ArtifactSelector.java
A         maven-shade-plugin/src/main/java/org/apache/maven/plugins/shade/filter
AU        maven-shade-plugin/src/main/java/org/apache/maven/plugins/shade/filter/MinijarFilter.java
AU        maven-shade-plugin/src/main/java/org/apache/maven/plugins/shade/filter/SimpleFilter.java
AU        maven-shade-plugin/src/main/java/org/apache/maven/plugins/shade/filter/Filter.java
AU        maven-shade-plugin/src/main/java/org/apache/maven/plugins/shade/Shader.java
A         maven-shade-plugin/src/main/java/org/apache/maven/plugins/shade/resource
AU        maven-shade-plugin/src/main/java/org/apache/maven/plugins/shade/resource/DontIncludeResourceTransformer.java
AU        maven-shade-plugin/src/main/java/org/apache/maven/plugins/shade/resource/AppendingTransformer.java
AU        maven-shade-plugin/src/main/java/org/apache/maven/plugins/shade/resource/XmlAppendingTransformer.java
A         maven-shade-plugin/src/main/java/org/apache/maven/plugins/shade/resource/PluginXmlResourceTransformer.java
AU        maven-shade-plugin/src/main/java/org/apache/maven/plugins/shade/resource/ResourceTransformer.java
AU        maven-shade-plugin/src/main/java/org/apache/maven/plugins/shade/resource/ApacheNoticeResourceTransformer.java
AU        maven-shade-plugin/src/main/java/org/apache/maven/plugins/shade/resource/IncludeResourceTransformer.java
AU        maven-shade-plugin/src/main/java/org/apache/maven/plugins/shade/resource/ServicesResourceTransformer.java
AU        maven-shade-plugin/src/main/java/org/apache/maven/plugins/shade/resource/ApacheLicenseResourceTransformer.java
AU        maven-shade-plugin/src/main/java/org/apache/maven/plugins/shade/resource/ComponentsXmlResourceTransformer.java
AU        maven-shade-plugin/src/main/java/org/apache/maven/plugins/shade/resource/ManifestResourceTransformer.java
AU        maven-shade-plugin/src/main/java/org/apache/maven/plugins/shade/DefaultShader.java
A         maven-shade-plugin/src/main/java/org/apache/maven/plugins/shade/pom
AU        maven-shade-plugin/src/main/java/org/apache/maven/plugins/shade/pom/MavenJDOMWriter.java
AU        maven-shade-plugin/src/main/java/org/apache/maven/plugins/shade/pom/PomWriter.java
AU        maven-shade-plugin/src/main/java/org/apache/maven/plugins/shade/ShadeConfiguration.java
AU        maven-shade-plugin/src/main/java/org/apache/maven/plugins/shade/ShadingResult.java
AU        maven-shade-plugin/src/main/java/org/apache/maven/plugins/shade/ShadeRequest.java
A         maven-shade-plugin/src/site
A         maven-shade-plugin/src/site/fml
A         maven-shade-plugin/src/site/fml/faq.fml
AU        maven-shade-plugin/src/site/site.xml
A         maven-shade-plugin/src/site/apt
A         maven-shade-plugin/src/site/apt/examples
AU        maven-shade-plugin/src/site/apt/examples/attached-artifact.apt.vm
AU        maven-shade-plugin/src/site/apt/examples/resource-transformers.apt.vm
AU        maven-shade-plugin/src/site/apt/examples/executable-jar.apt.vm
AU        maven-shade-plugin/src/site/apt/examples/use-shader-other-impl.apt.vm
AU        maven-shade-plugin/src/site/apt/examples/includes-excludes.apt.vm
AU        maven-shade-plugin/src/site/apt/examples/class-relocation.apt.vm
AU        maven-shade-plugin/src/site/apt/usage.apt.vm
AU        maven-shade-plugin/src/site/apt/index.apt.vm
A         maven-shade-plugin/src/site/resources
A         maven-shade-plugin/src/site/resources/download.cgi
A         maven-shade-plugin/src/site/xdoc
A         maven-shade-plugin/src/site/xdoc/download.xml.vm
A         maven-shade-plugin/rel-path-test-files
A         maven-shade-plugin/rel-path-test-files/a
A         maven-shade-plugin/rel-path-test-files/a/pom
A         maven-shade-plugin/rel-path-test-files/a/b
A         maven-shade-plugin/rel-path-test-files/a/b/pom
A         maven-shade-plugin/rel-path-test-files/a/b/c
A         maven-shade-plugin/rel-path-test-files/a/b/c/d
A         maven-shade-plugin/rel-path-test-files/a/b/c/d/pom
A         maven-shade-plugin/rel-path-test-files/a/b/c/d1
A         maven-shade-plugin/rel-path-test-files/a/b/c/d1/pom
A         maven-shade-plugin/rel-path-test-files/a/b/c/pom
A         maven-shade-plugin/rel-path-test-files/a/b/c1
A         maven-shade-plugin/rel-path-test-files/a/b/c1/d
A         maven-shade-plugin/rel-path-test-files/a/b/c1/pom
A         maven-shade-plugin/rel-path-test-files/a/b1
A         maven-shade-plugin/rel-path-test-files/a/b1/c
A         maven-shade-plugin/rel-path-test-files/a/b1/c/d
A         maven-shade-plugin/rel-path-test-files/a/b1/pom
AU        maven-shade-plugin/pom.xml
A         maven-plugins
A         maven-plugins/src
A         maven-plugins/src/site
AU        maven-plugins/src/site/site.xml
A         maven-plugins/src/site-docs
A         maven-plugins/src/site-docs/xdoc
A         maven-plugins/src/site-docs/xdoc/download.xml.vm
AU        maven-plugins/src/site-docs/site.xml
A         maven-plugins/src/site-docs/apt
AU        maven-plugins/src/site-docs/apt/index.apt.vm
A         maven-plugins/src/site-docs/resources
A         maven-plugins/src/site-docs/resources/download.cgi
AU        maven-plugins/pom.xml
AU        maven-plugins/site-pom.xml
 U        .
At revision 1682437
provisoning config files...
copy managed file [simple-deploy-settings-no-mirror] to file:/tmp/config8774556871036188467tmp
[maven-plugins-ITs-m2] $ /home/jenkins/tools/maven/apache-maven-2.2.1/bin/mvn clean install
-Prun-its -U -B -V -fae -s /tmp/config8774556871036188467tmp
Apache Maven 2.2.1 (r801777; 2009-08-06 19:16:01+0000)
Java version: 1.6.0_45
Java home: /home/jenkins/tools/java/jdk1.6.0_45-32/jre
Default locale: en_US, platform encoding: UTF-8
OS name: "linux" version: "3.13.0-30-generic" arch: "i386" Family: "unix"
[INFO] Scanning for projects...
[INFO] snapshot org.apache.maven:maven-parent:27-SNAPSHOT: checking for updates from apache.snapshots
Downloading: http://repository.apache.org/snapshots/org/apache/maven/maven-parent/27-SNAPSHOT/maven-parent-27-20150529.084812-925.pom
38K downloaded  (maven-parent-27-20150529.084812-925.pom)
[INFO] snapshot org.apache:apache:17-SNAPSHOT: checking for updates from apache.snapshots
Downloading: http://repository.apache.org/snapshots/org/apache/apache/17-SNAPSHOT/apache-17-SNAPSHOT.pom
[INFO] Unable to find resource 'org.apache:apache:pom:17-SNAPSHOT' in repository apache.snapshots
(http://repository.apache.org/snapshots)
[INFO] ------------------------------------------------------------------------
[ERROR] FATAL ERROR
[INFO] ------------------------------------------------------------------------
[INFO] Error building POM (may not be this project's POM).


Project ID: org.apache.maven:maven-parent:pom:27-SNAPSHOT

Reason: Cannot find parent: org.apache:apache for project: org.apache.maven:maven-parent:pom:27-SNAPSHOT
for project org.apache.maven:maven-parent:pom:27-SNAPSHOT


[INFO] ------------------------------------------------------------------------
[INFO] Trace
org.apache.maven.reactor.MavenExecutionException: Cannot find parent: org.apache:apache for
project: org.apache.maven:maven-parent:pom:27-SNAPSHOT for project org.apache.maven:maven-parent:pom:27-SNAPSHOT
	at org.apache.maven.DefaultMaven.getProjects(DefaultMaven.java:404)
	at org.apache.maven.DefaultMaven.doExecute(DefaultMaven.java:272)
	at org.apache.maven.DefaultMaven.execute(DefaultMaven.java:138)
	at org.apache.maven.cli.MavenCli.main(MavenCli.java:362)
	at org.apache.maven.cli.compat.CompatibleMain.main(CompatibleMain.java:60)
	at sun.reflect.NativeMethodAccessorImpl.invoke0(Native Method)
	at sun.reflect.NativeMethodAccessorImpl.invoke(NativeMethodAccessorImpl.java:39)
	at sun.reflect.DelegatingMethodAccessorImpl.invoke(DelegatingMethodAccessorImpl.java:25)
	at java.lang.reflect.Method.invoke(Method.java:597)
	at org.codehaus.classworlds.Launcher.launchEnhanced(Launcher.java:315)
	at org.codehaus.classworlds.Launcher.launch(Launcher.java:255)
	at org.codehaus.classworlds.Launcher.mainWithExitCode(Launcher.java:430)
	at org.codehaus.classworlds.Launcher.main(Launcher.java:375)
Caused by: org.apache.maven.project.ProjectBuildingException: Cannot find parent: org.apache:apache
for project: org.apache.maven:maven-parent:pom:27-SNAPSHOT for project org.apache.maven:maven-parent:pom:27-SNAPSHOT
	at org.apache.maven.project.DefaultMavenProjectBuilder.assembleLineage(DefaultMavenProjectBuilder.java:1396)
	at org.apache.maven.project.DefaultMavenProjectBuilder.assembleLineage(DefaultMavenProjectBuilder.java:1407)
	at org.apache.maven.project.DefaultMavenProjectBuilder.buildInternal(DefaultMavenProjectBuilder.java:823)
	at org.apache.maven.project.DefaultMavenProjectBuilder.buildFromSourceFileInternal(DefaultMavenProjectBuilder.java:508)
	at org.apache.maven.project.DefaultMavenProjectBuilder.build(DefaultMavenProjectBuilder.java:200)
	at org.apache.maven.DefaultMaven.getProject(DefaultMaven.java:604)
	at org.apache.maven.DefaultMaven.collectProjects(DefaultMaven.java:487)
	at org.apache.maven.DefaultMaven.collectProjects(DefaultMaven.java:560)
	at org.apache.maven.DefaultMaven.getProjects(DefaultMaven.java:391)
	... 12 more
Caused by: org.apache.maven.project.ProjectBuildingException: POM 'org.apache:apache' not
found in repository: Unable to download the artifact from any repository

  org.apache:apache:pom:17-SNAPSHOT

from the specified remote repositories:
  apache.snapshots (http://repository.apache.org/snapshots),
  central (http://repo1.maven.org/maven2)

 for project org.apache:apache
	at org.apache.maven.project.DefaultMavenProjectBuilder.findModelFromRepository(DefaultMavenProjectBuilder.java:605)
	at org.apache.maven.project.DefaultMavenProjectBuilder.assembleLineage(DefaultMavenProjectBuilder.java:1392)
	... 20 more
Caused by: org.apache.maven.artifact.resolver.ArtifactNotFoundException: Unable to download
the artifact from any repository

  org.apache:apache:pom:17-SNAPSHOT

from the specified remote repositories:
  apache.snapshots (http://repository.apache.org/snapshots),
  central (http://repo1.maven.org/maven2)


	at org.apache.maven.artifact.resolver.DefaultArtifactResolver.resolve(DefaultArtifactResolver.java:228)
	at org.apache.maven.artifact.resolver.DefaultArtifactResolver.resolve(DefaultArtifactResolver.java:90)
	at org.apache.maven.project.DefaultMavenProjectBuilder.findModelFromRepository(DefaultMavenProjectBuilder.java:558)
	... 21 more
Caused by: org.apache.maven.wagon.ResourceDoesNotExistException: Unable to download the artifact
from any repository
	at org.apache.maven.artifact.manager.DefaultWagonManager.getArtifact(DefaultWagonManager.java:404)
	at org.apache.maven.artifact.resolver.DefaultArtifactResolver.resolve(DefaultArtifactResolver.java:216)
	... 23 more
[INFO] ------------------------------------------------------------------------
[INFO] Total time: 1 second
[INFO] Finished at: Fri May 29 12:16:28 UTC 2015
[INFO] Final Memory: 2M/61M
[INFO] ------------------------------------------------------------------------
Build step 'Invoke top-level Maven targets' marked build as failure

Mime
View raw message