maven-notifications mailing list archives

Site index · List index
Message view « Date » · « Thread »
Top « Date » · « Thread »
From Apache Jenkins Server <jenk...@builds.apache.org>
Subject Build failed in Jenkins: maven-plugins-ITs-m3-windows #1130
Date Fri, 01 May 2015 19:03:06 GMT
See <https://builds.apache.org/job/maven-plugins-ITs-m3-windows/1130/changes>

Changes:

[dennisl] Create a new profile "java-7" for plugins that require Java 7.
Move maven-checkstyle-plugin to the java-7 profile.

[dennisl] [MCHECKSTYLE-284] Remove config/sun_checks.xml and use the one built into Checkstyle
6.2+

Note that I had to remove the @SuppressionWarnings check in the IT check-pass, because Suppressions
are not enabled in the version of sun_checks.xml that the Checkstyle project supplies.

------------------------------------------
[...truncated 6712 lines...]

Tests run: 28, Failures: 0, Errors: 0, Skipped: 0

[INFO] 
[INFO] --- maven-jar-plugin:2.5:jar (default-jar) @ maven-shade-plugin ---
[INFO] Building jar: F:\hudson\hudson-slave\workspace\maven-plugins-ITs-m3-windows\maven-shade-plugin\target\maven-shade-plugin-2.4-SNAPSHOT.jar
[INFO] 
[INFO] --- maven-plugin-plugin:3.3:addPluginArtifactMetadata (default-addPluginArtifactMetadata)
@ maven-shade-plugin ---
[INFO] 
[INFO] --- maven-jar-plugin:2.5:test-jar (default) @ maven-shade-plugin ---
[INFO] Building jar: F:\hudson\hudson-slave\workspace\maven-plugins-ITs-m3-windows\maven-shade-plugin\target\maven-shade-plugin-2.4-SNAPSHOT-tests.jar
[INFO] 
[INFO] --- maven-invoker-plugin:1.9:install (integration-test) @ maven-shade-plugin ---
[INFO] Installing F:\hudson\hudson-slave\workspace\maven-plugins-ITs-m3-windows\maven-plugins\pom.xml
to F:\hudson\hudson-slave\workspace\maven-plugins-ITs-m3-windows\maven-shade-plugin\target\local-repo\org\apache\maven\plugins\maven-plugins\28-SNAPSHOT\maven-plugins-28-SNAPSHOT.pom
[INFO] Installing F:\hudson\hudson-slave\workspace\maven-plugins-ITs-m3-windows\maven-plugins\target\maven-plugins-28-SNAPSHOT-site.xml
to F:\hudson\hudson-slave\workspace\maven-plugins-ITs-m3-windows\maven-shade-plugin\target\local-repo\org\apache\maven\plugins\maven-plugins\28-SNAPSHOT\maven-plugins-28-SNAPSHOT-site.xml
[INFO] Installing F:\hudson\hudson-slave\workspace\maven-plugins-ITs-m3-windows\maven-acr-plugin\pom.xml
to F:\hudson\hudson-slave\workspace\maven-plugins-ITs-m3-windows\maven-shade-plugin\target\local-repo\org\apache\maven\plugins\maven-acr-plugin\1.2-SNAPSHOT\maven-acr-plugin-1.2-SNAPSHOT.pom
[INFO] Installing F:\hudson\hudson-slave\workspace\maven-plugins-ITs-m3-windows\maven-acr-plugin\target\maven-acr-plugin-1.2-SNAPSHOT.jar
to F:\hudson\hudson-slave\workspace\maven-plugins-ITs-m3-windows\maven-shade-plugin\target\local-repo\org\apache\maven\plugins\maven-acr-plugin\1.2-SNAPSHOT\maven-acr-plugin-1.2-SNAPSHOT.jar
[INFO] Installing F:\hudson\hudson-slave\workspace\maven-plugins-ITs-m3-windows\maven-acr-plugin\pom.xml
to F:\hudson\hudson-slave\workspace\maven-plugins-ITs-m3-windows\maven-shade-plugin\target\local-repo\org\apache\maven\plugins\maven-acr-plugin\1.2-SNAPSHOT\maven-acr-plugin-1.2-SNAPSHOT.pom
[INFO] Installing F:\hudson\hudson-slave\workspace\maven-plugins-ITs-m3-windows\maven-ant-plugin\pom.xml
to F:\hudson\hudson-slave\workspace\maven-plugins-ITs-m3-windows\maven-shade-plugin\target\local-repo\org\apache\maven\plugins\maven-ant-plugin\2.5-SNAPSHOT\maven-ant-plugin-2.5-SNAPSHOT.pom
[INFO] Installing F:\hudson\hudson-slave\workspace\maven-plugins-ITs-m3-windows\maven-ant-plugin\target\maven-ant-plugin-2.5-SNAPSHOT.jar
to F:\hudson\hudson-slave\workspace\maven-plugins-ITs-m3-windows\maven-shade-plugin\target\local-repo\org\apache\maven\plugins\maven-ant-plugin\2.5-SNAPSHOT\maven-ant-plugin-2.5-SNAPSHOT.jar
[INFO] Installing F:\hudson\hudson-slave\workspace\maven-plugins-ITs-m3-windows\maven-ant-plugin\pom.xml
to F:\hudson\hudson-slave\workspace\maven-plugins-ITs-m3-windows\maven-shade-plugin\target\local-repo\org\apache\maven\plugins\maven-ant-plugin\2.5-SNAPSHOT\maven-ant-plugin-2.5-SNAPSHOT.pom
[INFO] Installing F:\hudson\hudson-slave\workspace\maven-plugins-ITs-m3-windows\maven-antrun-plugin\pom.xml
to F:\hudson\hudson-slave\workspace\maven-plugins-ITs-m3-windows\maven-shade-plugin\target\local-repo\org\apache\maven\plugins\maven-antrun-plugin\1.9-SNAPSHOT\maven-antrun-plugin-1.9-SNAPSHOT.pom
[INFO] Installing F:\hudson\hudson-slave\workspace\maven-plugins-ITs-m3-windows\maven-antrun-plugin\target\maven-antrun-plugin-1.9-SNAPSHOT.jar
to F:\hudson\hudson-slave\workspace\maven-plugins-ITs-m3-windows\maven-shade-plugin\target\local-repo\org\apache\maven\plugins\maven-antrun-plugin\1.9-SNAPSHOT\maven-antrun-plugin-1.9-SNAPSHOT.jar
[INFO] Installing F:\hudson\hudson-slave\workspace\maven-plugins-ITs-m3-windows\maven-antrun-plugin\pom.xml
to F:\hudson\hudson-slave\workspace\maven-plugins-ITs-m3-windows\maven-shade-plugin\target\local-repo\org\apache\maven\plugins\maven-antrun-plugin\1.9-SNAPSHOT\maven-antrun-plugin-1.9-SNAPSHOT.pom
[INFO] Installing F:\hudson\hudson-slave\workspace\maven-plugins-ITs-m3-windows\maven-eclipse-plugin\pom.xml
to F:\hudson\hudson-slave\workspace\maven-plugins-ITs-m3-windows\maven-shade-plugin\target\local-repo\org\apache\maven\plugins\maven-eclipse-plugin\2.10-SNAPSHOT\maven-eclipse-plugin-2.10-SNAPSHOT.pom
[INFO] Installing F:\hudson\hudson-slave\workspace\maven-plugins-ITs-m3-windows\maven-eclipse-plugin\target\maven-eclipse-plugin-2.10-SNAPSHOT.jar
to F:\hudson\hudson-slave\workspace\maven-plugins-ITs-m3-windows\maven-shade-plugin\target\local-repo\org\apache\maven\plugins\maven-eclipse-plugin\2.10-SNAPSHOT\maven-eclipse-plugin-2.10-SNAPSHOT.jar
[INFO] Installing F:\hudson\hudson-slave\workspace\maven-plugins-ITs-m3-windows\maven-eclipse-plugin\pom.xml
to F:\hudson\hudson-slave\workspace\maven-plugins-ITs-m3-windows\maven-shade-plugin\target\local-repo\org\apache\maven\plugins\maven-eclipse-plugin\2.10-SNAPSHOT\maven-eclipse-plugin-2.10-SNAPSHOT.pom
[INFO] Installing F:\hudson\hudson-slave\workspace\maven-plugins-ITs-m3-windows\maven-assembly-plugin\pom.xml
to F:\hudson\hudson-slave\workspace\maven-plugins-ITs-m3-windows\maven-shade-plugin\target\local-repo\org\apache\maven\plugins\maven-assembly-plugin\2.5.5-SNAPSHOT\maven-assembly-plugin-2.5.5-SNAPSHOT.pom
[INFO]                                                                         
[INFO] ------------------------------------------------------------------------
[INFO] Building Apache Maven SCM Publish Plugin 1.2-SNAPSHOT
[INFO] ------------------------------------------------------------------------
[INFO] 
[INFO] --- maven-clean-plugin:2.5:clean (default-clean) @ maven-scm-publish-plugin ---
[INFO] Deleting F:\hudson\hudson-slave\workspace\maven-plugins-ITs-m3-windows\maven-scm-publish-plugin\target
[INFO] 
[INFO] --- maven-enforcer-plugin:1.3.1:enforce (enforce-bytecode-version) @ maven-scm-publish-plugin
---
[INFO] 
[INFO] --- maven-enforcer-plugin:1.3.1:enforce (ban-known-bad-maven-versions) @ maven-scm-publish-plugin
---
[INFO] 
[INFO] --- maven-enforcer-plugin:1.3.1:enforce (ensure-no-container-api) @ maven-scm-publish-plugin
---
[INFO] 
[INFO] --- apache-rat-plugin:0.11:check (rat-check) @ maven-scm-publish-plugin ---
[INFO] 51 implicit excludes (use -debug for more details).
[INFO] No excludes explicitly specified.
[INFO] 41 resources included (use -debug for more details)
[INFO] Rat check: Summary of files. Unapproved: 0 unknown: 0 generated: 0 approved: 39 licence.
[INFO] 
[INFO] --- maven-plugin-plugin:3.3:helpmojo (generated-helpmojo) @ maven-scm-publish-plugin
---
[INFO] Using 'UTF-8' encoding to read mojo metadata.
[INFO] Applying mojo extractor for language: java
[INFO] Mojo extractor for language: java found 1 mojo descriptors.
[INFO] Applying mojo extractor for language: bsh
[INFO] Mojo extractor for language: bsh found 0 mojo descriptors.
[INFO] Applying mojo extractor for language: java-annotations
[INFO] Mojo extractor for language: java-annotations found 0 mojo descriptors.
[INFO] 
[INFO] --- maven-remote-resources-plugin:1.5:process (default) @ maven-scm-publish-plugin
---
[INFO] 
[INFO] --- maven-resources-plugin:2.6:resources (default-resources) @ maven-scm-publish-plugin
---
[INFO] Using 'UTF-8' encoding to copy filtered resources.
[INFO] Copying 2 resources
[INFO] Copying 3 resources
[INFO] 
[INFO] --- maven-compiler-plugin:3.1:compile (default-compile) @ maven-scm-publish-plugin
---
[INFO] Changes detected - recompiling the module!
[INFO] Compiling 4 source files to F:\hudson\hudson-slave\workspace\maven-plugins-ITs-m3-windows\maven-scm-publish-plugin\target\classes
[INFO] 
[INFO] --- maven-plugin-plugin:3.3:descriptor (default-descriptor) @ maven-scm-publish-plugin
---
[INFO] Using 'UTF-8' encoding to read mojo metadata.
[INFO] Applying mojo extractor for language: java
[INFO] Mojo extractor for language: java found 1 mojo descriptors.
[INFO] Applying mojo extractor for language: bsh
[INFO] Mojo extractor for language: bsh found 0 mojo descriptors.
[INFO] Applying mojo extractor for language: java-annotations
[INFO] Mojo extractor for language: java-annotations found 2 mojo descriptors.
[INFO] 
[INFO] --- maven-resources-plugin:2.6:testResources (default-testResources) @ maven-scm-publish-plugin
---
[INFO] Using 'UTF-8' encoding to copy filtered resources.
[INFO] skip non existing resourceDirectory F:\hudson\hudson-slave\workspace\maven-plugins-ITs-m3-windows\maven-scm-publish-plugin\src\test\resources
[INFO] Copying 3 resources
[INFO] 
[INFO] --- maven-compiler-plugin:3.1:testCompile (default-testCompile) @ maven-scm-publish-plugin
---
[INFO] No sources to compile
[INFO] 
[INFO] --- maven-surefire-plugin:2.17:test (default-test) @ maven-scm-publish-plugin ---
[INFO] 
[INFO] --- maven-jar-plugin:2.5:jar (default-jar) @ maven-scm-publish-plugin ---
[INFO] Building jar: F:\hudson\hudson-slave\workspace\maven-plugins-ITs-m3-windows\maven-scm-publish-plugin\target\maven-scm-publish-plugin-1.2-SNAPSHOT.jar
[INFO] 
[INFO] --- maven-plugin-plugin:3.3:addPluginArtifactMetadata (default-addPluginArtifactMetadata)
@ maven-scm-publish-plugin ---
[INFO] 
[INFO] --- maven-invoker-plugin:1.9:install (integration-test) @ maven-scm-publish-plugin
---
[INFO] Installing F:\hudson\hudson-slave\workspace\maven-plugins-ITs-m3-windows\maven-plugins\pom.xml
to F:\hudson\hudson-slave\workspace\maven-plugins-ITs-m3-windows\maven-scm-publish-plugin\target\local-repo\org\apache\maven\plugins\maven-plugins\28-SNAPSHOT\maven-plugins-28-SNAPSHOT.pom
[INFO] Installing F:\hudson\hudson-slave\workspace\maven-plugins-ITs-m3-windows\maven-plugins\target\maven-plugins-28-SNAPSHOT-site.xml
to F:\hudson\hudson-slave\workspace\maven-plugins-ITs-m3-windows\maven-scm-publish-plugin\target\local-repo\org\apache\maven\plugins\maven-plugins\28-SNAPSHOT\maven-plugins-28-SNAPSHOT-site.xml
[INFO] Installing F:\hudson\hudson-slave\workspace\maven-plugins-ITs-m3-windows\maven-acr-plugin\pom.xml
to F:\hudson\hudson-slave\workspace\maven-plugins-ITs-m3-windows\maven-scm-publish-plugin\target\local-repo\org\apache\maven\plugins\maven-acr-plugin\1.2-SNAPSHOT\maven-acr-plugin-1.2-SNAPSHOT.pom
[INFO] Installing F:\hudson\hudson-slave\workspace\maven-plugins-ITs-m3-windows\maven-acr-plugin\target\maven-acr-plugin-1.2-SNAPSHOT.jar
to F:\hudson\hudson-slave\workspace\maven-plugins-ITs-m3-windows\maven-scm-publish-plugin\target\local-repo\org\apache\maven\plugins\maven-acr-plugin\1.2-SNAPSHOT\maven-acr-plugin-1.2-SNAPSHOT.jar
[INFO] Installing F:\hudson\hudson-slave\workspace\maven-plugins-ITs-m3-windows\maven-acr-plugin\pom.xml
to F:\hudson\hudson-slave\workspace\maven-plugins-ITs-m3-windows\maven-scm-publish-plugin\target\local-repo\org\apache\maven\plugins\maven-acr-plugin\1.2-SNAPSHOT\maven-acr-plugin-1.2-SNAPSHOT.pom
[INFO] Installing F:\hudson\hudson-slave\workspace\maven-plugins-ITs-m3-windows\maven-ant-plugin\pom.xml
to F:\hudson\hudson-slave\workspace\maven-plugins-ITs-m3-windows\maven-scm-publish-plugin\target\local-repo\org\apache\maven\plugins\maven-ant-plugin\2.5-SNAPSHOT\maven-ant-plugin-2.5-SNAPSHOT.pom
[INFO] Installing F:\hudson\hudson-slave\workspace\maven-plugins-ITs-m3-windows\maven-ant-plugin\target\maven-ant-plugin-2.5-SNAPSHOT.jar
to F:\hudson\hudson-slave\workspace\maven-plugins-ITs-m3-windows\maven-scm-publish-plugin\target\local-repo\org\apache\maven\plugins\maven-ant-plugin\2.5-SNAPSHOT\maven-ant-plugin-2.5-SNAPSHOT.jar
[INFO] Installing F:\hudson\hudson-slave\workspace\maven-plugins-ITs-m3-windows\maven-ant-plugin\pom.xml
to F:\hudson\hudson-slave\workspace\maven-plugins-ITs-m3-windows\maven-scm-publish-plugin\target\local-repo\org\apache\maven\plugins\maven-ant-plugin\2.5-SNAPSHOT\maven-ant-plugin-2.5-SNAPSHOT.pom
[INFO] Installing F:\hudson\hudson-slave\workspace\maven-plugins-ITs-m3-windows\maven-antrun-plugin\pom.xml
to F:\hudson\hudson-slave\workspace\maven-plugins-ITs-m3-windows\maven-scm-publish-plugin\target\local-repo\org\apache\maven\plugins\maven-antrun-plugin\1.9-SNAPSHOT\maven-antrun-plugin-1.9-SNAPSHOT.pom
[INFO] Installing F:\hudson\hudson-slave\workspace\maven-plugins-ITs-m3-windows\maven-antrun-plugin\target\maven-antrun-plugin-1.9-SNAPSHOT.jar
to F:\hudson\hudson-slave\workspace\maven-plugins-ITs-m3-windows\maven-scm-publish-plugin\target\local-repo\org\apache\maven\plugins\maven-antrun-plugin\1.9-SNAPSHOT\maven-antrun-plugin-1.9-SNAPSHOT.jar
[INFO] Installing F:\hudson\hudson-slave\workspace\maven-plugins-ITs-m3-windows\maven-antrun-plugin\pom.xml
to F:\hudson\hudson-slave\workspace\maven-plugins-ITs-m3-windows\maven-scm-publish-plugin\target\local-repo\org\apache\maven\plugins\maven-antrun-plugin\1.9-SNAPSHOT\maven-antrun-plugin-1.9-SNAPSHOT.pom
[INFO] Installing F:\hudson\hudson-slave\workspace\maven-plugins-ITs-m3-windows\maven-eclipse-plugin\pom.xml
to F:\hudson\hudson-slave\workspace\maven-plugins-ITs-m3-windows\maven-scm-publish-plugin\target\local-repo\org\apache\maven\plugins\maven-eclipse-plugin\2.10-SNAPSHOT\maven-eclipse-plugin-2.10-SNAPSHOT.pom
[INFO] Installing F:\hudson\hudson-slave\workspace\maven-plugins-ITs-m3-windows\maven-eclipse-plugin\target\maven-eclipse-plugin-2.10-SNAPSHOT.jar
to F:\hudson\hudson-slave\workspace\maven-plugins-ITs-m3-windows\maven-scm-publish-plugin\target\local-repo\org\apache\maven\plugins\maven-eclipse-plugin\2.10-SNAPSHOT\maven-eclipse-plugin-2.10-SNAPSHOT.jar
[INFO] Installing F:\hudson\hudson-slave\workspace\maven-plugins-ITs-m3-windows\maven-eclipse-plugin\pom.xml
to F:\hudson\hudson-slave\workspace\maven-plugins-ITs-m3-windows\maven-scm-publish-plugin\target\local-repo\org\apache\maven\plugins\maven-eclipse-plugin\2.10-SNAPSHOT\maven-eclipse-plugin-2.10-SNAPSHOT.pom
[INFO] Installing F:\hudson\hudson-slave\workspace\maven-plugins-ITs-m3-windows\maven-assembly-plugin\pom.xml
to F:\hudson\hudson-slave\workspace\maven-plugins-ITs-m3-windows\maven-scm-publish-plugin\target\local-repo\org\apache\maven\plugins\maven-assembly-plugin\2.5.5-SNAPSHOT\maven-assembly-plugin-2.5.5-SNAPSHOT.pom
[INFO]                                                                         
[INFO] ------------------------------------------------------------------------
[INFO] Building Apache Maven Plugins Aggregator 1-SNAPSHOT
[INFO] ------------------------------------------------------------------------
[INFO] 
[INFO] --- maven-clean-plugin:2.5:clean (default-clean) @ maven-plugins-aggregator ---
[INFO] Deleting <https://builds.apache.org/job/maven-plugins-ITs-m3-windows/ws/target>
[INFO] 
[INFO] --- maven-enforcer-plugin:1.3.1:enforce (enforce-bytecode-version) @ maven-plugins-aggregator
---
[INFO] 
[INFO] --- maven-enforcer-plugin:1.3.1:enforce (ban-known-bad-maven-versions) @ maven-plugins-aggregator
---
[INFO] 
[INFO] --- maven-remote-resources-plugin:1.5:process (default) @ maven-plugins-aggregator
---
[INFO] 
[INFO] --- maven-site-plugin:3.3:attach-descriptor (attach-descriptor) @ maven-plugins-aggregator
---
[INFO] 
[INFO] --- maven-install-plugin:2.5.1:install (default-install) @ maven-plugins-aggregator
---
[INFO] Installing <https://builds.apache.org/job/maven-plugins-ITs-m3-windows/ws/pom.xml>
to C:\.m2\repository\org\apache\maven\plugins\maven-plugins-aggregator\1-SNAPSHOT\maven-plugins-aggregator-1-SNAPSHOT.pom
[INFO] ------------------------------------------------------------------------
[INFO] Reactor Summary:
[INFO] 
[INFO] Apache Maven Plugins .............................. SUCCESS [17.298s]
[INFO] Apache Maven ACR Plugin ........................... SUCCESS [45.920s]
[INFO] Apache Maven Ant Plugin ........................... SUCCESS [1:55.922s]
[INFO] Apache Maven AntRun Plugin ........................ SUCCESS [1:16.522s]
[INFO] Apache Maven Eclipse Plugin ....................... SUCCESS [11:37.897s]
[INFO] Apache Maven Assembly Plugin ...................... FAILURE [56.310s]
[INFO] Apache Maven Changelog Plugin ..................... FAILURE [12.145s]
[INFO] Apache Maven Changes Plugin ....................... FAILURE [23.772s]
[INFO] Apache Maven Clean Plugin ......................... FAILURE [4.215s]
[INFO] Apache Maven Compiler Plugin ...................... FAILURE [21.224s]
[INFO] Apache Maven Dependency Plugin .................... FAILURE [56.436s]
[INFO] Apache Maven Deploy Plugin ........................ FAILURE [10.996s]
[INFO] Apache Maven DOAP Plugin .......................... FAILURE [9.968s]
[INFO] Apache Maven Documentation Checker Plugin ......... FAILURE [2.276s]
[INFO] Apache Maven EAR Plugin ........................... FAILURE [11.564s]
[INFO] Apache Maven EJB Plugin ........................... FAILURE [7.320s]
[INFO] Apache Maven Help Plugin .......................... FAILURE [7.071s]
[INFO] Apache Maven Install Plugin ....................... FAILURE [6.894s]
[INFO] Apache Maven JAR Plugin ........................... FAILURE [5.543s]
[INFO] Apache Maven Jarsigner Plugin ..................... FAILURE [3.353s]
[INFO] Apache Maven Javadoc Plugin ....................... FAILURE [2:07.034s]
[INFO] Apache Maven Linkcheck Plugin ..................... FAILURE [4.436s]
[INFO] Apache Maven Patch Plugin ......................... FAILURE [1.090s]
[INFO] Apache Maven PDF Plugin ........................... FAILURE [27.101s]
[INFO] Apache Maven RAR Plugin ........................... FAILURE [5.434s]
[INFO] Apache Maven Repository Plugin .................... FAILURE [6.072s]
[INFO] Apache Maven Resources Plugin ..................... FAILURE [8.929s]
[INFO] Apache Maven Site Plugin .......................... FAILURE [40.407s]
[INFO] Apache Maven Source Plugin ........................ FAILURE [6.716s]
[INFO] Apache Maven Stage Plugin ......................... FAILURE [8.312s]
[INFO] Apache Maven Toolchains Plugin .................... FAILURE [3.236s]
[INFO] Apache Maven Verifier Plugin ...................... FAILURE [2.317s]
[INFO] Apache Maven WAR Plugin ........................... FAILURE [16.404s]
[INFO] Apache Maven Invoker Plugin ....................... FAILURE [18.204s]
[INFO] Apache Maven Project Info Reports Plugin .......... FAILURE [28.375s]
[INFO] Apache Maven Remote Resources Plugin .............. FAILURE [8.294s]
[INFO] Apache Maven Shade Plugin ......................... FAILURE [13.853s]
[INFO] Apache Maven SCM Publish Plugin ................... FAILURE [7.867s]
[INFO] Apache Maven Plugins Aggregator ................... SUCCESS [1.251s]
[INFO] ------------------------------------------------------------------------
[INFO] BUILD FAILURE
[INFO] ------------------------------------------------------------------------
[INFO] Total time: 25:31.283s
[INFO] Finished at: Fri May 01 19:55:48 BST 2015
[INFO] Final Memory: 106M/357M
[INFO] ------------------------------------------------------------------------
[WARNING] The requested profile "apache.snapshots" could not be activated because it does
not exist.
[ERROR] Failed to execute goal org.apache.maven.plugins:maven-surefire-plugin:2.17:test (default-test)
on project maven-assembly-plugin: There are test failures.
[ERROR] 
[ERROR] Please refer to F:\hudson\hudson-slave\workspace\maven-plugins-ITs-m3-windows\maven-assembly-plugin\target\surefire-reports
for the individual test results.
[ERROR] -> [Help 1]
[ERROR] Failed to execute goal org.apache.maven.plugins:maven-invoker-plugin:1.9:install (integration-test)
on project maven-changelog-plugin: Failed to install project dependencies: MavenProject: org.apache.maven.plugins:maven-changelog-plugin:2.4-SNAPSHOT
@ F:\hudson\hudson-slave\workspace\maven-plugins-ITs-m3-windows\maven-changelog-plugin\pom.xml:
Failed to install project artifacts: MavenProject: org.apache.maven.plugins:maven-assembly-plugin:2.5.5-SNAPSHOT
@ F:\hudson\hudson-slave\workspace\maven-plugins-ITs-m3-windows\maven-assembly-plugin\pom.xml:
Failed to install artifact: org.apache.maven.plugins:maven-assembly-plugin:maven-plugin:2.5.5-SNAPSHOT:
Artifact is not fully assembled: F:\hudson\hudson-slave\workspace\maven-plugins-ITs-m3-windows\maven-assembly-plugin\target\classes
-> [Help 2]
[ERROR] Failed to execute goal org.apache.maven.plugins:maven-invoker-plugin:1.9:install (integration-test)
on project maven-changes-plugin: Failed to install project dependencies: MavenProject: org.apache.maven.plugins:maven-changes-plugin:2.12-SNAPSHOT
@ F:\hudson\hudson-slave\workspace\maven-plugins-ITs-m3-windows\maven-changes-plugin\pom.xml:
Failed to install project artifacts: MavenProject: org.apache.maven.plugins:maven-assembly-plugin:2.5.5-SNAPSHOT
@ F:\hudson\hudson-slave\workspace\maven-plugins-ITs-m3-windows\maven-assembly-plugin\pom.xml:
Failed to install artifact: org.apache.maven.plugins:maven-assembly-plugin:maven-plugin:2.5.5-SNAPSHOT:
Artifact is not fully assembled: F:\hudson\hudson-slave\workspace\maven-plugins-ITs-m3-windows\maven-assembly-plugin\target\classes
-> [Help 2]
[ERROR] Failed to execute goal org.apache.maven.plugins:maven-invoker-plugin:1.9:install (integration-test)
on project maven-clean-plugin: Failed to install project dependencies: MavenProject: org.apache.maven.plugins:maven-clean-plugin:2.6.2-SNAPSHOT
@ F:\hudson\hudson-slave\workspace\maven-plugins-ITs-m3-windows\maven-clean-plugin\pom.xml:
Failed to install project artifacts: MavenProject: org.apache.maven.plugins:maven-assembly-plugin:2.5.5-SNAPSHOT
@ F:\hudson\hudson-slave\workspace\maven-plugins-ITs-m3-windows\maven-assembly-plugin\pom.xml:
Failed to install artifact: org.apache.maven.plugins:maven-assembly-plugin:maven-plugin:2.5.5-SNAPSHOT:
Artifact is not fully assembled: F:\hudson\hudson-slave\workspace\maven-plugins-ITs-m3-windows\maven-assembly-plugin\target\classes
-> [Help 2]
[ERROR] Failed to execute goal org.apache.maven.plugins:maven-invoker-plugin:1.9:install (integration-test)
on project maven-compiler-plugin: Failed to install project dependencies: MavenProject: org.apache.maven.plugins:maven-compiler-plugin:3.4-SNAPSHOT
@ F:\hudson\hudson-slave\workspace\maven-plugins-ITs-m3-windows\maven-compiler-plugin\pom.xml:
Failed to install project artifacts: MavenProject: org.apache.maven.plugins:maven-assembly-plugin:2.5.5-SNAPSHOT
@ F:\hudson\hudson-slave\workspace\maven-plugins-ITs-m3-windows\maven-assembly-plugin\pom.xml:
Failed to install artifact: org.apache.maven.plugins:maven-assembly-plugin:maven-plugin:2.5.5-SNAPSHOT:
Artifact is not fully assembled: F:\hudson\hudson-slave\workspace\maven-plugins-ITs-m3-windows\maven-assembly-plugin\target\classes
-> [Help 2]
[ERROR] Failed to execute goal org.apache.maven.plugins:maven-invoker-plugin:1.9:install (integration-test)
on project maven-dependency-plugin: Failed to install project dependencies: MavenProject:
org.apache.maven.plugins:maven-dependency-plugin:2.11-SNAPSHOT @ F:\hudson\hudson-slave\workspace\maven-plugins-ITs-m3-windows\maven-dependency-plugin\pom.xml:
Failed to install project artifacts: MavenProject: org.apache.maven.plugins:maven-assembly-plugin:2.5.5-SNAPSHOT
@ F:\hudson\hudson-slave\workspace\maven-plugins-ITs-m3-windows\maven-assembly-plugin\pom.xml:
Failed to install artifact: org.apache.maven.plugins:maven-assembly-plugin:maven-plugin:2.5.5-SNAPSHOT:
Artifact is not fully assembled: F:\hudson\hudson-slave\workspace\maven-plugins-ITs-m3-windows\maven-assembly-plugin\target\classes
-> [Help 2]
[ERROR] Failed to execute goal org.apache.maven.plugins:maven-invoker-plugin:1.9:install (integration-test)
on project maven-deploy-plugin: Failed to install project dependencies: MavenProject: org.apache.maven.plugins:maven-deploy-plugin:2.8.3-SNAPSHOT
@ F:\hudson\hudson-slave\workspace\maven-plugins-ITs-m3-windows\maven-deploy-plugin\pom.xml:
Failed to install project artifacts: MavenProject: org.apache.maven.plugins:maven-assembly-plugin:2.5.5-SNAPSHOT
@ F:\hudson\hudson-slave\workspace\maven-plugins-ITs-m3-windows\maven-assembly-plugin\pom.xml:
Failed to install artifact: org.apache.maven.plugins:maven-assembly-plugin:maven-plugin:2.5.5-SNAPSHOT:
Artifact is not fully assembled: F:\hudson\hudson-slave\workspace\maven-plugins-ITs-m3-windows\maven-assembly-plugin\target\classes
-> [Help 2]
[ERROR] Failed to execute goal org.apache.maven.plugins:maven-invoker-plugin:1.9:install (integration-test)
on project maven-doap-plugin: Failed to install project dependencies: MavenProject: org.apache.maven.plugins:maven-doap-plugin:1.3-SNAPSHOT
@ F:\hudson\hudson-slave\workspace\maven-plugins-ITs-m3-windows\maven-doap-plugin\pom.xml:
Failed to install project artifacts: MavenProject: org.apache.maven.plugins:maven-assembly-plugin:2.5.5-SNAPSHOT
@ F:\hudson\hudson-slave\workspace\maven-plugins-ITs-m3-windows\maven-assembly-plugin\pom.xml:
Failed to install artifact: org.apache.maven.plugins:maven-assembly-plugin:maven-plugin:2.5.5-SNAPSHOT:
Artifact is not fully assembled: F:\hudson\hudson-slave\workspace\maven-plugins-ITs-m3-windows\maven-assembly-plugin\target\classes
-> [Help 2]
[ERROR] Failed to execute goal org.apache.maven.plugins:maven-invoker-plugin:1.9:install (integration-test)
on project maven-docck-plugin: Failed to install project dependencies: MavenProject: org.apache.maven.plugins:maven-docck-plugin:1.2-SNAPSHOT
@ F:\hudson\hudson-slave\workspace\maven-plugins-ITs-m3-windows\maven-docck-plugin\pom.xml:
Failed to install project artifacts: MavenProject: org.apache.maven.plugins:maven-assembly-plugin:2.5.5-SNAPSHOT
@ F:\hudson\hudson-slave\workspace\maven-plugins-ITs-m3-windows\maven-assembly-plugin\pom.xml:
Failed to install artifact: org.apache.maven.plugins:maven-assembly-plugin:maven-plugin:2.5.5-SNAPSHOT:
Artifact is not fully assembled: F:\hudson\hudson-slave\workspace\maven-plugins-ITs-m3-windows\maven-assembly-plugin\target\classes
-> [Help 2]
[ERROR] Failed to execute goal org.apache.maven.plugins:maven-invoker-plugin:1.9:install (integration-test)
on project maven-ear-plugin: Failed to install project dependencies: MavenProject: org.apache.maven.plugins:maven-ear-plugin:2.11-SNAPSHOT
@ F:\hudson\hudson-slave\workspace\maven-plugins-ITs-m3-windows\maven-ear-plugin\pom.xml:
Failed to install project artifacts: MavenProject: org.apache.maven.plugins:maven-assembly-plugin:2.5.5-SNAPSHOT
@ F:\hudson\hudson-slave\workspace\maven-plugins-ITs-m3-windows\maven-assembly-plugin\pom.xml:
Failed to install artifact: org.apache.maven.plugins:maven-assembly-plugin:maven-plugin:2.5.5-SNAPSHOT:
Artifact is not fully assembled: F:\hudson\hudson-slave\workspace\maven-plugins-ITs-m3-windows\maven-assembly-plugin\target\classes
-> [Help 2]
[ERROR] Failed to execute goal org.apache.maven.plugins:maven-invoker-plugin:1.9:install (integration-test)
on project maven-ejb-plugin: Failed to install project dependencies: MavenProject: org.apache.maven.plugins:maven-ejb-plugin:2.6-SNAPSHOT
@ F:\hudson\hudson-slave\workspace\maven-plugins-ITs-m3-windows\maven-ejb-plugin\pom.xml:
Failed to install project artifacts: MavenProject: org.apache.maven.plugins:maven-assembly-plugin:2.5.5-SNAPSHOT
@ F:\hudson\hudson-slave\workspace\maven-plugins-ITs-m3-windows\maven-assembly-plugin\pom.xml:
Failed to install artifact: org.apache.maven.plugins:maven-assembly-plugin:maven-plugin:2.5.5-SNAPSHOT:
Artifact is not fully assembled: F:\hudson\hudson-slave\workspace\maven-plugins-ITs-m3-windows\maven-assembly-plugin\target\classes
-> [Help 2]
[ERROR] Failed to execute goal org.apache.maven.plugins:maven-invoker-plugin:1.9:install (integration-test)
on project maven-help-plugin: Failed to install project dependencies: MavenProject: org.apache.maven.plugins:maven-help-plugin:2.2.1-SNAPSHOT
@ F:\hudson\hudson-slave\workspace\maven-plugins-ITs-m3-windows\maven-help-plugin\pom.xml:
Failed to install project artifacts: MavenProject: org.apache.maven.plugins:maven-assembly-plugin:2.5.5-SNAPSHOT
@ F:\hudson\hudson-slave\workspace\maven-plugins-ITs-m3-windows\maven-assembly-plugin\pom.xml:
Failed to install artifact: org.apache.maven.plugins:maven-assembly-plugin:maven-plugin:2.5.5-SNAPSHOT:
Artifact is not fully assembled: F:\hudson\hudson-slave\workspace\maven-plugins-ITs-m3-windows\maven-assembly-plugin\target\classes
-> [Help 2]
[ERROR] Failed to execute goal org.apache.maven.plugins:maven-invoker-plugin:1.9:install (integration-test)
on project maven-install-plugin: Failed to install project dependencies: MavenProject: org.apache.maven.plugins:maven-install-plugin:2.5.3-SNAPSHOT
@ F:\hudson\hudson-slave\workspace\maven-plugins-ITs-m3-windows\maven-install-plugin\pom.xml:
Failed to install project artifacts: MavenProject: org.apache.maven.plugins:maven-assembly-plugin:2.5.5-SNAPSHOT
@ F:\hudson\hudson-slave\workspace\maven-plugins-ITs-m3-windows\maven-assembly-plugin\pom.xml:
Failed to install artifact: org.apache.maven.plugins:maven-assembly-plugin:maven-plugin:2.5.5-SNAPSHOT:
Artifact is not fully assembled: F:\hudson\hudson-slave\workspace\maven-plugins-ITs-m3-windows\maven-assembly-plugin\target\classes
-> [Help 2]
[ERROR] Failed to execute goal org.apache.maven.plugins:maven-invoker-plugin:1.9:install (integration-test)
on project maven-jar-plugin: Failed to install project dependencies: MavenProject: org.apache.maven.plugins:maven-jar-plugin:2.7-SNAPSHOT
@ F:\hudson\hudson-slave\workspace\maven-plugins-ITs-m3-windows\maven-jar-plugin\pom.xml:
Failed to install project artifacts: MavenProject: org.apache.maven.plugins:maven-assembly-plugin:2.5.5-SNAPSHOT
@ F:\hudson\hudson-slave\workspace\maven-plugins-ITs-m3-windows\maven-assembly-plugin\pom.xml:
Failed to install artifact: org.apache.maven.plugins:maven-assembly-plugin:maven-plugin:2.5.5-SNAPSHOT:
Artifact is not fully assembled: F:\hudson\hudson-slave\workspace\maven-plugins-ITs-m3-windows\maven-assembly-plugin\target\classes
-> [Help 2]
[ERROR] Failed to execute goal org.apache.maven.plugins:maven-invoker-plugin:1.9:install (integration-test)
on project maven-jarsigner-plugin: Failed to install project dependencies: MavenProject: org.apache.maven.plugins:maven-jarsigner-plugin:1.5-SNAPSHOT
@ F:\hudson\hudson-slave\workspace\maven-plugins-ITs-m3-windows\maven-jarsigner-plugin\pom.xml:
Failed to install project artifacts: MavenProject: org.apache.maven.plugins:maven-assembly-plugin:2.5.5-SNAPSHOT
@ F:\hudson\hudson-slave\workspace\maven-plugins-ITs-m3-windows\maven-assembly-plugin\pom.xml:
Failed to install artifact: org.apache.maven.plugins:maven-assembly-plugin:maven-plugin:2.5.5-SNAPSHOT:
Artifact is not fully assembled: F:\hudson\hudson-slave\workspace\maven-plugins-ITs-m3-windows\maven-assembly-plugin\target\classes
-> [Help 2]
[ERROR] Failed to execute goal org.apache.maven.plugins:maven-invoker-plugin:1.9:install (integration-test)
on project maven-javadoc-plugin: Failed to install project dependencies: MavenProject: org.apache.maven.plugins:maven-javadoc-plugin:2.10.4-SNAPSHOT
@ F:\hudson\hudson-slave\workspace\maven-plugins-ITs-m3-windows\maven-javadoc-plugin\pom.xml:
Failed to install project artifacts: MavenProject: org.apache.maven.plugins:maven-assembly-plugin:2.5.5-SNAPSHOT
@ F:\hudson\hudson-slave\workspace\maven-plugins-ITs-m3-windows\maven-assembly-plugin\pom.xml:
Failed to install artifact: org.apache.maven.plugins:maven-assembly-plugin:maven-plugin:2.5.5-SNAPSHOT:
Artifact is not fully assembled: F:\hudson\hudson-slave\workspace\maven-plugins-ITs-m3-windows\maven-assembly-plugin\target\classes
-> [Help 2]
[ERROR] Failed to execute goal org.apache.maven.plugins:maven-invoker-plugin:1.9:install (integration-test)
on project maven-linkcheck-plugin: Failed to install project dependencies: MavenProject: org.apache.maven.plugins:maven-linkcheck-plugin:1.3-SNAPSHOT
@ F:\hudson\hudson-slave\workspace\maven-plugins-ITs-m3-windows\maven-linkcheck-plugin\pom.xml:
Failed to install project artifacts: MavenProject: org.apache.maven.plugins:maven-assembly-plugin:2.5.5-SNAPSHOT
@ F:\hudson\hudson-slave\workspace\maven-plugins-ITs-m3-windows\maven-assembly-plugin\pom.xml:
Failed to install artifact: org.apache.maven.plugins:maven-assembly-plugin:maven-plugin:2.5.5-SNAPSHOT:
Artifact is not fully assembled: F:\hudson\hudson-slave\workspace\maven-plugins-ITs-m3-windows\maven-assembly-plugin\target\classes
-> [Help 2]
[ERROR] Failed to execute goal org.apache.maven.plugins:maven-invoker-plugin:1.9:install (integration-test)
on project maven-patch-plugin: Failed to install project dependencies: MavenProject: org.apache.maven.plugins:maven-patch-plugin:1.3-SNAPSHOT
@ F:\hudson\hudson-slave\workspace\maven-plugins-ITs-m3-windows\maven-patch-plugin\pom.xml:
Failed to install project artifacts: MavenProject: org.apache.maven.plugins:maven-assembly-plugin:2.5.5-SNAPSHOT
@ F:\hudson\hudson-slave\workspace\maven-plugins-ITs-m3-windows\maven-assembly-plugin\pom.xml:
Failed to install artifact: org.apache.maven.plugins:maven-assembly-plugin:maven-plugin:2.5.5-SNAPSHOT:
Artifact is not fully assembled: F:\hudson\hudson-slave\workspace\maven-plugins-ITs-m3-windows\maven-assembly-plugin\target\classes
-> [Help 2]
[ERROR] Failed to execute goal org.apache.maven.plugins:maven-invoker-plugin:1.9:install (integration-test)
on project maven-pdf-plugin: Failed to install project dependencies: MavenProject: org.apache.maven.plugins:maven-pdf-plugin:1.4-SNAPSHOT
@ F:\hudson\hudson-slave\workspace\maven-plugins-ITs-m3-windows\maven-pdf-plugin\pom.xml:
Failed to install project artifacts: MavenProject: org.apache.maven.plugins:maven-assembly-plugin:2.5.5-SNAPSHOT
@ F:\hudson\hudson-slave\workspace\maven-plugins-ITs-m3-windows\maven-assembly-plugin\pom.xml:
Failed to install artifact: org.apache.maven.plugins:maven-assembly-plugin:maven-plugin:2.5.5-SNAPSHOT:
Artifact is not fully assembled: F:\hudson\hudson-slave\workspace\maven-plugins-ITs-m3-windows\maven-assembly-plugin\target\classes
-> [Help 2]
[ERROR] Failed to execute goal org.apache.maven.plugins:maven-invoker-plugin:1.9:install (integration-test)
on project maven-rar-plugin: Failed to install project dependencies: MavenProject: org.apache.maven.plugins:maven-rar-plugin:2.5-SNAPSHOT
@ F:\hudson\hudson-slave\workspace\maven-plugins-ITs-m3-windows\maven-rar-plugin\pom.xml:
Failed to install project artifacts: MavenProject: org.apache.maven.plugins:maven-assembly-plugin:2.5.5-SNAPSHOT
@ F:\hudson\hudson-slave\workspace\maven-plugins-ITs-m3-windows\maven-assembly-plugin\pom.xml:
Failed to install artifact: org.apache.maven.plugins:maven-assembly-plugin:maven-plugin:2.5.5-SNAPSHOT:
Artifact is not fully assembled: F:\hudson\hudson-slave\workspace\maven-plugins-ITs-m3-windows\maven-assembly-plugin\target\classes
-> [Help 2]
[ERROR] Failed to execute goal org.apache.maven.plugins:maven-invoker-plugin:1.9:install (integration-test)
on project maven-repository-plugin: Failed to install project dependencies: MavenProject:
org.apache.maven.plugins:maven-repository-plugin:2.5-SNAPSHOT @ F:\hudson\hudson-slave\workspace\maven-plugins-ITs-m3-windows\maven-repository-plugin\pom.xml:
Failed to install project artifacts: MavenProject: org.apache.maven.plugins:maven-assembly-plugin:2.5.5-SNAPSHOT
@ F:\hudson\hudson-slave\workspace\maven-plugins-ITs-m3-windows\maven-assembly-plugin\pom.xml:
Failed to install artifact: org.apache.maven.plugins:maven-assembly-plugin:maven-plugin:2.5.5-SNAPSHOT:
Artifact is not fully assembled: F:\hudson\hudson-slave\workspace\maven-plugins-ITs-m3-windows\maven-assembly-plugin\target\classes
-> [Help 2]
[ERROR] Failed to execute goal org.apache.maven.plugins:maven-invoker-plugin:1.9:install (integration-test)
on project maven-resources-plugin: Failed to install project dependencies: MavenProject: org.apache.maven.plugins:maven-resources-plugin:2.8-SNAPSHOT
@ F:\hudson\hudson-slave\workspace\maven-plugins-ITs-m3-windows\maven-resources-plugin\pom.xml:
Failed to install project artifacts: MavenProject: org.apache.maven.plugins:maven-assembly-plugin:2.5.5-SNAPSHOT
@ F:\hudson\hudson-slave\workspace\maven-plugins-ITs-m3-windows\maven-assembly-plugin\pom.xml:
Failed to install artifact: org.apache.maven.plugins:maven-assembly-plugin:maven-plugin:2.5.5-SNAPSHOT:
Artifact is not fully assembled: F:\hudson\hudson-slave\workspace\maven-plugins-ITs-m3-windows\maven-assembly-plugin\target\classes
-> [Help 2]
[ERROR] Failed to execute goal org.apache.maven.plugins:maven-invoker-plugin:1.9:install (integration-test)
on project maven-site-plugin: Failed to install project dependencies: MavenProject: org.apache.maven.plugins:maven-site-plugin:3.4.1-SNAPSHOT
@ F:\hudson\hudson-slave\workspace\maven-plugins-ITs-m3-windows\maven-site-plugin\dependency-reduced-pom.xml:
Failed to install project artifacts: MavenProject: org.apache.maven.plugins:maven-assembly-plugin:2.5.5-SNAPSHOT
@ F:\hudson\hudson-slave\workspace\maven-plugins-ITs-m3-windows\maven-assembly-plugin\pom.xml:
Failed to install artifact: org.apache.maven.plugins:maven-assembly-plugin:maven-plugin:2.5.5-SNAPSHOT:
Artifact is not fully assembled: F:\hudson\hudson-slave\workspace\maven-plugins-ITs-m3-windows\maven-assembly-plugin\target\classes
-> [Help 2]
[ERROR] Failed to execute goal org.apache.maven.plugins:maven-invoker-plugin:1.9:install (integration-test)
on project maven-source-plugin: Failed to install project dependencies: MavenProject: org.apache.maven.plugins:maven-source-plugin:2.5-SNAPSHOT
@ F:\hudson\hudson-slave\workspace\maven-plugins-ITs-m3-windows\maven-source-plugin\pom.xml:
Failed to install project artifacts: MavenProject: org.apache.maven.plugins:maven-assembly-plugin:2.5.5-SNAPSHOT
@ F:\hudson\hudson-slave\workspace\maven-plugins-ITs-m3-windows\maven-assembly-plugin\pom.xml:
Failed to install artifact: org.apache.maven.plugins:maven-assembly-plugin:maven-plugin:2.5.5-SNAPSHOT:
Artifact is not fully assembled: F:\hudson\hudson-slave\workspace\maven-plugins-ITs-m3-windows\maven-assembly-plugin\target\classes
-> [Help 2]
[ERROR] Failed to execute goal org.apache.maven.plugins:maven-invoker-plugin:1.9:install (integration-test)
on project maven-stage-plugin: Failed to install project dependencies: MavenProject: org.apache.maven.plugins:maven-stage-plugin:1.1-SNAPSHOT
@ F:\hudson\hudson-slave\workspace\maven-plugins-ITs-m3-windows\maven-stage-plugin\pom.xml:
Failed to install project artifacts: MavenProject: org.apache.maven.plugins:maven-assembly-plugin:2.5.5-SNAPSHOT
@ F:\hudson\hudson-slave\workspace\maven-plugins-ITs-m3-windows\maven-assembly-plugin\pom.xml:
Failed to install artifact: org.apache.maven.plugins:maven-assembly-plugin:maven-plugin:2.5.5-SNAPSHOT:
Artifact is not fully assembled: F:\hudson\hudson-slave\workspace\maven-plugins-ITs-m3-windows\maven-assembly-plugin\target\classes
-> [Help 2]
[ERROR] Failed to execute goal org.apache.maven.plugins:maven-invoker-plugin:1.9:install (integration-test)
on project maven-toolchains-plugin: Failed to install project dependencies: MavenProject:
org.apache.maven.plugins:maven-toolchains-plugin:1.2-SNAPSHOT @ F:\hudson\hudson-slave\workspace\maven-plugins-ITs-m3-windows\maven-toolchains-plugin\pom.xml:
Failed to install project artifacts: MavenProject: org.apache.maven.plugins:maven-assembly-plugin:2.5.5-SNAPSHOT
@ F:\hudson\hudson-slave\workspace\maven-plugins-ITs-m3-windows\maven-assembly-plugin\pom.xml:
Failed to install artifact: org.apache.maven.plugins:maven-assembly-plugin:maven-plugin:2.5.5-SNAPSHOT:
Artifact is not fully assembled: F:\hudson\hudson-slave\workspace\maven-plugins-ITs-m3-windows\maven-assembly-plugin\target\classes
-> [Help 2]
[ERROR] Failed to execute goal org.apache.maven.plugins:maven-invoker-plugin:1.10:install
(integration-test) on project maven-verifier-plugin: Failed to install project dependencies:
MavenProject: org.apache.maven.plugins:maven-verifier-plugin:1.2-SNAPSHOT @ F:\hudson\hudson-slave\workspace\maven-plugins-ITs-m3-windows\maven-verifier-plugin\pom.xml:
Failed to install project artifacts: MavenProject: org.apache.maven.plugins:maven-assembly-plugin:2.5.5-SNAPSHOT
@ F:\hudson\hudson-slave\workspace\maven-plugins-ITs-m3-windows\maven-assembly-plugin\pom.xml:
Failed to install artifact: org.apache.maven.plugins:maven-assembly-plugin:maven-plugin:2.5.5-SNAPSHOT:
Artifact is not fully assembled: F:\hudson\hudson-slave\workspace\maven-plugins-ITs-m3-windows\maven-assembly-plugin\target\classes
-> [Help 2]
[ERROR] Failed to execute goal org.apache.maven.plugins:maven-invoker-plugin:1.9:install (integration-test)
on project maven-war-plugin: Failed to install project dependencies: MavenProject: org.apache.maven.plugins:maven-war-plugin:2.7-SNAPSHOT
@ F:\hudson\hudson-slave\workspace\maven-plugins-ITs-m3-windows\maven-war-plugin\pom.xml:
Failed to install project artifacts: MavenProject: org.apache.maven.plugins:maven-assembly-plugin:2.5.5-SNAPSHOT
@ F:\hudson\hudson-slave\workspace\maven-plugins-ITs-m3-windows\maven-assembly-plugin\pom.xml:
Failed to install artifact: org.apache.maven.plugins:maven-assembly-plugin:maven-plugin:2.5.5-SNAPSHOT:
Artifact is not fully assembled: F:\hudson\hudson-slave\workspace\maven-plugins-ITs-m3-windows\maven-assembly-plugin\target\classes
-> [Help 2]
[ERROR] Failed to execute goal org.apache.maven.plugins:maven-compiler-plugin:3.1:compile
(default-compile) on project maven-invoker-plugin: Compilation failure
[ERROR] javac: invalid flag: -s
[ERROR] Usage: javac <options> <source files>
[ERROR] where possible options include:
[ERROR] -g                         Generate all debugging info
[ERROR] -g:none                    Generate no debugging info
[ERROR] -g:{lines,vars,source}     Generate only some debugging info
[ERROR] -nowarn                    Generate no warnings
[ERROR] -verbose                   Output messages about what the compiler is doing
[ERROR] -deprecation               Output source locations where deprecated APIs are used
[ERROR] -classpath <path>          Specify where to find user class files
[ERROR] -cp <path>                 Specify where to find user class files
[ERROR] -sourcepath <path>         Specify where to find input source files
[ERROR] -bootclasspath <path>      Override location of bootstrap class files
[ERROR] -extdirs <dirs>            Override location of installed extensions
[ERROR] -endorseddirs <dirs>       Override location of endorsed standards path
[ERROR] -d <directory>             Specify where to place generated class files
[ERROR] -encoding <encoding>       Specify character encoding used by source files
[ERROR] -source <release>          Provide source compatibility with specified release
[ERROR] -target <release>          Generate class files for specific VM version
[ERROR] -version                   Version information
[ERROR] -help                      Print a synopsis of standard options
[ERROR] -X                         Print a synopsis of nonstandard options
[ERROR] -J<flag>                   Pass <flag> directly to the runtime system
[ERROR] -> [Help 1]
[ERROR] Failed to execute goal org.apache.maven.plugins:maven-invoker-plugin:1.9:install (integration-test)
on project maven-project-info-reports-plugin: Failed to install project dependencies: MavenProject:
org.apache.maven.plugins:maven-project-info-reports-plugin:2.9-SNAPSHOT @ F:\hudson\hudson-slave\workspace\maven-plugins-ITs-m3-windows\maven-project-info-reports-plugin\pom.xml:
Failed to install project artifacts: MavenProject: org.apache.maven.plugins:maven-assembly-plugin:2.5.5-SNAPSHOT
@ F:\hudson\hudson-slave\workspace\maven-plugins-ITs-m3-windows\maven-assembly-plugin\pom.xml:
Failed to install artifact: org.apache.maven.plugins:maven-assembly-plugin:maven-plugin:2.5.5-SNAPSHOT:
Artifact is not fully assembled: F:\hudson\hudson-slave\workspace\maven-plugins-ITs-m3-windows\maven-assembly-plugin\target\classes
-> [Help 2]
[ERROR] Failed to execute goal org.apache.maven.plugins:maven-invoker-plugin:1.9:install (integration-test)
on project maven-remote-resources-plugin: Failed to install project dependencies: MavenProject:
org.apache.maven.plugins:maven-remote-resources-plugin:1.6-SNAPSHOT @ F:\hudson\hudson-slave\workspace\maven-plugins-ITs-m3-windows\maven-remote-resources-plugin\pom.xml:
Failed to install project artifacts: MavenProject: org.apache.maven.plugins:maven-assembly-plugin:2.5.5-SNAPSHOT
@ F:\hudson\hudson-slave\workspace\maven-plugins-ITs-m3-windows\maven-assembly-plugin\pom.xml:
Failed to install artifact: org.apache.maven.plugins:maven-assembly-plugin:maven-plugin:2.5.5-SNAPSHOT:
Artifact is not fully assembled: F:\hudson\hudson-slave\workspace\maven-plugins-ITs-m3-windows\maven-assembly-plugin\target\classes
-> [Help 2]
[ERROR] Failed to execute goal org.apache.maven.plugins:maven-invoker-plugin:1.9:install (integration-test)
on project maven-shade-plugin: Failed to install project dependencies: MavenProject: org.apache.maven.plugins:maven-shade-plugin:2.4-SNAPSHOT
@ F:\hudson\hudson-slave\workspace\maven-plugins-ITs-m3-windows\maven-shade-plugin\pom.xml:
Failed to install project artifacts: MavenProject: org.apache.maven.plugins:maven-assembly-plugin:2.5.5-SNAPSHOT
@ F:\hudson\hudson-slave\workspace\maven-plugins-ITs-m3-windows\maven-assembly-plugin\pom.xml:
Failed to install artifact: org.apache.maven.plugins:maven-assembly-plugin:maven-plugin:2.5.5-SNAPSHOT:
Artifact is not fully assembled: F:\hudson\hudson-slave\workspace\maven-plugins-ITs-m3-windows\maven-assembly-plugin\target\classes
-> [Help 2]
[ERROR] Failed to execute goal org.apache.maven.plugins:maven-invoker-plugin:1.9:install (integration-test)
on project maven-scm-publish-plugin: Failed to install project dependencies: MavenProject:
org.apache.maven.plugins:maven-scm-publish-plugin:1.2-SNAPSHOT @ F:\hudson\hudson-slave\workspace\maven-plugins-ITs-m3-windows\maven-scm-publish-plugin\pom.xml:
Failed to install project artifacts: MavenProject: org.apache.maven.plugins:maven-assembly-plugin:2.5.5-SNAPSHOT
@ F:\hudson\hudson-slave\workspace\maven-plugins-ITs-m3-windows\maven-assembly-plugin\pom.xml:
Failed to install artifact: org.apache.maven.plugins:maven-assembly-plugin:maven-plugin:2.5.5-SNAPSHOT:
Artifact is not fully assembled: F:\hudson\hudson-slave\workspace\maven-plugins-ITs-m3-windows\maven-assembly-plugin\target\classes
-> [Help 2]
[ERROR] 
[ERROR] To see the full stack trace of the errors, re-run Maven with the -e switch.
[ERROR] Re-run Maven using the -X switch to enable full debug logging.
[ERROR] 
[ERROR] For more information about the errors and possible solutions, please read the following
articles:
[ERROR] [Help 1] http://cwiki.apache.org/confluence/display/MAVEN/MojoFailureException
[ERROR] [Help 2] http://cwiki.apache.org/confluence/display/MAVEN/MojoExecutionException
[ERROR] 
[ERROR] After correcting the problems, you can resume the build with the command
[ERROR]   mvn <goals> -rf :maven-assembly-plugin
Build step 'Invoke top-level Maven targets' marked build as failure
Recording test results
Invalid address: dantran@QBServer.(none)

Mime
View raw message