maven-notifications mailing list archives

Site index · List index
Message view « Date » · « Thread »
Top « Date » · « Thread »
From Apache Jenkins Server <jenk...@builds.apache.org>
Subject Build failed in Jenkins: maven-skins #217
Date Mon, 04 May 2015 20:40:31 GMT
See <https://builds.apache.org/job/maven-skins/217/changes>

Changes:

[Michael Osipov] [MSKINS-115] Remove old and horribly outdated press.apt

[Michael Osipov] [MSKINS-113] Update of the description accordingly to MSKINS-110

[Michael Osipov] [MSKINS-100] Fluido skin ignores changes from DOXIASITETOOLS-71

------------------------------------------
[...truncated 1162 lines...]
         |  |             Project Team</a>
         |  |                 </li>
         |  |                         
         |  |           <li>
         |  |       
         |  |                               <a href="source-repository.html" title="Source
Repository">
         |  |               <span class="none"></span>
         |  |             Source Repository</a>
         |  |                 </li>
         |  |                         
         |  |           <li>
         |  |       
         |  |                               <a href="plugin-management.html" title="Plugin
Management">
         |  |               <span class="none"></span>
         |  |             Plugin Management</a>
         |  |                 </li>
         |  |                         
         |  |           <li>
         |  |       
         |  |                               <a href="project-summary.html" title="Project
Summary">
         |  |               <span class="none"></span>
         |  |             Project Summary</a>
         |  |                 </li>
         |  |                   </ul>
         |  |             </li>
         |  |                 </ul>
         |  |                     
         |  |                         
         |  |                     
         |  |               <hr />
         |  |      
         |  |                <div id="poweredBy">
         |  |                                 <div class="clear"></div>
         |  |                                 <div class="clear"></div>
         |  |                                 <div class="clear"></div>
         |  |                                 <div class="clear"></div>
         |  |                                  <a href="http://maven.apache.org/" title="Built
by Maven" class="poweredBy">
         |  |             <img class="builtBy" alt="Built by Maven" src="./images/logos/maven-feather.png"
/>
         |  |           </a>
         |  |                       </div>
         |  |               </div>
         |  |             </div>
         |  |             
         |  |                     
         |  |             <div id="bodyColumn"  class="span10" >
         |  |                                       
         |  |                 <div class="section">
         |  |     <h2>About mskins-10<a name="About_mskins-10"></a></h2><a
name="About_mskins-10"></a>
         |  |     <p>There is currently no description associated with this project.</p></div>
         |  |                       </div>
         |  |                 </div>
         |  |               </div>
         |  |      
         |  |         <hr/>
         |  |      
         |  |         <footer>
         |  |                 <div class="container-fluid">
         |  |                           <div class="row-fluid">
         |  |                                           <p >Copyright &copy;   
               2015.
         |  |               All rights reserved.      
         |  |                         
         |  |           </p>
         |  |                     </div>
         |  |      
         |  |             
         |  |                     </div>
         |  |         </footer>
         |  |             </body>
         |  |     </html>
         |  <https://builds.apache.org/job/maven-skins/ws/maven-fluido-skin/target/it/mskins-10/target/site/index.html>
         false
[INFO] Building: mskins-33/pom.xml
[INFO] ..SUCCESS (44.3 s)
[INFO] Building: mskins-33_topbar/pom.xml
[INFO] ..SUCCESS (18.1 s)
[INFO] Building: mskins-34/pom.xml
[INFO] ..SUCCESS (9.3 s)
[INFO] Building: mskins-16/pom.xml
[INFO] ..SUCCESS (6.8 s)
[INFO] Building: sidebar/pom.xml
[INFO] ..SUCCESS (9.4 s)
[INFO] Building: mskins-22_default/pom.xml
[INFO] ..SUCCESS (9.0 s)
[INFO] Building: mskins-31/pom.xml
[INFO] ..SUCCESS (7.1 s)
[JENKINS] Recording test results
[INFO] 
[INFO] --- maven-checkstyle-plugin:2.13:check (checkstyle-check) @ maven-fluido-skin ---
[INFO] 
[INFO] 
[INFO] --- maven-invoker-plugin:1.9:verify (integration-test) @ maven-fluido-skin ---
[INFO] -------------------------------------------------
[INFO] Build Summary:
[INFO]   Passed: 30, Failed: 1, Errors: 0, Skipped: 0
[INFO] -------------------------------------------------
[ERROR] The following builds failed:
[ERROR] *  mskins-10/pom.xml
[INFO] -------------------------------------------------
[INFO]                                                                         
[INFO] ------------------------------------------------------------------------
[INFO] Building Maven Skins Aggregator 1-SNAPSHOT
[INFO] ------------------------------------------------------------------------
[INFO] 
[INFO] --- maven-clean-plugin:2.5:clean (default-clean) @ maven-skins-aggregator ---
[INFO] 
[INFO] --- maven-enforcer-plugin:1.3.1:enforce (enforce-bytecode-version) @ maven-skins-aggregator
---
[INFO] 
[INFO] --- maven-enforcer-plugin:1.3.1:enforce (ban-known-bad-maven-versions) @ maven-skins-aggregator
---
[INFO] 
[INFO] --- apache-rat-plugin:0.11:check (rat-check) @ maven-skins-aggregator ---
[INFO] 57 implicit excludes (use -debug for more details).
[INFO] Exclude: DEPENDENCIES
[INFO] 3 resources included (use -debug for more details)
[INFO] Rat check: Summary of files. Unapproved: 0 unknown: 0 generated: 0 approved: 2 licence.
[INFO] 
[INFO] --- maven-remote-resources-plugin:1.5:process (default) @ maven-skins-aggregator ---
[INFO] 
[INFO] --- maven-site-plugin:3.4:attach-descriptor (attach-descriptor) @ maven-skins-aggregator
---
[INFO] 
[INFO] --- maven-checkstyle-plugin:2.13:check (checkstyle-check) @ maven-skins-aggregator
---
[INFO] 
[INFO] 
[INFO] --- maven-install-plugin:2.5.2:install (default-install) @ maven-skins-aggregator ---
[INFO] Installing <https://builds.apache.org/job/maven-skins/ws/pom.xml> to /home/jenkins/jenkins-slave/maven-repositories/1/org/apache/maven/skins/maven-skins-aggregator/1-SNAPSHOT/maven-skins-aggregator-1-SNAPSHOT.pom
[INFO] Installing <https://builds.apache.org/job/maven-skins/ws/target/maven-skins-aggregator-1-SNAPSHOT-site.xml>
to /home/jenkins/jenkins-slave/maven-repositories/1/org/apache/maven/skins/maven-skins-aggregator/1-SNAPSHOT/maven-skins-aggregator-1-SNAPSHOT-site.xml
[INFO] ------------------------------------------------------------------------
[INFO] Reactor Summary:
[INFO] 
[INFO] Maven Skins ....................................... SUCCESS [4.754s]
[INFO] Maven Application Skin ............................ SUCCESS [20.264s]
[INFO] Maven Default Skin ................................ SUCCESS [11.927s]
[INFO] Maven Classic Skin ................................ SUCCESS [11.265s]
[INFO] Maven Stylus Skin ................................. SUCCESS [24.411s]
[INFO] Apache Maven Fluido Skin .......................... FAILURE [7:52.119s]
[INFO] Maven Skins Aggregator ............................ SUCCESS [1.202s]
[INFO] ------------------------------------------------------------------------
[INFO] BUILD FAILURE
[INFO] ------------------------------------------------------------------------
[INFO] Total time: 9:09.854s
[INFO] Finished at: Mon May 04 20:40:29 UTC 2015
[INFO] Final Memory: 38M/473M
[INFO] ------------------------------------------------------------------------
Waiting for Jenkins to finish collecting data[ERROR] Failed to execute goal org.apache.maven.plugins:maven-invoker-plugin:1.9:verify
(integration-test) on project maven-fluido-skin: 1 build failed. See console output above
for details. -> [Help 1]
org.apache.maven.lifecycle.LifecycleExecutionException: Failed to execute goal org.apache.maven.plugins:maven-invoker-plugin:1.9:verify
(integration-test) on project maven-fluido-skin: 1 build failed. See console output above
for details.
	at org.apache.maven.lifecycle.internal.MojoExecutor.execute(MojoExecutor.java:213)
	at org.apache.maven.lifecycle.internal.MojoExecutor.execute(MojoExecutor.java:153)
	at org.apache.maven.lifecycle.internal.MojoExecutor.execute(MojoExecutor.java:145)
	at org.apache.maven.lifecycle.internal.LifecycleModuleBuilder.buildProject(LifecycleModuleBuilder.java:84)
	at org.apache.maven.lifecycle.internal.LifecycleModuleBuilder.buildProject(LifecycleModuleBuilder.java:59)
	at org.apache.maven.lifecycle.internal.LifecycleStarter.singleThreadedBuild(LifecycleStarter.java:183)
	at org.apache.maven.lifecycle.internal.LifecycleStarter.execute(LifecycleStarter.java:161)
	at org.apache.maven.DefaultMaven.doExecute(DefaultMaven.java:320)
	at org.apache.maven.DefaultMaven.execute(DefaultMaven.java:156)
	at org.jvnet.hudson.maven3.launcher.Maven3Launcher.main(Maven3Launcher.java:117)
	at sun.reflect.NativeMethodAccessorImpl.invoke0(Native Method)
	at sun.reflect.NativeMethodAccessorImpl.invoke(NativeMethodAccessorImpl.java:39)
	at sun.reflect.DelegatingMethodAccessorImpl.invoke(DelegatingMethodAccessorImpl.java:25)
	at java.lang.reflect.Method.invoke(Method.java:597)
	at org.codehaus.plexus.classworlds.launcher.Launcher.launchStandard(Launcher.java:329)
	at org.codehaus.plexus.classworlds.launcher.Launcher.launch(Launcher.java:239)
	at org.jvnet.hudson.maven3.agent.Maven3Main.launch(Maven3Main.java:178)
	at sun.reflect.NativeMethodAccessorImpl.invoke0(Native Method)
	at sun.reflect.NativeMethodAccessorImpl.invoke(NativeMethodAccessorImpl.java:39)
	at sun.reflect.DelegatingMethodAccessorImpl.invoke(DelegatingMethodAccessorImpl.java:25)
	at java.lang.reflect.Method.invoke(Method.java:597)
	at hudson.maven.Maven3Builder.call(Maven3Builder.java:136)
	at hudson.maven.Maven3Builder.call(Maven3Builder.java:71)
	at hudson.remoting.UserRequest.perform(UserRequest.java:118)
	at hudson.remoting.UserRequest.perform(UserRequest.java:48)
	at hudson.remoting.Request$2.run(Request.java:328)
	at hudson.remoting.InterceptingExecutorService$1.call(InterceptingExecutorService.java:72)
	at java.util.concurrent.FutureTask$Sync.innerRun(FutureTask.java:303)
	at java.util.concurrent.FutureTask.run(FutureTask.java:138)
	at java.util.concurrent.ThreadPoolExecutor$Worker.runTask(ThreadPoolExecutor.java:895)
	at java.util.concurrent.ThreadPoolExecutor$Worker.run(ThreadPoolExecutor.java:918)
	at java.lang.Thread.run(Thread.java:662)
Caused by: org.apache.maven.plugin.MojoFailureException: 1 build failed. See console output
above for details.
	at org.apache.maven.plugin.invoker.InvokerSession.handleFailures(InvokerSession.java:258)
	at org.apache.maven.plugin.invoker.VerifyMojo.execute(VerifyMojo.java:137)
	at org.apache.maven.plugin.DefaultBuildPluginManager.executeMojo(DefaultBuildPluginManager.java:101)
	at org.apache.maven.lifecycle.internal.MojoExecutor.execute(MojoExecutor.java:209)
	... 31 more
[ERROR] 
[ERROR] Re-run Maven using the -X switch to enable full debug logging.
[ERROR] 
[ERROR] For more information about the errors and possible solutions, please read the following
articles:
[ERROR] [Help 1] http://cwiki.apache.org/confluence/display/MAVEN/MojoFailureException
[ERROR] 
[ERROR] After correcting the problems, you can resume the build with the command
[ERROR]   mvn <goals> -rf :maven-fluido-skin

[JENKINS] Archiving <https://builds.apache.org/job/maven-skins/ws/maven-fluido-skin/pom.xml>
to org.apache.maven.skins/maven-fluido-skin/1.5-SNAPSHOT/maven-fluido-skin-1.5-SNAPSHOT.pom
[JENKINS] Archiving <https://builds.apache.org/job/maven-skins/ws/maven-fluido-skin/target/maven-fluido-skin-1.5-SNAPSHOT.jar>
to org.apache.maven.skins/maven-fluido-skin/1.5-SNAPSHOT/maven-fluido-skin-1.5-SNAPSHOT.jar
Sending artifact delta relative to maven-skins » Apache Maven Fluido Skin #216
Archived 2 artifacts
Archive block size is 32768
Received 1 blocks and 339291 bytes
Compression is 8.8%
Took 0.18 sec
[JENKINS] Archiving <https://builds.apache.org/job/maven-skins/ws/maven-skins/pom.xml>
to org.apache.maven.skins/maven-skins/11-SNAPSHOT/maven-skins-11-SNAPSHOT.pom
[JENKINS] Archiving <https://builds.apache.org/job/maven-skins/ws/maven-skins/target/maven-skins-11-SNAPSHOT-site.xml>
to org.apache.maven.skins/maven-skins/11-SNAPSHOT/maven-skins-11-SNAPSHOT-site.xml
Sending artifact delta relative to maven-skins » Maven Skins #216
Archived 2 artifacts
Archive block size is 32768
Received 0 blocks and 4320 bytes
Compression is 0.0%
Took 49 ms
[JENKINS] Archiving <https://builds.apache.org/job/maven-skins/ws/maven-default-skin/pom.xml>
to org.apache.maven.skins/maven-default-skin/1.2-SNAPSHOT/maven-default-skin-1.2-SNAPSHOT.pom
[JENKINS] Archiving <https://builds.apache.org/job/maven-skins/ws/maven-default-skin/target/maven-default-skin-1.2-SNAPSHOT.jar>
to org.apache.maven.skins/maven-default-skin/1.2-SNAPSHOT/maven-default-skin-1.2-SNAPSHOT.jar
Sending artifact delta relative to maven-skins » Maven Default Skin #216
Archived 2 artifacts
Archive block size is 32768
Received 0 blocks and 17678 bytes
Compression is 0.0%
Took 51 ms
[JENKINS] Archiving <https://builds.apache.org/job/maven-skins/ws/maven-application-skin/pom.xml>
to org.apache.maven.skins/maven-application-skin/1.1-SNAPSHOT/maven-application-skin-1.1-SNAPSHOT.pom
[JENKINS] Archiving <https://builds.apache.org/job/maven-skins/ws/maven-application-skin/target/maven-application-skin-1.1-SNAPSHOT.jar>
to org.apache.maven.skins/maven-application-skin/1.1-SNAPSHOT/maven-application-skin-1.1-SNAPSHOT.jar
Sending artifact delta relative to maven-skins » Maven Application Skin #216
Archived 2 artifacts
Archive block size is 32768
Received 0 blocks and 22043 bytes
Compression is 0.0%
Took 32 ms
[JENKINS] Archiving <https://builds.apache.org/job/maven-skins/ws/maven-stylus-skin/pom.xml>
to org.apache.maven.skins/maven-stylus-skin/1.6-SNAPSHOT/maven-stylus-skin-1.6-SNAPSHOT.pom
[JENKINS] Archiving <https://builds.apache.org/job/maven-skins/ws/maven-stylus-skin/target/maven-stylus-skin-1.6-SNAPSHOT.jar>
to org.apache.maven.skins/maven-stylus-skin/1.6-SNAPSHOT/maven-stylus-skin-1.6-SNAPSHOT.jar
Sending artifact delta relative to maven-skins » Maven Stylus Skin #216
Archived 2 artifacts
Archive block size is 32768
Received 0 blocks and 165976 bytes
Compression is 0.0%
Took 0.1 sec
[JENKINS] Archiving <https://builds.apache.org/job/maven-skins/ws/maven-classic-skin/pom.xml>
to org.apache.maven.skins/maven-classic-skin/1.2-SNAPSHOT/maven-classic-skin-1.2-SNAPSHOT.pom
[JENKINS] Archiving <https://builds.apache.org/job/maven-skins/ws/maven-classic-skin/target/maven-classic-skin-1.2-SNAPSHOT.jar>
to org.apache.maven.skins/maven-classic-skin/1.2-SNAPSHOT/maven-classic-skin-1.2-SNAPSHOT.jar
Sending artifact delta relative to maven-skins » Maven Classic Skin #216
Archived 2 artifacts
Archive block size is 32768
Received 0 blocks and 40725 bytes
Compression is 0.0%
Took 50 ms
[JENKINS] Archiving <https://builds.apache.org/job/maven-skins/ws/pom.xml> to org.apache.maven.skins/maven-skins-aggregator/1-SNAPSHOT/maven-skins-aggregator-1-SNAPSHOT.pom
[JENKINS] Archiving <https://builds.apache.org/job/maven-skins/ws/target/maven-skins-aggregator-1-SNAPSHOT-site.xml>
to org.apache.maven.skins/maven-skins-aggregator/1-SNAPSHOT/maven-skins-aggregator-1-SNAPSHOT-site.xml
Sending artifact delta relative to maven-skins » Maven Skins Aggregator #216
Archived 2 artifacts
Archive block size is 32768
Received 0 blocks and 3164 bytes
Compression is 0.0%
Took 33 ms
Sending e-mails to: notifications@maven.apache.org michaelo@apache.org
channel stopped

Mime
View raw message