maven-notifications mailing list archives

Site index · List index
Message view « Date » · « Thread »
Top « Date » · « Thread »
From Apache Jenkins Server <jenk...@builds.apache.org>
Subject Build failed in Jenkins: maven-plugins #3673
Date Fri, 29 May 2015 11:46:23 GMT
See <https://builds.apache.org/job/maven-plugins/3673/changes>

Changes:

[olamy] Move plugin configuration outside executions

As described by Ron Wheeler at:
http://mail-archives.apache.org/mod_mbox/maven-users/201505.mbox/%3C554C33D1.3000502%40artifact-software.com%3E

------------------------------------------
Started by an SCM change
Building remotely on jenkins-ubuntu-1404-4gb-933 (jenkins-cloud-4GB cloud-slave Ubuntu ubuntu)
in workspace <https://builds.apache.org/job/maven-plugins/ws/>
Updating http://svn.apache.org/repos/asf/maven/plugins/trunk at revision '2015-05-29T11:46:08.239
+0000'
U         maven-dependency-plugin/src/site/apt/examples/copying-artifacts.apt.vm
At revision 1682429
Parsing POMs
Downloaded artifact http://repository.apache.org/snapshots/org/apache/maven/maven-parent/27-SNAPSHOT/maven-metadata.xml
Failed to transfer Could not find metadata org.apache:apache:17-SNAPSHOT/maven-metadata.xml
in Nexus (http://repository.apache.org/snapshots)
Failed to transfer Could not find artifact org.apache:apache:pom:17-SNAPSHOT in Nexus (http://repository.apache.org/snapshots)
ERROR: Failed to parse POMs
java.io.IOException: remote file operation failed: <https://builds.apache.org/job/maven-plugins/ws/>
at hudson.remoting.Channel@343db06:jenkins-ubuntu-1404-4gb-933
	at hudson.FilePath.act(FilePath.java:916)
	at hudson.FilePath.act(FilePath.java:893)
	at hudson.maven.MavenModuleSetBuild$MavenModuleSetBuildExecution.parsePoms(MavenModuleSetBuild.java:950)
	at hudson.maven.MavenModuleSetBuild$MavenModuleSetBuildExecution.doRun(MavenModuleSetBuild.java:677)
	at hudson.model.AbstractBuild$AbstractBuildExecution.run(AbstractBuild.java:529)
	at hudson.model.Run.execute(Run.java:1706)
	at hudson.maven.MavenModuleSetBuild.run(MavenModuleSetBuild.java:529)
	at hudson.model.ResourceController.execute(ResourceController.java:88)
	at hudson.model.Executor.run(Executor.java:232)
Caused by: hudson.remoting.ProxyException: hudson.maven.MavenModuleSetBuild$MavenExecutionException:
org.apache.maven.project.ProjectBuildingException: Some problems were encountered while processing
the POMs:
[FATAL] Non-resolvable parent POM for org.apache.maven:maven-parent:27-SNAPSHOT: Could not
find artifact org.apache:apache:pom:17-SNAPSHOT in Nexus (http://repository.apache.org/snapshots)
@ org.apache.maven:maven-parent:27-SNAPSHOT, /jenkins/maven-repositories/0/org/apache/maven/maven-parent/27-SNAPSHOT/maven-parent-27-SNAPSHOT.pom,
line 26, column 11

	at hudson.maven.MavenModuleSetBuild$PomParser.invoke(MavenModuleSetBuild.java:1354)
	at hudson.maven.MavenModuleSetBuild$PomParser.invoke(MavenModuleSetBuild.java:1088)
	at hudson.FilePath$FileCallableWrapper.call(FilePath.java:2474)
	at hudson.remoting.UserRequest.perform(UserRequest.java:118)
	at hudson.remoting.UserRequest.perform(UserRequest.java:48)
	at hudson.remoting.Request$2.run(Request.java:328)
	at hudson.remoting.InterceptingExecutorService$1.call(InterceptingExecutorService.java:72)
	at java.util.concurrent.FutureTask.run(FutureTask.java:262)
	at java.util.concurrent.ThreadPoolExecutor.runWorker(ThreadPoolExecutor.java:1145)
	at java.util.concurrent.ThreadPoolExecutor$Worker.run(ThreadPoolExecutor.java:615)
	at java.lang.Thread.run(Thread.java:745)
Caused by: hudson.remoting.ProxyException: org.apache.maven.project.ProjectBuildingException:
Some problems were encountered while processing the POMs:
[FATAL] Non-resolvable parent POM for org.apache.maven:maven-parent:27-SNAPSHOT: Could not
find artifact org.apache:apache:pom:17-SNAPSHOT in Nexus (http://repository.apache.org/snapshots)
@ org.apache.maven:maven-parent:27-SNAPSHOT, /jenkins/maven-repositories/0/org/apache/maven/maven-parent/27-SNAPSHOT/maven-parent-27-SNAPSHOT.pom,
line 26, column 11

	at org.apache.maven.project.DefaultProjectBuilder.build(DefaultProjectBuilder.java:364)
	at hudson.maven.MavenEmbedder.buildProjects(MavenEmbedder.java:361)
	at hudson.maven.MavenEmbedder.readProjects(MavenEmbedder.java:331)
	at hudson.maven.MavenModuleSetBuild$PomParser.invoke(MavenModuleSetBuild.java:1291)
	... 10 more
[WARNINGS] Skipping publisher since build result is FAILURE

Mime
View raw message