maven-notifications mailing list archives

Site index · List index
Message view « Date » · « Thread »
Top « Date » · « Thread »
From Apache Jenkins Server <jenk...@builds.apache.org>
Subject Build failed in Jenkins: maven-plugins-windows #1090
Date Mon, 23 Feb 2015 22:27:20 GMT
See <https://builds.apache.org/job/maven-plugins-windows/1090/changes>

Changes:

[khmarbaise] [maven-release-plugin] prepare for next development iteration

[khmarbaise] [maven-release-plugin] prepare release maven-stage-plugin-1.0

------------------------------------------
Started by an SCM change
Building remotely on windows2 (Windows) in workspace <https://builds.apache.org/job/maven-plugins-windows/ws/>
Updating http://svn.apache.org/repos/asf/maven/plugins/trunk at revision '2015-02-23T14:24:11.528
-0800'
U         maven-stage-plugin\pom.xml
U         maven-ear-plugin\src\main\java\org\apache\maven\plugin\ear\EarMojo.java
At revision 1661801
Parsing POMs
ERROR: Failed to parse POMs
java.io.IOException: remote file operation failed: <https://builds.apache.org/job/maven-plugins-windows/ws/>
at hudson.remoting.Channel@868d0aa:windows2
	at hudson.FilePath.act(FilePath.java:916)
	at hudson.FilePath.act(FilePath.java:893)
	at hudson.maven.MavenModuleSetBuild$MavenModuleSetBuildExecution.parsePoms(MavenModuleSetBuild.java:950)
	at hudson.maven.MavenModuleSetBuild$MavenModuleSetBuildExecution.doRun(MavenModuleSetBuild.java:677)
	at hudson.model.AbstractBuild$AbstractBuildExecution.run(AbstractBuild.java:529)
	at hudson.model.Run.execute(Run.java:1706)
	at hudson.maven.MavenModuleSetBuild.run(MavenModuleSetBuild.java:529)
	at hudson.model.ResourceController.execute(ResourceController.java:88)
	at hudson.model.Executor.run(Executor.java:232)
Caused by: java.io.IOException: Remote call on windows2 failed
	at hudson.remoting.Channel.call(Channel.java:751)
	at hudson.FilePath.act(FilePath.java:909)
	... 8 more
Caused by: java.lang.OutOfMemoryError: PermGen space
	at org.eclipse.aether.connector.wagon.WagonRepositoryConnector.<init>(WagonRepositoryConnector.java:146)
	at org.eclipse.aether.connector.wagon.WagonRepositoryConnectorFactory.newInstance(WagonRepositoryConnectorFactory.java:159)
	at org.eclipse.aether.internal.impl.DefaultRepositoryConnectorProvider.newRepositoryConnector(DefaultRepositoryConnectorProvider.java:140)
	at org.eclipse.aether.internal.impl.DefaultMetadataResolver$ResolveTask.run(DefaultMetadataResolver.java:617)
	at org.eclipse.aether.util.concurrency.RunnableErrorForwarder$1.run(RunnableErrorForwarder.java:67)
	at org.eclipse.aether.internal.impl.DefaultMetadataResolver$1.execute(DefaultMetadataResolver.java:541)
	at org.eclipse.aether.internal.impl.DefaultMetadataResolver.resolve(DefaultMetadataResolver.java:396)
	at org.eclipse.aether.internal.impl.DefaultMetadataResolver.resolveMetadata(DefaultMetadataResolver.java:219)
	at org.apache.maven.repository.internal.DefaultVersionResolver.resolveVersion(DefaultVersionResolver.java:250)
	at org.eclipse.aether.internal.impl.DefaultArtifactResolver.resolve(DefaultArtifactResolver.java:318)
	at org.eclipse.aether.internal.impl.DefaultArtifactResolver.resolveArtifacts(DefaultArtifactResolver.java:262)
	at org.eclipse.aether.internal.impl.DefaultArtifactResolver.resolveArtifact(DefaultArtifactResolver.java:239)
	at org.eclipse.aether.internal.impl.DefaultRepositorySystem.resolveArtifact(DefaultRepositorySystem.java:295)
	at org.apache.maven.project.ProjectModelResolver.resolveModel(ProjectModelResolver.java:155)
	at org.apache.maven.model.building.DefaultModelBuilder.readParentExternally(DefaultModelBuilder.java:817)
	at org.apache.maven.model.building.DefaultModelBuilder.readParent(DefaultModelBuilder.java:669)
	at org.apache.maven.model.building.DefaultModelBuilder.build(DefaultModelBuilder.java:307)
	at org.apache.maven.project.DefaultProjectBuilder.build(DefaultProjectBuilder.java:411)
	at org.apache.maven.project.DefaultProjectBuilder.build(DefaultProjectBuilder.java:380)
	at org.apache.maven.project.DefaultProjectBuilder.build(DefaultProjectBuilder.java:496)
	at org.apache.maven.project.DefaultProjectBuilder.build(DefaultProjectBuilder.java:380)
	at org.apache.maven.project.DefaultProjectBuilder.build(DefaultProjectBuilder.java:344)
	at hudson.maven.MavenEmbedder.buildProjects(MavenEmbedder.java:361)
	at hudson.maven.MavenEmbedder.readProjects(MavenEmbedder.java:331)
	at hudson.maven.MavenModuleSetBuild$PomParser.invoke(MavenModuleSetBuild.java:1291)
	at hudson.maven.MavenModuleSetBuild$PomParser.invoke(MavenModuleSetBuild.java:1088)
	at hudson.FilePath$FileCallableWrapper.call(FilePath.java:2474)
	at hudson.remoting.UserRequest.perform(UserRequest.java:118)
	at hudson.remoting.UserRequest.perform(UserRequest.java:48)
	at hudson.remoting.Request$2.run(Request.java:328)
	at hudson.remoting.InterceptingExecutorService$1.call(InterceptingExecutorService.java:72)
	at java.util.concurrent.FutureTask.run(Unknown Source)
[WARNINGS] Skipping publisher since build result is FAILURE

Mime
View raw message