maven-notifications mailing list archives

Site index · List index
Message view « Date » · « Thread »
Top « Date » · « Thread »
From Apache Jenkins Server <jenk...@builds.apache.org>
Subject Build failed in Jenkins: maven-archetype-m2 » Maven Archetype #125
Date Thu, 12 Feb 2015 01:17:22 GMT
See <https://builds.apache.org/job/maven-archetype-m2/org.apache.maven.archetype$maven-archetype/125/changes>

Changes:

[bimargulies] No jira: add pointer to git.

------------------------------------------
[...truncated 1065 lines...]
Downloading: http://repo1.maven.org/maven2/org/apache/maven/doxia/doxia-site-renderer/1.4/doxia-site-renderer-1.4.jar
160K downloaded  (maven-shared-utils-0.6.jar)
60K downloaded  (plexus-interpolation-1.19.jar)
51K downloaded  (doxia-site-renderer-1.4.jar)
Downloading: http://repo1.maven.org/maven2/commons-beanutils/commons-beanutils-core/1.8.3/commons-beanutils-core-1.8.3.jar
Downloading: http://repo1.maven.org/maven2/org/apache/maven/doxia/doxia-decoration-model/1.4/doxia-decoration-model-1.4.jar
201K downloaded  (commons-beanutils-core-1.8.3.jar)
59K downloaded  (doxia-decoration-model-1.4.jar)
644K downloaded  (checkstyle-5.7.jar)
Downloading: http://repo1.maven.org/maven2/org/apache/maven/doxia/doxia-module-xhtml/1.4/doxia-module-xhtml-1.4.jar
1956K downloaded  (guava-jdk5-14.0.1.jar)
15K downloaded  (doxia-module-xhtml-1.4.jar)
Downloading: http://repo1.maven.org/maven2/org/apache/maven/doxia/doxia-module-fml/1.4/doxia-module-fml-1.4.jar
36K downloaded  (doxia-module-fml-1.4.jar)
[WARNING] DEPRECATED [sourceDirectory]: instead use {@link #sourceDirectories}
[WARNING] DEPRECATED [testSourceDirectory]: instead use {@link #testSourceDirectories}
[INFO] [checkstyle:check {execution: checkstyle-check}]
[INFO] 
Downloading: http://repo1.maven.org/maven2/org/apache/rat/apache-rat-core/0.11/apache-rat-core-0.11.pom
4K downloaded  (apache-rat-core-0.11.pom)
Downloading: http://repo1.maven.org/maven2/commons-lang/commons-lang/2.6/commons-lang-2.6.pom
17K downloaded  (commons-lang-2.6.pom)
Downloading: http://repo1.maven.org/maven2/org/apache/commons/commons-parent/17/commons-parent-17.pom
30K downloaded  (commons-parent-17.pom)
Downloading: http://repo1.maven.org/maven2/commons-io/commons-io/2.2/commons-io-2.2.pom
10K downloaded  (commons-io-2.2.pom)
Downloading: http://repo1.maven.org/maven2/org/apache/commons/commons-parent/24/commons-parent-24.pom
46K downloaded  (commons-parent-24.pom)
Downloading: http://repo1.maven.org/maven2/org/apache/maven/shared/maven-plugin-testing-harness/1.1/maven-plugin-testing-harness-1.1.pom
6K downloaded  (maven-plugin-testing-harness-1.1.pom)
Downloading: http://repo1.maven.org/maven2/org/apache/maven/shared/maven-shared-components/7/maven-shared-components-7.pom
2K downloaded  (maven-shared-components-7.pom)
Downloading: http://repo1.maven.org/maven2/org/apache/maven/maven-project/2.0/maven-project-2.0.pom
1K downloaded  (maven-project-2.0.pom)
Downloading: http://repo1.maven.org/maven2/org/apache/maven/maven/2.0/maven-2.0.pom
8K downloaded  (maven-2.0.pom)
Downloading: http://repo1.maven.org/maven2/org/apache/maven/maven-core/2.0/maven-core-2.0.pom
5K downloaded  (maven-core-2.0.pom)
Downloading: http://repo1.maven.org/maven2/org/apache/maven/maven-settings/2.0/maven-settings-2.0.pom
1K downloaded  (maven-settings-2.0.pom)
Downloading: http://repo1.maven.org/maven2/org/apache/maven/wagon/wagon-file/1.0-alpha-5/wagon-file-1.0-alpha-5.pom
5K downloaded  (wagon-file-1.0-alpha-5.pom)
Downloading: http://repo1.maven.org/maven2/org/apache/maven/wagon/wagon-provider-api/1.0-alpha-5/wagon-provider-api-1.0-alpha-5.pom
4K downloaded  (wagon-provider-api-1.0-alpha-5.pom)
Downloading: http://repo1.maven.org/maven2/org/apache/maven/maven-plugin-parameter-documenter/2.0/maven-plugin-parameter-documenter-2.0.pom
1K downloaded  (maven-plugin-parameter-documenter-2.0.pom)
Downloading: http://repo1.maven.org/maven2/org/apache/maven/wagon/wagon-http-lightweight/1.0-alpha-5/wagon-http-lightweight-1.0-alpha-5.pom
5K downloaded  (wagon-http-lightweight-1.0-alpha-5.pom)
Downloading: http://repo1.maven.org/maven2/org/apache/maven/reporting/maven-reporting-api/2.0/maven-reporting-api-2.0.pom
1K downloaded  (maven-reporting-api-2.0.pom)
Downloading: http://repo1.maven.org/maven2/org/apache/maven/reporting/maven-reporting/2.0/maven-reporting-2.0.pom
504b downloaded  (maven-reporting-2.0.pom)
Downloading: http://repo1.maven.org/maven2/org/apache/maven/maven-profile/2.0/maven-profile-2.0.pom
1K downloaded  (maven-profile-2.0.pom)
Downloading: http://repo1.maven.org/maven2/org/apache/maven/maven-model/2.0/maven-model-2.0.pom
2K downloaded  (maven-model-2.0.pom)
Downloading: http://repo1.maven.org/maven2/org/apache/maven/maven-artifact/2.0/maven-artifact-2.0.pom
723b downloaded  (maven-artifact-2.0.pom)
Downloading: http://repo1.maven.org/maven2/org/apache/maven/maven-repository-metadata/2.0/maven-repository-metadata-2.0.pom
1K downloaded  (maven-repository-metadata-2.0.pom)
Downloading: http://repo1.maven.org/maven2/org/apache/maven/maven-error-diagnostics/2.0/maven-error-diagnostics-2.0.pom
812b downloaded  (maven-error-diagnostics-2.0.pom)
Downloading: http://repo1.maven.org/maven2/org/apache/maven/maven-plugin-registry/2.0/maven-plugin-registry-2.0.pom
1K downloaded  (maven-plugin-registry-2.0.pom)
Downloading: http://repo1.maven.org/maven2/org/apache/maven/maven-plugin-api/2.0/maven-plugin-api-2.0.pom
601b downloaded  (maven-plugin-api-2.0.pom)
Downloading: http://repo1.maven.org/maven2/org/apache/maven/maven-plugin-descriptor/2.0/maven-plugin-descriptor-2.0.pom
1K downloaded  (maven-plugin-descriptor-2.0.pom)
Downloading: http://repo1.maven.org/maven2/org/apache/maven/maven-artifact-manager/2.0/maven-artifact-manager-2.0.pom
1K downloaded  (maven-artifact-manager-2.0.pom)
Downloading: http://repo1.maven.org/maven2/org/apache/maven/maven-monitor/2.0/maven-monitor-2.0.pom
400b downloaded  (maven-monitor-2.0.pom)
Downloading: http://repo1.maven.org/maven2/org/apache/maven/wagon/wagon-ssh/1.0-alpha-5/wagon-ssh-1.0-alpha-5.pom
6K downloaded  (wagon-ssh-1.0-alpha-5.pom)
Downloading: http://repo1.maven.org/maven2/com/jcraft/jsch/0.1.23/jsch-0.1.23.pom
485b downloaded  (jsch-0.1.23.pom)
Downloading: http://repo1.maven.org/maven2/org/codehaus/plexus/plexus-archiver/1.0-alpha-7/plexus-archiver-1.0-alpha-7.pom
1K downloaded  (plexus-archiver-1.0-alpha-7.pom)
Downloading: http://repo1.maven.org/maven2/org/codehaus/plexus/plexus-components/1.1.6/plexus-components-1.1.6.pom
1K downloaded  (plexus-components-1.1.6.pom)
Downloading: http://repo1.maven.org/maven2/org/codehaus/plexus/plexus/1.0.8/plexus-1.0.8.pom
7K downloaded  (plexus-1.0.8.pom)
Downloading: http://repo1.maven.org/maven2/org/codehaus/plexus/plexus-utils/1.2/plexus-utils-1.2.pom
767b downloaded  (plexus-utils-1.2.pom)
Downloading: http://repo1.maven.org/maven2/org/codehaus/plexus/plexus/1.0.5/plexus-1.0.5.pom
5K downloaded  (plexus-1.0.5.pom)
Downloading: http://repo1.maven.org/maven2/org/codehaus/plexus/plexus-utils/3.0.8/plexus-utils-3.0.8.pom
3K downloaded  (plexus-utils-3.0.8.pom)
Downloading: http://repo1.maven.org/maven2/junit/junit/4.11/junit-4.11.jar
Downloading: http://repo1.maven.org/maven2/commons-cli/commons-cli/1.2/commons-cli-1.2.jar
Downloading: http://repo1.maven.org/maven2/org/codehaus/plexus/plexus-utils/3.0.8/plexus-utils-3.0.8.jar
Downloading: http://repo1.maven.org/maven2/org/apache/maven/shared/maven-plugin-testing-harness/1.1/maven-plugin-testing-harness-1.1.jar
Downloading: http://repo1.maven.org/maven2/commons-io/commons-io/2.2/commons-io-2.2.jar
40K downloaded  (commons-cli-1.2.jar)
31K downloaded  (maven-plugin-testing-harness-1.1.jar)
226K downloaded  (plexus-utils-3.0.8.jar)
169K downloaded  (commons-io-2.2.jar)
Downloading: http://repo1.maven.org/maven2/commons-lang/commons-lang/2.6/commons-lang-2.6.jar
Downloading: http://repo1.maven.org/maven2/org/apache/rat/apache-rat-core/0.11/apache-rat-core-0.11.jar
Downloading: http://repo1.maven.org/maven2/org/hamcrest/hamcrest-core/1.3/hamcrest-core-1.3.jar
239K downloaded  (junit-4.11.jar)
Downloading: http://repo1.maven.org/maven2/org/apache/maven/doxia/doxia-decoration-model/1.2/doxia-decoration-model-1.2.jar
115K downloaded  (apache-rat-core-0.11.jar)
277K downloaded  (commons-lang-2.6.jar)
43K downloaded  (hamcrest-core-1.3.jar)
Downloading: http://repo1.maven.org/maven2/org/codehaus/plexus/plexus-velocity/1.1.7/plexus-velocity-1.1.7.jar
58K downloaded  (doxia-decoration-model-1.2.jar)
7K downloaded  (plexus-velocity-1.1.7.jar)
Downloading: http://repo1.maven.org/maven2/org/apache/maven/doxia/doxia-site-renderer/1.2/doxia-site-renderer-1.2.jar
Downloading: http://repo1.maven.org/maven2/org/codehaus/plexus/plexus-archiver/1.0-alpha-7/plexus-archiver-1.0-alpha-7.jar
50K downloaded  (doxia-site-renderer-1.2.jar)
Downloading: http://repo1.maven.org/maven2/org/apache/maven/doxia/doxia-module-xhtml/1.2/doxia-module-xhtml-1.2.jar
138K downloaded  (plexus-archiver-1.0-alpha-7.jar)
14K downloaded  (doxia-module-xhtml-1.2.jar)
Downloading: http://repo1.maven.org/maven2/org/apache/maven/doxia/doxia-module-fml/1.2/doxia-module-fml-1.2.jar
36K downloaded  (doxia-module-fml-1.2.jar)
[INFO] [apache-rat:check {execution: rat-check}]
[INFO] 56 implicit excludes (use -debug for more details).
[INFO] Exclude: README.txt
[INFO] Exclude: *.sh
[INFO] Exclude: archetype-samples/**
[INFO] Exclude: **/*.sha1
[INFO] Exclude: src/main/resources/org/apache/maven/archetype/creator/*
[INFO] Exclude: **/Format.java
[INFO] Exclude: **/NamespaceStack.java
[INFO] Exclude: **/XMLOutputter.java
[INFO] Exclude: src/test/**
[INFO] Exclude: src/it/**
[INFO] Exclude: .repository/**
[INFO] Exclude: .java-version
[INFO] Exclude: DEPENDENCIES
[INFO] 8 resources included (use -debug for more details)
[INFO] Rat check: Summary of files. Unapproved: 1 unknown: 1 generated: 0 approved: 5 licence.
[INFO] ------------------------------------------------------------------------
[INFO] SKIPPING Maven Archetype Testing
[INFO]    task-segment: [clean, install]
[INFO] This project has been banned from further executions due to previous failures.
[INFO] ------------------------------------------------------------------------
[INFO] ------------------------------------------------------------------------
[INFO] SKIPPING Maven Archetype Webapp Proxy
[INFO]    task-segment: [clean, install]
[INFO] This project has been banned from further executions due to previous failures.
[INFO] ------------------------------------------------------------------------
[INFO] ------------------------------------------------------------------------
[INFO] SKIPPING Maven Archetype Webapp Repository
[INFO]    task-segment: [clean, install]
[INFO] This project has been banned from further executions due to previous failures.
[INFO] ------------------------------------------------------------------------
[INFO] ------------------------------------------------------------------------
[INFO] SKIPPING Maven Archetype Models
[INFO]    task-segment: [clean, install]
[INFO] This project has been banned from further executions due to previous failures.
[INFO] ------------------------------------------------------------------------
[INFO] ------------------------------------------------------------------------
[INFO] SKIPPING Maven Archetype Catalog Model
[INFO]    task-segment: [clean, install]
[INFO] This project has been banned from further executions due to previous failures.
[INFO] ------------------------------------------------------------------------
[INFO] ------------------------------------------------------------------------
[INFO] SKIPPING Maven Archetype Descriptor Model
[INFO]    task-segment: [clean, install]
[INFO] This project has been banned from further executions due to previous failures.
[INFO] ------------------------------------------------------------------------
[INFO] ------------------------------------------------------------------------
[INFO] SKIPPING Maven Archetype Registry Model
[INFO]    task-segment: [clean, install]
[INFO] This project has been banned from further executions due to previous failures.
[INFO] ------------------------------------------------------------------------
[INFO] ------------------------------------------------------------------------
[INFO] SKIPPING Maven Archetype Common
[INFO]    task-segment: [clean, install]
[INFO] This project has been banned from further executions due to previous failures.
[INFO] ------------------------------------------------------------------------
[INFO] ------------------------------------------------------------------------
[INFO] SKIPPING Maven Archetype Packaging
[INFO]    task-segment: [clean, install]
[INFO] This project has been banned from further executions due to previous failures.
[INFO] ------------------------------------------------------------------------
[INFO] ------------------------------------------------------------------------
[INFO] SKIPPING Maven Archetype Plugin
[INFO]    task-segment: [clean, install]
[INFO] This project has been banned from further executions due to previous failures.
[INFO] ------------------------------------------------------------------------
[INFO] 
[INFO] 
[INFO] ------------------------------------------------------------------------
[INFO] Reactor Summary:
[INFO] ------------------------------------------------------------------------
[INFO] Maven Archetype ....................................... FAILED [42.573s]
[INFO] Maven Archetype Testing ............................... SKIPPED (dependency build failed
or was skipped)
[INFO] Maven Archetype Webapp Proxy .......................... SKIPPED (dependency build failed
or was skipped)
[INFO] Maven Archetype Webapp Repository ..................... SKIPPED (dependency build failed
or was skipped)
[INFO] Maven Archetype Models ................................ SKIPPED (dependency build failed
or was skipped)
[INFO] Maven Archetype Catalog Model ......................... SKIPPED (dependency build failed
or was skipped)
[INFO] Maven Archetype Descriptor Model ...................... SKIPPED (dependency build failed
or was skipped)
[INFO] Maven Archetype Registry Model ........................ SKIPPED (dependency build failed
or was skipped)
[INFO] Maven Archetype Common ................................ SKIPPED (dependency build failed
or was skipped)
[INFO] Maven Archetype Packaging ............................. SKIPPED (dependency build failed
or was skipped)
[INFO] Maven Archetype Plugin ................................ SKIPPED (dependency build failed
or was skipped)
[INFO] ------------------------------------------------------------------------
[INFO] Error for project: Maven Archetype (during install)
[INFO] ------------------------------------------------------------------------
[INFO] Too many files with unapproved license: 1 See RAT report in: <https://builds.apache.org/job/maven-archetype-m2/org.apache.maven.archetype$maven-archetype/ws/target/rat.txt>
[INFO] ------------------------------------------------------------------------
[INFO] Trace
org.apache.maven.BuildFailureException: Too many files with unapproved license: 1 See RAT
report in: <https://builds.apache.org/job/maven-archetype-m2/org.apache.maven.archetype$maven-archetype/ws/target/rat.txt>
	at org.apache.maven.lifecycle.DefaultLifecycleExecutor.executeGoals(DefaultLifecycleExecutor.java:715)
	at org.apache.maven.lifecycle.DefaultLifecycleExecutor.executeGoalWithLifecycle(DefaultLifecycleExecutor.java:556)
	at org.apache.maven.lifecycle.DefaultLifecycleExecutor.executeGoal(DefaultLifecycleExecutor.java:535)
	at org.apache.maven.lifecycle.DefaultLifecycleExecutor.executeGoalAndHandleFailures(DefaultLifecycleExecutor.java:387)
	at org.apache.maven.lifecycle.DefaultLifecycleExecutor.executeTaskSegments(DefaultLifecycleExecutor.java:348)
	at org.apache.maven.lifecycle.DefaultLifecycleExecutor.execute(DefaultLifecycleExecutor.java:180)
	at org.apache.maven.lifecycle.LifecycleExecutorInterceptor.execute(LifecycleExecutorInterceptor.java:65)
	at org.apache.maven.DefaultMaven.doExecute(DefaultMaven.java:328)
	at org.apache.maven.DefaultMaven.execute(DefaultMaven.java:138)
	at org.apache.maven.cli.MavenCli.main(MavenCli.java:362)
	at sun.reflect.NativeMethodAccessorImpl.invoke0(Native Method)
	at sun.reflect.NativeMethodAccessorImpl.invoke(NativeMethodAccessorImpl.java:39)
	at sun.reflect.DelegatingMethodAccessorImpl.invoke(DelegatingMethodAccessorImpl.java:25)
	at java.lang.reflect.Method.invoke(Method.java:597)
	at org.codehaus.classworlds.Launcher.launchEnhanced(Launcher.java:315)
	at org.codehaus.classworlds.Launcher.launch(Launcher.java:255)
	at hudson.maven.agent.Main.launch(Main.java:205)
	at hudson.maven.MavenBuilder.call(MavenBuilder.java:154)
	at hudson.maven.Maven2Builder.call(Maven2Builder.java:79)
	at hudson.maven.Maven2Builder.call(Maven2Builder.java:55)
	at hudson.remoting.UserRequest.perform(UserRequest.java:118)
	at hudson.remoting.UserRequest.perform(UserRequest.java:48)
	at hudson.remoting.Request$2.run(Request.java:328)
	at hudson.remoting.InterceptingExecutorService$1.call(InterceptingExecutorService.java:72)
	at java.util.concurrent.FutureTask$Sync.innerRun(FutureTask.java:303)
	at java.util.concurrent.FutureTask.run(FutureTask.java:138)
	at java.util.concurrent.ThreadPoolExecutor$Worker.runTask(ThreadPoolExecutor.java:895)
	at java.util.concurrent.ThreadPoolExecutor$Worker.run(ThreadPoolExecutor.java:918)
	at java.lang.Thread.run(Thread.java:662)
Caused by: org.apache.rat.mp.RatCheckException: Too many files with unapproved license: 1
See RAT report in: <https://builds.apache.org/job/maven-archetype-m2/org.apache.maven.archetype$maven-archetype/ws/target/rat.txt>
	at org.apache.rat.mp.RatCheckMojo.check(RatCheckMojo.java:194)
	at org.apache.rat.mp.RatCheckMojo.execute(RatCheckMojo.java:182)
	at org.apache.maven.plugin.DefaultPluginManager.executeMojo(DefaultPluginManager.java:490)
	at hudson.maven.agent.PluginManagerInterceptor.executeMojo(PluginManagerInterceptor.java:182)
	at org.apache.maven.lifecycle.DefaultLifecycleExecutor.executeGoals(DefaultLifecycleExecutor.java:694)
	... 28 more
[INFO] ------------------------------------------------------------------------
[INFO] BUILD ERRORS
[INFO] ------------------------------------------------------------------------
[INFO] Total time: 43 seconds
[INFO] Finished at: Thu Feb 12 01:17:22 UTC 2015
[INFO] Final Memory: 55M/557M
[INFO] ------------------------------------------------------------------------

Mime
View raw message