maven-notifications mailing list archives

Site index · List index
Message view « Date » · « Thread »
Top « Date » · « Thread »
From Apache Jenkins Server <jenk...@builds.apache.org>
Subject Build failed in Jenkins: maven-plugins-ITs-m3 #1628
Date Sat, 08 Nov 2014 15:12:55 GMT
See <https://builds.apache.org/job/maven-plugins-ITs-m3/1628/changes>

Changes:

[hboutemy] rework code after MNG-5720 discussion

------------------------------------------
[...truncated 8277 lines...]
[INFO] --- maven-invoker-plugin:1.8:install (integration-test) @ maven-scm-publish-plugin ---
[INFO] Installing /x1/jenkins/jenkins-slave/workspace/maven-plugins-ITs-m3/maven-plugins/pom.xml to /x1/jenkins/jenkins-slave/workspace/maven-plugins-ITs-m3/maven-scm-publish-plugin/target/local-repo/org/apache/maven/plugins/maven-plugins/27-SNAPSHOT/maven-plugins-27-SNAPSHOT.pom
[INFO] Installing /x1/jenkins/jenkins-slave/workspace/maven-plugins-ITs-m3/maven-plugins/target/maven-plugins-27-SNAPSHOT-site.xml to /x1/jenkins/jenkins-slave/workspace/maven-plugins-ITs-m3/maven-scm-publish-plugin/target/local-repo/org/apache/maven/plugins/maven-plugins/27-SNAPSHOT/maven-plugins-27-SNAPSHOT-site.xml
[INFO] Installing /x1/jenkins/jenkins-slave/workspace/maven-plugins-ITs-m3/maven-acr-plugin/pom.xml to /x1/jenkins/jenkins-slave/workspace/maven-plugins-ITs-m3/maven-scm-publish-plugin/target/local-repo/org/apache/maven/plugins/maven-acr-plugin/1.2-SNAPSHOT/maven-acr-plugin-1.2-SNAPSHOT.pom
[INFO] Installing /x1/jenkins/jenkins-slave/workspace/maven-plugins-ITs-m3/maven-acr-plugin/target/maven-acr-plugin-1.2-SNAPSHOT.jar to /x1/jenkins/jenkins-slave/workspace/maven-plugins-ITs-m3/maven-scm-publish-plugin/target/local-repo/org/apache/maven/plugins/maven-acr-plugin/1.2-SNAPSHOT/maven-acr-plugin-1.2-SNAPSHOT.jar
[INFO] Installing /x1/jenkins/jenkins-slave/workspace/maven-plugins-ITs-m3/maven-acr-plugin/pom.xml to /x1/jenkins/jenkins-slave/workspace/maven-plugins-ITs-m3/maven-scm-publish-plugin/target/local-repo/org/apache/maven/plugins/maven-acr-plugin/1.2-SNAPSHOT/maven-acr-plugin-1.2-SNAPSHOT.pom
[INFO] Installing /x1/jenkins/jenkins-slave/workspace/maven-plugins-ITs-m3/maven-ant-plugin/pom.xml to /x1/jenkins/jenkins-slave/workspace/maven-plugins-ITs-m3/maven-scm-publish-plugin/target/local-repo/org/apache/maven/plugins/maven-ant-plugin/2.4-SNAPSHOT/maven-ant-plugin-2.4-SNAPSHOT.pom
[INFO] Installing /x1/jenkins/jenkins-slave/workspace/maven-plugins-ITs-m3/maven-ant-plugin/target/maven-ant-plugin-2.4-SNAPSHOT.jar to /x1/jenkins/jenkins-slave/workspace/maven-plugins-ITs-m3/maven-scm-publish-plugin/target/local-repo/org/apache/maven/plugins/maven-ant-plugin/2.4-SNAPSHOT/maven-ant-plugin-2.4-SNAPSHOT.jar
[INFO] Installing /x1/jenkins/jenkins-slave/workspace/maven-plugins-ITs-m3/maven-ant-plugin/pom.xml to /x1/jenkins/jenkins-slave/workspace/maven-plugins-ITs-m3/maven-scm-publish-plugin/target/local-repo/org/apache/maven/plugins/maven-ant-plugin/2.4-SNAPSHOT/maven-ant-plugin-2.4-SNAPSHOT.pom
[INFO] Installing /x1/jenkins/jenkins-slave/workspace/maven-plugins-ITs-m3/maven-antrun-plugin/pom.xml to /x1/jenkins/jenkins-slave/workspace/maven-plugins-ITs-m3/maven-scm-publish-plugin/target/local-repo/org/apache/maven/plugins/maven-antrun-plugin/1.8-SNAPSHOT/maven-antrun-plugin-1.8-SNAPSHOT.pom
[INFO] Installing /x1/jenkins/jenkins-slave/workspace/maven-plugins-ITs-m3/maven-antrun-plugin/target/maven-antrun-plugin-1.8-SNAPSHOT.jar to /x1/jenkins/jenkins-slave/workspace/maven-plugins-ITs-m3/maven-scm-publish-plugin/target/local-repo/org/apache/maven/plugins/maven-antrun-plugin/1.8-SNAPSHOT/maven-antrun-plugin-1.8-SNAPSHOT.jar
[INFO] Installing /x1/jenkins/jenkins-slave/workspace/maven-plugins-ITs-m3/maven-antrun-plugin/pom.xml to /x1/jenkins/jenkins-slave/workspace/maven-plugins-ITs-m3/maven-scm-publish-plugin/target/local-repo/org/apache/maven/plugins/maven-antrun-plugin/1.8-SNAPSHOT/maven-antrun-plugin-1.8-SNAPSHOT.pom
[INFO] Installing /x1/jenkins/jenkins-slave/workspace/maven-plugins-ITs-m3/maven-eclipse-plugin/pom.xml to /x1/jenkins/jenkins-slave/workspace/maven-plugins-ITs-m3/maven-scm-publish-plugin/target/local-repo/org/apache/maven/plugins/maven-eclipse-plugin/2.10-SNAPSHOT/maven-eclipse-plugin-2.10-SNAPSHOT.pom
[INFO] Installing /x1/jenkins/jenkins-slave/workspace/maven-plugins-ITs-m3/maven-eclipse-plugin/target/maven-eclipse-plugin-2.10-SNAPSHOT.jar to /x1/jenkins/jenkins-slave/workspace/maven-plugins-ITs-m3/maven-scm-publish-plugin/target/local-repo/org/apache/maven/plugins/maven-eclipse-plugin/2.10-SNAPSHOT/maven-eclipse-plugin-2.10-SNAPSHOT.jar
[INFO] Installing /x1/jenkins/jenkins-slave/workspace/maven-plugins-ITs-m3/maven-eclipse-plugin/pom.xml to /x1/jenkins/jenkins-slave/workspace/maven-plugins-ITs-m3/maven-scm-publish-plugin/target/local-repo/org/apache/maven/plugins/maven-eclipse-plugin/2.10-SNAPSHOT/maven-eclipse-plugin-2.10-SNAPSHOT.pom
[INFO] Installing /x1/jenkins/jenkins-slave/workspace/maven-plugins-ITs-m3/maven-assembly-plugin/pom.xml to /x1/jenkins/jenkins-slave/workspace/maven-plugins-ITs-m3/maven-scm-publish-plugin/target/local-repo/org/apache/maven/plugins/maven-assembly-plugin/2.6-SNAPSHOT/maven-assembly-plugin-2.6-SNAPSHOT.pom
[INFO] Installing /x1/jenkins/jenkins-slave/workspace/maven-plugins-ITs-m3/maven-assembly-plugin/target/maven-assembly-plugin-2.6-SNAPSHOT.jar to /x1/jenkins/jenkins-slave/workspace/maven-plugins-ITs-m3/maven-scm-publish-plugin/target/local-repo/org/apache/maven/plugins/maven-assembly-plugin/2.6-SNAPSHOT/maven-assembly-plugin-2.6-SNAPSHOT.jar
[INFO] Installing /x1/jenkins/jenkins-slave/workspace/maven-plugins-ITs-m3/maven-assembly-plugin/pom.xml to /x1/jenkins/jenkins-slave/workspace/maven-plugins-ITs-m3/maven-scm-publish-plugin/target/local-repo/org/apache/maven/plugins/maven-assembly-plugin/2.6-SNAPSHOT/maven-assembly-plugin-2.6-SNAPSHOT.pom
[INFO] Installing /x1/jenkins/jenkins-slave/workspace/maven-plugins-ITs-m3/maven-changelog-plugin/pom.xml to /x1/jenkins/jenkins-slave/workspace/maven-plugins-ITs-m3/maven-scm-publish-plugin/target/local-repo/org/apache/maven/plugins/maven-changelog-plugin/2.4-SNAPSHOT/maven-changelog-plugin-2.4-SNAPSHOT.pom
[INFO] Installing /x1/jenkins/jenkins-slave/workspace/maven-plugins-ITs-m3/maven-changelog-plugin/target/maven-changelog-plugin-2.4-SNAPSHOT.jar to /x1/jenkins/jenkins-slave/workspace/maven-plugins-ITs-m3/maven-scm-publish-plugin/target/local-repo/org/apache/maven/plugins/maven-changelog-plugin/2.4-SNAPSHOT/maven-changelog-plugin-2.4-SNAPSHOT.jar
[INFO] Installing /x1/jenkins/jenkins-slave/workspace/maven-plugins-ITs-m3/maven-changelog-plugin/pom.xml to /x1/jenkins/jenkins-slave/workspace/maven-plugins-ITs-m3/maven-scm-publish-plugin/target/local-repo/org/apache/maven/plugins/maven-changelog-plugin/2.4-SNAPSHOT/maven-changelog-plugin-2.4-SNAPSHOT.pom
[INFO] Installing /x1/jenkins/jenkins-slave/workspace/maven-plugins-ITs-m3/maven-changes-plugin/pom.xml to /x1/jenkins/jenkins-slave/workspace/maven-plugins-ITs-m3/maven-scm-publish-plugin/target/local-repo/org/apache/maven/plugins/maven-changes-plugin/2.12-SNAPSHOT/maven-changes-plugin-2.12-SNAPSHOT.pom
[INFO] Installing /x1/jenkins/jenkins-slave/workspace/maven-plugins-ITs-m3/maven-changes-plugin/target/maven-changes-plugin-2.12-SNAPSHOT.jar to /x1/jenkins/jenkins-slave/workspace/maven-plugins-ITs-m3/maven-scm-publish-plugin/target/local-repo/org/apache/maven/plugins/maven-changes-plugin/2.12-SNAPSHOT/maven-changes-plugin-2.12-SNAPSHOT.jar
[INFO] Installing /x1/jenkins/jenkins-slave/workspace/maven-plugins-ITs-m3/maven-changes-plugin/pom.xml to /x1/jenkins/jenkins-slave/workspace/maven-plugins-ITs-m3/maven-scm-publish-plugin/target/local-repo/org/apache/maven/plugins/maven-changes-plugin/2.12-SNAPSHOT/maven-changes-plugin-2.12-SNAPSHOT.pom
[INFO] Installing /x1/jenkins/jenkins-slave/workspace/maven-plugins-ITs-m3/maven-checkstyle-plugin/pom.xml to /x1/jenkins/jenkins-slave/workspace/maven-plugins-ITs-m3/maven-scm-publish-plugin/target/local-repo/org/apache/maven/plugins/maven-checkstyle-plugin/2.14-SNAPSHOT/maven-checkstyle-plugin-2.14-SNAPSHOT.pom
[INFO] Installing /x1/jenkins/jenkins-slave/workspace/maven-plugins-ITs-m3/maven-checkstyle-plugin/target/maven-checkstyle-plugin-2.14-SNAPSHOT.jar to /x1/jenkins/jenkins-slave/workspace/maven-plugins-ITs-m3/maven-scm-publish-plugin/target/local-repo/org/apache/maven/plugins/maven-checkstyle-plugin/2.14-SNAPSHOT/maven-checkstyle-plugin-2.14-SNAPSHOT.jar
[INFO] Installing /x1/jenkins/jenkins-slave/workspace/maven-plugins-ITs-m3/maven-checkstyle-plugin/pom.xml to /x1/jenkins/jenkins-slave/workspace/maven-plugins-ITs-m3/maven-scm-publish-plugin/target/local-repo/org/apache/maven/plugins/maven-checkstyle-plugin/2.14-SNAPSHOT/maven-checkstyle-plugin-2.14-SNAPSHOT.pom
[INFO] Installing /x1/jenkins/jenkins-slave/workspace/maven-plugins-ITs-m3/maven-clean-plugin/pom.xml to /x1/jenkins/jenkins-slave/workspace/maven-plugins-ITs-m3/maven-scm-publish-plugin/target/local-repo/org/apache/maven/plugins/maven-clean-plugin/2.6.2-SNAPSHOT/maven-clean-plugin-2.6.2-SNAPSHOT.pom
[INFO] Installing /x1/jenkins/jenkins-slave/workspace/maven-plugins-ITs-m3/maven-clean-plugin/target/maven-clean-plugin-2.6.2-SNAPSHOT.jar to /x1/jenkins/jenkins-slave/workspace/maven-plugins-ITs-m3/maven-scm-publish-plugin/target/local-repo/org/apache/maven/plugins/maven-clean-plugin/2.6.2-SNAPSHOT/maven-clean-plugin-2.6.2-SNAPSHOT.jar
[INFO] Installing /x1/jenkins/jenkins-slave/workspace/maven-plugins-ITs-m3/maven-clean-plugin/pom.xml to /x1/jenkins/jenkins-slave/workspace/maven-plugins-ITs-m3/maven-scm-publish-plugin/target/local-repo/org/apache/maven/plugins/maven-clean-plugin/2.6.2-SNAPSHOT/maven-clean-plugin-2.6.2-SNAPSHOT.pom
[INFO] Installing /x1/jenkins/jenkins-slave/workspace/maven-plugins-ITs-m3/maven-compiler-plugin/pom.xml to /x1/jenkins/jenkins-slave/workspace/maven-plugins-ITs-m3/maven-scm-publish-plugin/target/local-repo/org/apache/maven/plugins/maven-compiler-plugin/3.3-SNAPSHOT/maven-compiler-plugin-3.3-SNAPSHOT.pom
[INFO] Installing /x1/jenkins/jenkins-slave/workspace/maven-plugins-ITs-m3/maven-compiler-plugin/target/maven-compiler-plugin-3.3-SNAPSHOT.jar to /x1/jenkins/jenkins-slave/workspace/maven-plugins-ITs-m3/maven-scm-publish-plugin/target/local-repo/org/apache/maven/plugins/maven-compiler-plugin/3.3-SNAPSHOT/maven-compiler-plugin-3.3-SNAPSHOT.jar
[INFO] Installing /x1/jenkins/jenkins-slave/workspace/maven-plugins-ITs-m3/maven-compiler-plugin/pom.xml to /x1/jenkins/jenkins-slave/workspace/maven-plugins-ITs-m3/maven-scm-publish-plugin/target/local-repo/org/apache/maven/plugins/maven-compiler-plugin/3.3-SNAPSHOT/maven-compiler-plugin-3.3-SNAPSHOT.pom
[INFO] Installing /x1/jenkins/jenkins-slave/workspace/maven-plugins-ITs-m3/maven-dependency-plugin/pom.xml to /x1/jenkins/jenkins-slave/workspace/maven-plugins-ITs-m3/maven-scm-publish-plugin/target/local-repo/org/apache/maven/plugins/maven-dependency-plugin/2.10-SNAPSHOT/maven-dependency-plugin-2.10-SNAPSHOT.pom
[INFO]                                                                         
[INFO] ------------------------------------------------------------------------
[INFO] Building Apache Maven GPG Plugin 1.6-SNAPSHOT
[INFO] ------------------------------------------------------------------------
[INFO] 
[INFO] --- maven-clean-plugin:2.5:clean (default-clean) @ maven-gpg-plugin ---
[INFO] Deleting /x1/jenkins/jenkins-slave/workspace/maven-plugins-ITs-m3/maven-gpg-plugin/target
[INFO] 
[INFO] --- maven-enforcer-plugin:1.3.1:enforce (enforce-bytecode-version) @ maven-gpg-plugin ---
[INFO] 
[INFO] --- maven-enforcer-plugin:1.3.1:enforce (ban-known-bad-maven-versions) @ maven-gpg-plugin ---
[INFO] 
[INFO] --- maven-enforcer-plugin:1.3.1:enforce (ensure-no-container-api) @ maven-gpg-plugin ---
[INFO] 
[INFO] --- maven-plugin-plugin:3.2:helpmojo (generated-helpmojo) @ maven-gpg-plugin ---
[INFO] Using 'UTF-8' encoding to read mojo metadata.
[INFO] Applying mojo extractor for language: java
[INFO] Mojo extractor for language: java found 0 mojo descriptors.
[INFO] Applying mojo extractor for language: bsh
[INFO] Mojo extractor for language: bsh found 0 mojo descriptors.
[INFO] Applying mojo extractor for language: java-annotations
[INFO] Mojo extractor for language: java-annotations found 0 mojo descriptors.
[INFO] 
[INFO] --- maven-plugin-plugin:3.2:descriptor (default-descriptor) @ maven-gpg-plugin ---
[INFO] Using 'UTF-8' encoding to read mojo metadata.
[INFO] Applying mojo extractor for language: java
[INFO] Mojo extractor for language: java found 0 mojo descriptors.
[INFO] Applying mojo extractor for language: bsh
[INFO] Mojo extractor for language: bsh found 0 mojo descriptors.
[INFO] Applying mojo extractor for language: java-annotations
[INFO] Mojo extractor for language: java-annotations found 0 mojo descriptors.
[INFO] 
[INFO] --- maven-remote-resources-plugin:1.5:process (default) @ maven-gpg-plugin ---
[INFO] 
[INFO] --- maven-resources-plugin:2.6:resources (default-resources) @ maven-gpg-plugin ---
[INFO] Using 'UTF-8' encoding to copy filtered resources.
[INFO] skip non existing resourceDirectory /x1/jenkins/jenkins-slave/workspace/maven-plugins-ITs-m3/maven-gpg-plugin/src/main/resources
[INFO] Copying 3 resources
[INFO] 
[INFO] --- maven-compiler-plugin:3.1:compile (default-compile) @ maven-gpg-plugin ---
[INFO] Changes detected - recompiling the module!
[INFO] Compiling 9 source files to /x1/jenkins/jenkins-slave/workspace/maven-plugins-ITs-m3/maven-gpg-plugin/target/classes
[INFO] 
[INFO] --- maven-plugin-plugin:3.2:descriptor (generate-descriptor) @ maven-gpg-plugin ---
[INFO] Using 'UTF-8' encoding to read mojo metadata.
[INFO] Applying mojo extractor for language: java
[INFO] Mojo extractor for language: java found 0 mojo descriptors.
[INFO] Applying mojo extractor for language: bsh
[INFO] Mojo extractor for language: bsh found 0 mojo descriptors.
[INFO] Applying mojo extractor for language: java-annotations
[INFO] Mojo extractor for language: java-annotations found 3 mojo descriptors.
[INFO] 
[INFO] --- maven-resources-plugin:2.6:testResources (default-testResources) @ maven-gpg-plugin ---
[INFO] Using 'UTF-8' encoding to copy filtered resources.
[INFO] Copying 8 resources
[INFO] Copying 3 resources
[INFO] 
[INFO] --- maven-compiler-plugin:3.1:testCompile (default-testCompile) @ maven-gpg-plugin ---
[INFO] No sources to compile
[INFO] 
[INFO] --- maven-surefire-plugin:2.16:test (default-test) @ maven-gpg-plugin ---
[INFO] 
[INFO] --- maven-jar-plugin:2.4:jar (default-jar) @ maven-gpg-plugin ---
[INFO] Building jar: /x1/jenkins/jenkins-slave/workspace/maven-plugins-ITs-m3/maven-gpg-plugin/target/maven-gpg-plugin-1.6-SNAPSHOT.jar
[INFO] 
[INFO] --- maven-plugin-plugin:3.2:addPluginArtifactMetadata (default-addPluginArtifactMetadata) @ maven-gpg-plugin ---
[INFO] 
[INFO] --- maven-invoker-plugin:1.8:install (integration-test) @ maven-gpg-plugin ---
[INFO] Installing /x1/jenkins/jenkins-slave/workspace/maven-plugins-ITs-m3/maven-plugins/pom.xml to /x1/jenkins/jenkins-slave/workspace/maven-plugins-ITs-m3/maven-gpg-plugin/target/local-repo/org/apache/maven/plugins/maven-plugins/27-SNAPSHOT/maven-plugins-27-SNAPSHOT.pom
[INFO] Installing /x1/jenkins/jenkins-slave/workspace/maven-plugins-ITs-m3/maven-plugins/target/maven-plugins-27-SNAPSHOT-site.xml to /x1/jenkins/jenkins-slave/workspace/maven-plugins-ITs-m3/maven-gpg-plugin/target/local-repo/org/apache/maven/plugins/maven-plugins/27-SNAPSHOT/maven-plugins-27-SNAPSHOT-site.xml
[INFO] Installing /x1/jenkins/jenkins-slave/workspace/maven-plugins-ITs-m3/maven-acr-plugin/pom.xml to /x1/jenkins/jenkins-slave/workspace/maven-plugins-ITs-m3/maven-gpg-plugin/target/local-repo/org/apache/maven/plugins/maven-acr-plugin/1.2-SNAPSHOT/maven-acr-plugin-1.2-SNAPSHOT.pom
[INFO] Installing /x1/jenkins/jenkins-slave/workspace/maven-plugins-ITs-m3/maven-acr-plugin/target/maven-acr-plugin-1.2-SNAPSHOT.jar to /x1/jenkins/jenkins-slave/workspace/maven-plugins-ITs-m3/maven-gpg-plugin/target/local-repo/org/apache/maven/plugins/maven-acr-plugin/1.2-SNAPSHOT/maven-acr-plugin-1.2-SNAPSHOT.jar
[INFO] Installing /x1/jenkins/jenkins-slave/workspace/maven-plugins-ITs-m3/maven-acr-plugin/pom.xml to /x1/jenkins/jenkins-slave/workspace/maven-plugins-ITs-m3/maven-gpg-plugin/target/local-repo/org/apache/maven/plugins/maven-acr-plugin/1.2-SNAPSHOT/maven-acr-plugin-1.2-SNAPSHOT.pom
[INFO] Installing /x1/jenkins/jenkins-slave/workspace/maven-plugins-ITs-m3/maven-ant-plugin/pom.xml to /x1/jenkins/jenkins-slave/workspace/maven-plugins-ITs-m3/maven-gpg-plugin/target/local-repo/org/apache/maven/plugins/maven-ant-plugin/2.4-SNAPSHOT/maven-ant-plugin-2.4-SNAPSHOT.pom
[INFO] Installing /x1/jenkins/jenkins-slave/workspace/maven-plugins-ITs-m3/maven-ant-plugin/target/maven-ant-plugin-2.4-SNAPSHOT.jar to /x1/jenkins/jenkins-slave/workspace/maven-plugins-ITs-m3/maven-gpg-plugin/target/local-repo/org/apache/maven/plugins/maven-ant-plugin/2.4-SNAPSHOT/maven-ant-plugin-2.4-SNAPSHOT.jar
[INFO] Installing /x1/jenkins/jenkins-slave/workspace/maven-plugins-ITs-m3/maven-ant-plugin/pom.xml to /x1/jenkins/jenkins-slave/workspace/maven-plugins-ITs-m3/maven-gpg-plugin/target/local-repo/org/apache/maven/plugins/maven-ant-plugin/2.4-SNAPSHOT/maven-ant-plugin-2.4-SNAPSHOT.pom
[INFO] Installing /x1/jenkins/jenkins-slave/workspace/maven-plugins-ITs-m3/maven-antrun-plugin/pom.xml to /x1/jenkins/jenkins-slave/workspace/maven-plugins-ITs-m3/maven-gpg-plugin/target/local-repo/org/apache/maven/plugins/maven-antrun-plugin/1.8-SNAPSHOT/maven-antrun-plugin-1.8-SNAPSHOT.pom
[INFO] Installing /x1/jenkins/jenkins-slave/workspace/maven-plugins-ITs-m3/maven-antrun-plugin/target/maven-antrun-plugin-1.8-SNAPSHOT.jar to /x1/jenkins/jenkins-slave/workspace/maven-plugins-ITs-m3/maven-gpg-plugin/target/local-repo/org/apache/maven/plugins/maven-antrun-plugin/1.8-SNAPSHOT/maven-antrun-plugin-1.8-SNAPSHOT.jar
[INFO] Installing /x1/jenkins/jenkins-slave/workspace/maven-plugins-ITs-m3/maven-antrun-plugin/pom.xml to /x1/jenkins/jenkins-slave/workspace/maven-plugins-ITs-m3/maven-gpg-plugin/target/local-repo/org/apache/maven/plugins/maven-antrun-plugin/1.8-SNAPSHOT/maven-antrun-plugin-1.8-SNAPSHOT.pom
[INFO] Installing /x1/jenkins/jenkins-slave/workspace/maven-plugins-ITs-m3/maven-eclipse-plugin/pom.xml to /x1/jenkins/jenkins-slave/workspace/maven-plugins-ITs-m3/maven-gpg-plugin/target/local-repo/org/apache/maven/plugins/maven-eclipse-plugin/2.10-SNAPSHOT/maven-eclipse-plugin-2.10-SNAPSHOT.pom
[INFO] Installing /x1/jenkins/jenkins-slave/workspace/maven-plugins-ITs-m3/maven-eclipse-plugin/target/maven-eclipse-plugin-2.10-SNAPSHOT.jar to /x1/jenkins/jenkins-slave/workspace/maven-plugins-ITs-m3/maven-gpg-plugin/target/local-repo/org/apache/maven/plugins/maven-eclipse-plugin/2.10-SNAPSHOT/maven-eclipse-plugin-2.10-SNAPSHOT.jar
[INFO] Installing /x1/jenkins/jenkins-slave/workspace/maven-plugins-ITs-m3/maven-eclipse-plugin/pom.xml to /x1/jenkins/jenkins-slave/workspace/maven-plugins-ITs-m3/maven-gpg-plugin/target/local-repo/org/apache/maven/plugins/maven-eclipse-plugin/2.10-SNAPSHOT/maven-eclipse-plugin-2.10-SNAPSHOT.pom
[INFO] Installing /x1/jenkins/jenkins-slave/workspace/maven-plugins-ITs-m3/maven-assembly-plugin/pom.xml to /x1/jenkins/jenkins-slave/workspace/maven-plugins-ITs-m3/maven-gpg-plugin/target/local-repo/org/apache/maven/plugins/maven-assembly-plugin/2.6-SNAPSHOT/maven-assembly-plugin-2.6-SNAPSHOT.pom
[INFO] Installing /x1/jenkins/jenkins-slave/workspace/maven-plugins-ITs-m3/maven-assembly-plugin/target/maven-assembly-plugin-2.6-SNAPSHOT.jar to /x1/jenkins/jenkins-slave/workspace/maven-plugins-ITs-m3/maven-gpg-plugin/target/local-repo/org/apache/maven/plugins/maven-assembly-plugin/2.6-SNAPSHOT/maven-assembly-plugin-2.6-SNAPSHOT.jar
[INFO] Installing /x1/jenkins/jenkins-slave/workspace/maven-plugins-ITs-m3/maven-assembly-plugin/pom.xml to /x1/jenkins/jenkins-slave/workspace/maven-plugins-ITs-m3/maven-gpg-plugin/target/local-repo/org/apache/maven/plugins/maven-assembly-plugin/2.6-SNAPSHOT/maven-assembly-plugin-2.6-SNAPSHOT.pom
[INFO] Installing /x1/jenkins/jenkins-slave/workspace/maven-plugins-ITs-m3/maven-changelog-plugin/pom.xml to /x1/jenkins/jenkins-slave/workspace/maven-plugins-ITs-m3/maven-gpg-plugin/target/local-repo/org/apache/maven/plugins/maven-changelog-plugin/2.4-SNAPSHOT/maven-changelog-plugin-2.4-SNAPSHOT.pom
[INFO] Installing /x1/jenkins/jenkins-slave/workspace/maven-plugins-ITs-m3/maven-changelog-plugin/target/maven-changelog-plugin-2.4-SNAPSHOT.jar to /x1/jenkins/jenkins-slave/workspace/maven-plugins-ITs-m3/maven-gpg-plugin/target/local-repo/org/apache/maven/plugins/maven-changelog-plugin/2.4-SNAPSHOT/maven-changelog-plugin-2.4-SNAPSHOT.jar
[INFO] Installing /x1/jenkins/jenkins-slave/workspace/maven-plugins-ITs-m3/maven-changelog-plugin/pom.xml to /x1/jenkins/jenkins-slave/workspace/maven-plugins-ITs-m3/maven-gpg-plugin/target/local-repo/org/apache/maven/plugins/maven-changelog-plugin/2.4-SNAPSHOT/maven-changelog-plugin-2.4-SNAPSHOT.pom
[INFO] Installing /x1/jenkins/jenkins-slave/workspace/maven-plugins-ITs-m3/maven-changes-plugin/pom.xml to /x1/jenkins/jenkins-slave/workspace/maven-plugins-ITs-m3/maven-gpg-plugin/target/local-repo/org/apache/maven/plugins/maven-changes-plugin/2.12-SNAPSHOT/maven-changes-plugin-2.12-SNAPSHOT.pom
[INFO] Installing /x1/jenkins/jenkins-slave/workspace/maven-plugins-ITs-m3/maven-changes-plugin/target/maven-changes-plugin-2.12-SNAPSHOT.jar to /x1/jenkins/jenkins-slave/workspace/maven-plugins-ITs-m3/maven-gpg-plugin/target/local-repo/org/apache/maven/plugins/maven-changes-plugin/2.12-SNAPSHOT/maven-changes-plugin-2.12-SNAPSHOT.jar
[INFO] Installing /x1/jenkins/jenkins-slave/workspace/maven-plugins-ITs-m3/maven-changes-plugin/pom.xml to /x1/jenkins/jenkins-slave/workspace/maven-plugins-ITs-m3/maven-gpg-plugin/target/local-repo/org/apache/maven/plugins/maven-changes-plugin/2.12-SNAPSHOT/maven-changes-plugin-2.12-SNAPSHOT.pom
[INFO] Installing /x1/jenkins/jenkins-slave/workspace/maven-plugins-ITs-m3/maven-checkstyle-plugin/pom.xml to /x1/jenkins/jenkins-slave/workspace/maven-plugins-ITs-m3/maven-gpg-plugin/target/local-repo/org/apache/maven/plugins/maven-checkstyle-plugin/2.14-SNAPSHOT/maven-checkstyle-plugin-2.14-SNAPSHOT.pom
[INFO] Installing /x1/jenkins/jenkins-slave/workspace/maven-plugins-ITs-m3/maven-checkstyle-plugin/target/maven-checkstyle-plugin-2.14-SNAPSHOT.jar to /x1/jenkins/jenkins-slave/workspace/maven-plugins-ITs-m3/maven-gpg-plugin/target/local-repo/org/apache/maven/plugins/maven-checkstyle-plugin/2.14-SNAPSHOT/maven-checkstyle-plugin-2.14-SNAPSHOT.jar
[INFO] Installing /x1/jenkins/jenkins-slave/workspace/maven-plugins-ITs-m3/maven-checkstyle-plugin/pom.xml to /x1/jenkins/jenkins-slave/workspace/maven-plugins-ITs-m3/maven-gpg-plugin/target/local-repo/org/apache/maven/plugins/maven-checkstyle-plugin/2.14-SNAPSHOT/maven-checkstyle-plugin-2.14-SNAPSHOT.pom
[INFO] Installing /x1/jenkins/jenkins-slave/workspace/maven-plugins-ITs-m3/maven-clean-plugin/pom.xml to /x1/jenkins/jenkins-slave/workspace/maven-plugins-ITs-m3/maven-gpg-plugin/target/local-repo/org/apache/maven/plugins/maven-clean-plugin/2.6.2-SNAPSHOT/maven-clean-plugin-2.6.2-SNAPSHOT.pom
[INFO] Installing /x1/jenkins/jenkins-slave/workspace/maven-plugins-ITs-m3/maven-clean-plugin/target/maven-clean-plugin-2.6.2-SNAPSHOT.jar to /x1/jenkins/jenkins-slave/workspace/maven-plugins-ITs-m3/maven-gpg-plugin/target/local-repo/org/apache/maven/plugins/maven-clean-plugin/2.6.2-SNAPSHOT/maven-clean-plugin-2.6.2-SNAPSHOT.jar
[INFO] Installing /x1/jenkins/jenkins-slave/workspace/maven-plugins-ITs-m3/maven-clean-plugin/pom.xml to /x1/jenkins/jenkins-slave/workspace/maven-plugins-ITs-m3/maven-gpg-plugin/target/local-repo/org/apache/maven/plugins/maven-clean-plugin/2.6.2-SNAPSHOT/maven-clean-plugin-2.6.2-SNAPSHOT.pom
[INFO] Installing /x1/jenkins/jenkins-slave/workspace/maven-plugins-ITs-m3/maven-compiler-plugin/pom.xml to /x1/jenkins/jenkins-slave/workspace/maven-plugins-ITs-m3/maven-gpg-plugin/target/local-repo/org/apache/maven/plugins/maven-compiler-plugin/3.3-SNAPSHOT/maven-compiler-plugin-3.3-SNAPSHOT.pom
[INFO] Installing /x1/jenkins/jenkins-slave/workspace/maven-plugins-ITs-m3/maven-compiler-plugin/target/maven-compiler-plugin-3.3-SNAPSHOT.jar to /x1/jenkins/jenkins-slave/workspace/maven-plugins-ITs-m3/maven-gpg-plugin/target/local-repo/org/apache/maven/plugins/maven-compiler-plugin/3.3-SNAPSHOT/maven-compiler-plugin-3.3-SNAPSHOT.jar
[INFO] Installing /x1/jenkins/jenkins-slave/workspace/maven-plugins-ITs-m3/maven-compiler-plugin/pom.xml to /x1/jenkins/jenkins-slave/workspace/maven-plugins-ITs-m3/maven-gpg-plugin/target/local-repo/org/apache/maven/plugins/maven-compiler-plugin/3.3-SNAPSHOT/maven-compiler-plugin-3.3-SNAPSHOT.pom
[INFO] Installing /x1/jenkins/jenkins-slave/workspace/maven-plugins-ITs-m3/maven-dependency-plugin/pom.xml to /x1/jenkins/jenkins-slave/workspace/maven-plugins-ITs-m3/maven-gpg-plugin/target/local-repo/org/apache/maven/plugins/maven-dependency-plugin/2.10-SNAPSHOT/maven-dependency-plugin-2.10-SNAPSHOT.pom
[INFO]                                                                         
[INFO] ------------------------------------------------------------------------
[INFO] Building Apache Maven Plugins Aggregator 1-SNAPSHOT
[INFO] ------------------------------------------------------------------------
[INFO] 
[INFO] --- maven-clean-plugin:2.5:clean (default-clean) @ maven-plugins-aggregator ---
[INFO] Deleting /x1/jenkins/jenkins-slave/workspace/maven-plugins-ITs-m3/target
[INFO] 
[INFO] --- maven-enforcer-plugin:1.3.1:enforce (enforce-bytecode-version) @ maven-plugins-aggregator ---
[INFO] 
[INFO] --- maven-enforcer-plugin:1.3.1:enforce (ban-known-bad-maven-versions) @ maven-plugins-aggregator ---
[INFO] 
[INFO] --- maven-remote-resources-plugin:1.5:process (default) @ maven-plugins-aggregator ---
[INFO] 
[INFO] --- maven-site-plugin:3.3:attach-descriptor (attach-descriptor) @ maven-plugins-aggregator ---
[INFO] 
[INFO] --- maven-install-plugin:2.5.1:install (default-install) @ maven-plugins-aggregator ---
[INFO] Installing /x1/jenkins/jenkins-slave/workspace/maven-plugins-ITs-m3/pom.xml to /home/jenkins/.m2/repository/org/apache/maven/plugins/maven-plugins-aggregator/1-SNAPSHOT/maven-plugins-aggregator-1-SNAPSHOT.pom
[INFO] ------------------------------------------------------------------------
[INFO] Reactor Summary:
[INFO] 
[INFO] Apache Maven Plugins .............................. SUCCESS [9.109s]
[INFO] Apache Maven ACR Plugin ........................... SUCCESS [39.212s]
[INFO] Apache Maven Ant Plugin ........................... SUCCESS [1:14.731s]
[INFO] Apache Maven AntRun Plugin ........................ SUCCESS [52.901s]
[INFO] Apache Maven Eclipse Plugin ....................... SUCCESS [7:04.042s]
[INFO] Apache Maven Assembly Plugin ...................... SUCCESS [10:28.649s]
[INFO] Apache Maven Changelog Plugin ..................... SUCCESS [47.178s]
[INFO] Apache Maven Changes Plugin ....................... SUCCESS [1:01.218s]
[INFO] Apache Maven Checkstyle Plugin .................... SUCCESS [3:06.429s]
[INFO] Apache Maven Clean Plugin ......................... SUCCESS [24.154s]
[INFO] Apache Maven Compiler Plugin ...................... SUCCESS [1:27.782s]
[INFO] Apache Maven Dependency Plugin .................... FAILURE [59.315s]
[INFO] Apache Maven Deploy Plugin ........................ FAILURE [4.001s]
[INFO] Apache Maven DOAP Plugin .......................... FAILURE [8.044s]
[INFO] Apache Maven Documentation Checker Plugin ......... FAILURE [2.461s]
[INFO] Apache Maven EAR Plugin ........................... FAILURE [7.831s]
[INFO] Apache Maven EJB Plugin ........................... FAILURE [6.924s]
[INFO] Apache Maven Help Plugin .......................... FAILURE [5.239s]
[INFO] Apache Maven Install Plugin ....................... FAILURE [4.850s]
[INFO] Apache Maven JAR Plugin ........................... FAILURE [4.564s]
[INFO] Apache Maven Jarsigner Plugin ..................... FAILURE [4.787s]
[INFO] Apache Maven Javadoc Plugin ....................... FAILURE [1:38.834s]
[INFO] Apache Maven Linkcheck Plugin ..................... FAILURE [5.389s]
[INFO] Apache Maven Patch Plugin ......................... FAILURE [1.052s]
[INFO] Apache Maven PDF Plugin ........................... FAILURE [32.222s]
[INFO] Apache Maven RAR Plugin ........................... FAILURE [4.057s]
[INFO] Apache Maven Repository Plugin .................... FAILURE [6.293s]
[INFO] Apache Maven Resources Plugin ..................... FAILURE [5.228s]
[INFO] Apache Maven Site Plugin .......................... FAILURE [30.835s]
[INFO] Apache Maven Source Plugin ........................ FAILURE [5.170s]
[INFO] Apache Maven Stage Plugin ......................... FAILURE [3.700s]
[INFO] Apache Maven Toolchains Plugin .................... FAILURE [5.061s]
[INFO] Apache Maven Verifier Plugin ...................... FAILURE [1.967s]
[INFO] Apache Maven WAR Plugin ........................... FAILURE [16.949s]
[INFO] Apache Maven Invoker Plugin ....................... FAILURE [16.978s]
[INFO] Apache Maven Project Info Reports Plugin .......... FAILURE [29.476s]
[INFO] Apache Maven Remote Resources Plugin .............. FAILURE [9.426s]
[INFO] Apache Maven Shade Plugin ......................... FAILURE [10.098s]
[INFO] Apache Maven SCM Publish Plugin ................... FAILURE [6.683s]
[INFO] Apache Maven GPG Plugin ........................... FAILURE [1.886s]
[INFO] Apache Maven Plugins Aggregator ................... SUCCESS [0.450s]
[INFO] ------------------------------------------------------------------------
[INFO] BUILD FAILURE
[INFO] ------------------------------------------------------------------------
[INFO] Total time: 33:57.341s
[INFO] Finished at: Sat Nov 08 15:12:49 GMT 2014
[INFO] Final Memory: 87M/188M
[INFO] ------------------------------------------------------------------------
[WARNING] The requested profile "apache.snapshots" could not be activated because it does not exist.
[ERROR] Failed to execute goal org.apache.maven.plugins:maven-surefire-plugin:2.16:test (default-test) on project maven-dependency-plugin: There are test failures.
[ERROR] 
[ERROR] Please refer to /x1/jenkins/jenkins-slave/workspace/maven-plugins-ITs-m3/maven-dependency-plugin/target/surefire-reports for the individual test results.
[ERROR] -> [Help 1]
[ERROR] Failed to execute goal org.apache.maven.plugins:maven-invoker-plugin:1.8:install (integration-test) on project maven-deploy-plugin: Failed to install project dependencies: MavenProject: org.apache.maven.plugins:maven-deploy-plugin:2.8.3-SNAPSHOT @ /x1/jenkins/jenkins-slave/workspace/maven-plugins-ITs-m3/maven-deploy-plugin/pom.xml: Failed to install project artifacts: MavenProject: org.apache.maven.plugins:maven-dependency-plugin:2.10-SNAPSHOT @ /x1/jenkins/jenkins-slave/workspace/maven-plugins-ITs-m3/maven-dependency-plugin/pom.xml: Failed to install artifact: org.apache.maven.plugins:maven-dependency-plugin:maven-plugin:2.10-SNAPSHOT: Artifact is not fully assembled: /x1/jenkins/jenkins-slave/workspace/maven-plugins-ITs-m3/maven-dependency-plugin/target/classes -> [Help 2]
[ERROR] Failed to execute goal org.apache.maven.plugins:maven-invoker-plugin:1.8:install (integration-test) on project maven-doap-plugin: Failed to install project dependencies: MavenProject: org.apache.maven.plugins:maven-doap-plugin:1.2-SNAPSHOT @ /x1/jenkins/jenkins-slave/workspace/maven-plugins-ITs-m3/maven-doap-plugin/pom.xml: Failed to install project artifacts: MavenProject: org.apache.maven.plugins:maven-dependency-plugin:2.10-SNAPSHOT @ /x1/jenkins/jenkins-slave/workspace/maven-plugins-ITs-m3/maven-dependency-plugin/pom.xml: Failed to install artifact: org.apache.maven.plugins:maven-dependency-plugin:maven-plugin:2.10-SNAPSHOT: Artifact is not fully assembled: /x1/jenkins/jenkins-slave/workspace/maven-plugins-ITs-m3/maven-dependency-plugin/target/classes -> [Help 2]
[ERROR] Failed to execute goal org.apache.maven.plugins:maven-invoker-plugin:1.8:install (integration-test) on project maven-docck-plugin: Failed to install project dependencies: MavenProject: org.apache.maven.plugins:maven-docck-plugin:1.1-SNAPSHOT @ /x1/jenkins/jenkins-slave/workspace/maven-plugins-ITs-m3/maven-docck-plugin/pom.xml: Failed to install project artifacts: MavenProject: org.apache.maven.plugins:maven-dependency-plugin:2.10-SNAPSHOT @ /x1/jenkins/jenkins-slave/workspace/maven-plugins-ITs-m3/maven-dependency-plugin/pom.xml: Failed to install artifact: org.apache.maven.plugins:maven-dependency-plugin:maven-plugin:2.10-SNAPSHOT: Artifact is not fully assembled: /x1/jenkins/jenkins-slave/workspace/maven-plugins-ITs-m3/maven-dependency-plugin/target/classes -> [Help 2]
[ERROR] Failed to execute goal org.apache.maven.plugins:maven-invoker-plugin:1.9:install (integration-test) on project maven-ear-plugin: Failed to install project dependencies: MavenProject: org.apache.maven.plugins:maven-ear-plugin:2.10-SNAPSHOT @ /x1/jenkins/jenkins-slave/workspace/maven-plugins-ITs-m3/maven-ear-plugin/pom.xml: Failed to install project artifacts: MavenProject: org.apache.maven.plugins:maven-dependency-plugin:2.10-SNAPSHOT @ /x1/jenkins/jenkins-slave/workspace/maven-plugins-ITs-m3/maven-dependency-plugin/pom.xml: Failed to install artifact: org.apache.maven.plugins:maven-dependency-plugin:maven-plugin:2.10-SNAPSHOT: Artifact is not fully assembled: /x1/jenkins/jenkins-slave/workspace/maven-plugins-ITs-m3/maven-dependency-plugin/target/classes -> [Help 2]
[ERROR] Failed to execute goal org.apache.maven.plugins:maven-invoker-plugin:1.8:install (integration-test) on project maven-ejb-plugin: Failed to install project dependencies: MavenProject: org.apache.maven.plugins:maven-ejb-plugin:2.5-SNAPSHOT @ /x1/jenkins/jenkins-slave/workspace/maven-plugins-ITs-m3/maven-ejb-plugin/pom.xml: Failed to install project artifacts: MavenProject: org.apache.maven.plugins:maven-dependency-plugin:2.10-SNAPSHOT @ /x1/jenkins/jenkins-slave/workspace/maven-plugins-ITs-m3/maven-dependency-plugin/pom.xml: Failed to install artifact: org.apache.maven.plugins:maven-dependency-plugin:maven-plugin:2.10-SNAPSHOT: Artifact is not fully assembled: /x1/jenkins/jenkins-slave/workspace/maven-plugins-ITs-m3/maven-dependency-plugin/target/classes -> [Help 2]
[ERROR] Failed to execute goal org.apache.maven.plugins:maven-invoker-plugin:1.8:install (integration-test) on project maven-help-plugin: Failed to install project dependencies: MavenProject: org.apache.maven.plugins:maven-help-plugin:2.2.1-SNAPSHOT @ /x1/jenkins/jenkins-slave/workspace/maven-plugins-ITs-m3/maven-help-plugin/pom.xml: Failed to install project artifacts: MavenProject: org.apache.maven.plugins:maven-dependency-plugin:2.10-SNAPSHOT @ /x1/jenkins/jenkins-slave/workspace/maven-plugins-ITs-m3/maven-dependency-plugin/pom.xml: Failed to install artifact: org.apache.maven.plugins:maven-dependency-plugin:maven-plugin:2.10-SNAPSHOT: Artifact is not fully assembled: /x1/jenkins/jenkins-slave/workspace/maven-plugins-ITs-m3/maven-dependency-plugin/target/classes -> [Help 2]
[ERROR] Failed to execute goal org.apache.maven.plugins:maven-invoker-plugin:1.8:install (integration-test) on project maven-install-plugin: Failed to install project dependencies: MavenProject: org.apache.maven.plugins:maven-install-plugin:2.5.3-SNAPSHOT @ /x1/jenkins/jenkins-slave/workspace/maven-plugins-ITs-m3/maven-install-plugin/pom.xml: Failed to install project artifacts: MavenProject: org.apache.maven.plugins:maven-dependency-plugin:2.10-SNAPSHOT @ /x1/jenkins/jenkins-slave/workspace/maven-plugins-ITs-m3/maven-dependency-plugin/pom.xml: Failed to install artifact: org.apache.maven.plugins:maven-dependency-plugin:maven-plugin:2.10-SNAPSHOT: Artifact is not fully assembled: /x1/jenkins/jenkins-slave/workspace/maven-plugins-ITs-m3/maven-dependency-plugin/target/classes -> [Help 2]
[ERROR] Failed to execute goal org.apache.maven.plugins:maven-invoker-plugin:1.9:install (integration-test) on project maven-jar-plugin: Failed to install project dependencies: MavenProject: org.apache.maven.plugins:maven-jar-plugin:2.6-SNAPSHOT @ /x1/jenkins/jenkins-slave/workspace/maven-plugins-ITs-m3/maven-jar-plugin/pom.xml: Failed to install project artifacts: MavenProject: org.apache.maven.plugins:maven-dependency-plugin:2.10-SNAPSHOT @ /x1/jenkins/jenkins-slave/workspace/maven-plugins-ITs-m3/maven-dependency-plugin/pom.xml: Failed to install artifact: org.apache.maven.plugins:maven-dependency-plugin:maven-plugin:2.10-SNAPSHOT: Artifact is not fully assembled: /x1/jenkins/jenkins-slave/workspace/maven-plugins-ITs-m3/maven-dependency-plugin/target/classes -> [Help 2]
[ERROR] Failed to execute goal org.apache.maven.plugins:maven-invoker-plugin:1.8:install (integration-test) on project maven-jarsigner-plugin: Failed to install project dependencies: MavenProject: org.apache.maven.plugins:maven-jarsigner-plugin:1.4-SNAPSHOT @ /x1/jenkins/jenkins-slave/workspace/maven-plugins-ITs-m3/maven-jarsigner-plugin/pom.xml: Failed to install project artifacts: MavenProject: org.apache.maven.plugins:maven-dependency-plugin:2.10-SNAPSHOT @ /x1/jenkins/jenkins-slave/workspace/maven-plugins-ITs-m3/maven-dependency-plugin/pom.xml: Failed to install artifact: org.apache.maven.plugins:maven-dependency-plugin:maven-plugin:2.10-SNAPSHOT: Artifact is not fully assembled: /x1/jenkins/jenkins-slave/workspace/maven-plugins-ITs-m3/maven-dependency-plugin/target/classes -> [Help 2]
[ERROR] Failed to execute goal org.apache.maven.plugins:maven-invoker-plugin:1.8:install (integration-test) on project maven-javadoc-plugin: Failed to install project dependencies: MavenProject: org.apache.maven.plugins:maven-javadoc-plugin:2.10.2-SNAPSHOT @ /x1/jenkins/jenkins-slave/workspace/maven-plugins-ITs-m3/maven-javadoc-plugin/pom.xml: Failed to install project artifacts: MavenProject: org.apache.maven.plugins:maven-dependency-plugin:2.10-SNAPSHOT @ /x1/jenkins/jenkins-slave/workspace/maven-plugins-ITs-m3/maven-dependency-plugin/pom.xml: Failed to install artifact: org.apache.maven.plugins:maven-dependency-plugin:maven-plugin:2.10-SNAPSHOT: Artifact is not fully assembled: /x1/jenkins/jenkins-slave/workspace/maven-plugins-ITs-m3/maven-dependency-plugin/target/classes -> [Help 2]
[ERROR] Failed to execute goal org.apache.maven.plugins:maven-invoker-plugin:1.8:install (integration-test) on project maven-linkcheck-plugin: Failed to install project dependencies: MavenProject: org.apache.maven.plugins:maven-linkcheck-plugin:1.3-SNAPSHOT @ /x1/jenkins/jenkins-slave/workspace/maven-plugins-ITs-m3/maven-linkcheck-plugin/pom.xml: Failed to install project artifacts: MavenProject: org.apache.maven.plugins:maven-dependency-plugin:2.10-SNAPSHOT @ /x1/jenkins/jenkins-slave/workspace/maven-plugins-ITs-m3/maven-dependency-plugin/pom.xml: Failed to install artifact: org.apache.maven.plugins:maven-dependency-plugin:maven-plugin:2.10-SNAPSHOT: Artifact is not fully assembled: /x1/jenkins/jenkins-slave/workspace/maven-plugins-ITs-m3/maven-dependency-plugin/target/classes -> [Help 2]
[ERROR] Failed to execute goal org.apache.maven.plugins:maven-invoker-plugin:1.8:install (integration-test) on project maven-patch-plugin: Failed to install project dependencies: MavenProject: org.apache.maven.plugins:maven-patch-plugin:1.2-SNAPSHOT @ /x1/jenkins/jenkins-slave/workspace/maven-plugins-ITs-m3/maven-patch-plugin/pom.xml: Failed to install project artifacts: MavenProject: org.apache.maven.plugins:maven-dependency-plugin:2.10-SNAPSHOT @ /x1/jenkins/jenkins-slave/workspace/maven-plugins-ITs-m3/maven-dependency-plugin/pom.xml: Failed to install artifact: org.apache.maven.plugins:maven-dependency-plugin:maven-plugin:2.10-SNAPSHOT: Artifact is not fully assembled: /x1/jenkins/jenkins-slave/workspace/maven-plugins-ITs-m3/maven-dependency-plugin/target/classes -> [Help 2]
[ERROR] Failed to execute goal org.apache.maven.plugins:maven-invoker-plugin:1.8:install (integration-test) on project maven-pdf-plugin: Failed to install project dependencies: MavenProject: org.apache.maven.plugins:maven-pdf-plugin:1.3-SNAPSHOT @ /x1/jenkins/jenkins-slave/workspace/maven-plugins-ITs-m3/maven-pdf-plugin/pom.xml: Failed to install project artifacts: MavenProject: org.apache.maven.plugins:maven-dependency-plugin:2.10-SNAPSHOT @ /x1/jenkins/jenkins-slave/workspace/maven-plugins-ITs-m3/maven-dependency-plugin/pom.xml: Failed to install artifact: org.apache.maven.plugins:maven-dependency-plugin:maven-plugin:2.10-SNAPSHOT: Artifact is not fully assembled: /x1/jenkins/jenkins-slave/workspace/maven-plugins-ITs-m3/maven-dependency-plugin/target/classes -> [Help 2]
[ERROR] Failed to execute goal org.apache.maven.plugins:maven-invoker-plugin:1.8:install (integration-test) on project maven-rar-plugin: Failed to install project dependencies: MavenProject: org.apache.maven.plugins:maven-rar-plugin:2.5-SNAPSHOT @ /x1/jenkins/jenkins-slave/workspace/maven-plugins-ITs-m3/maven-rar-plugin/pom.xml: Failed to install project artifacts: MavenProject: org.apache.maven.plugins:maven-dependency-plugin:2.10-SNAPSHOT @ /x1/jenkins/jenkins-slave/workspace/maven-plugins-ITs-m3/maven-dependency-plugin/pom.xml: Failed to install artifact: org.apache.maven.plugins:maven-dependency-plugin:maven-plugin:2.10-SNAPSHOT: Artifact is not fully assembled: /x1/jenkins/jenkins-slave/workspace/maven-plugins-ITs-m3/maven-dependency-plugin/target/classes -> [Help 2]
[ERROR] Failed to execute goal org.apache.maven.plugins:maven-invoker-plugin:1.8:install (integration-test) on project maven-repository-plugin: Failed to install project dependencies: MavenProject: org.apache.maven.plugins:maven-repository-plugin:2.3.2-SNAPSHOT @ /x1/jenkins/jenkins-slave/workspace/maven-plugins-ITs-m3/maven-repository-plugin/pom.xml: Failed to install project artifacts: MavenProject: org.apache.maven.plugins:maven-dependency-plugin:2.10-SNAPSHOT @ /x1/jenkins/jenkins-slave/workspace/maven-plugins-ITs-m3/maven-dependency-plugin/pom.xml: Failed to install artifact: org.apache.maven.plugins:maven-dependency-plugin:maven-plugin:2.10-SNAPSHOT: Artifact is not fully assembled: /x1/jenkins/jenkins-slave/workspace/maven-plugins-ITs-m3/maven-dependency-plugin/target/classes -> [Help 2]
[ERROR] Failed to execute goal org.apache.maven.plugins:maven-invoker-plugin:1.8:install (integration-test) on project maven-resources-plugin: Failed to install project dependencies: MavenProject: org.apache.maven.plugins:maven-resources-plugin:2.8-SNAPSHOT @ /x1/jenkins/jenkins-slave/workspace/maven-plugins-ITs-m3/maven-resources-plugin/pom.xml: Failed to install project artifacts: MavenProject: org.apache.maven.plugins:maven-dependency-plugin:2.10-SNAPSHOT @ /x1/jenkins/jenkins-slave/workspace/maven-plugins-ITs-m3/maven-dependency-plugin/pom.xml: Failed to install artifact: org.apache.maven.plugins:maven-dependency-plugin:maven-plugin:2.10-SNAPSHOT: Artifact is not fully assembled: /x1/jenkins/jenkins-slave/workspace/maven-plugins-ITs-m3/maven-dependency-plugin/target/classes -> [Help 2]
[ERROR] Failed to execute goal org.apache.maven.plugins:maven-invoker-plugin:1.8:install (integration-test) on project maven-site-plugin: Failed to install project dependencies: MavenProject: org.apache.maven.plugins:maven-site-plugin:3.4.1-SNAPSHOT @ /x1/jenkins/jenkins-slave/workspace/maven-plugins-ITs-m3/maven-site-plugin/dependency-reduced-pom.xml: Failed to install project artifacts: MavenProject: org.apache.maven.plugins:maven-dependency-plugin:2.10-SNAPSHOT @ /x1/jenkins/jenkins-slave/workspace/maven-plugins-ITs-m3/maven-dependency-plugin/pom.xml: Failed to install artifact: org.apache.maven.plugins:maven-dependency-plugin:maven-plugin:2.10-SNAPSHOT: Artifact is not fully assembled: /x1/jenkins/jenkins-slave/workspace/maven-plugins-ITs-m3/maven-dependency-plugin/target/classes -> [Help 2]
[ERROR] Failed to execute goal org.apache.maven.plugins:maven-invoker-plugin:1.9:install (integration-test) on project maven-source-plugin: Failed to install project dependencies: MavenProject: org.apache.maven.plugins:maven-source-plugin:2.5-SNAPSHOT @ /x1/jenkins/jenkins-slave/workspace/maven-plugins-ITs-m3/maven-source-plugin/pom.xml: Failed to install project artifacts: MavenProject: org.apache.maven.plugins:maven-dependency-plugin:2.10-SNAPSHOT @ /x1/jenkins/jenkins-slave/workspace/maven-plugins-ITs-m3/maven-dependency-plugin/pom.xml: Failed to install artifact: org.apache.maven.plugins:maven-dependency-plugin:maven-plugin:2.10-SNAPSHOT: Artifact is not fully assembled: /x1/jenkins/jenkins-slave/workspace/maven-plugins-ITs-m3/maven-dependency-plugin/target/classes -> [Help 2]
[ERROR] Failed to execute goal org.apache.maven.plugins:maven-invoker-plugin:1.8:install (integration-test) on project maven-stage-plugin: Failed to install project dependencies: MavenProject: org.apache.maven.plugins:maven-stage-plugin:1.0-SNAPSHOT @ /x1/jenkins/jenkins-slave/workspace/maven-plugins-ITs-m3/maven-stage-plugin/pom.xml: Failed to install project artifacts: MavenProject: org.apache.maven.plugins:maven-dependency-plugin:2.10-SNAPSHOT @ /x1/jenkins/jenkins-slave/workspace/maven-plugins-ITs-m3/maven-dependency-plugin/pom.xml: Failed to install artifact: org.apache.maven.plugins:maven-dependency-plugin:maven-plugin:2.10-SNAPSHOT: Artifact is not fully assembled: /x1/jenkins/jenkins-slave/workspace/maven-plugins-ITs-m3/maven-dependency-plugin/target/classes -> [Help 2]
[ERROR] Failed to execute goal org.apache.maven.plugins:maven-invoker-plugin:1.9:install (integration-test) on project maven-toolchains-plugin: Failed to install project dependencies: MavenProject: org.apache.maven.plugins:maven-toolchains-plugin:1.1-SNAPSHOT @ /x1/jenkins/jenkins-slave/workspace/maven-plugins-ITs-m3/maven-toolchains-plugin/pom.xml: Failed to install project artifacts: MavenProject: org.apache.maven.plugins:maven-dependency-plugin:2.10-SNAPSHOT @ /x1/jenkins/jenkins-slave/workspace/maven-plugins-ITs-m3/maven-dependency-plugin/pom.xml: Failed to install artifact: org.apache.maven.plugins:maven-dependency-plugin:maven-plugin:2.10-SNAPSHOT: Artifact is not fully assembled: /x1/jenkins/jenkins-slave/workspace/maven-plugins-ITs-m3/maven-dependency-plugin/target/classes -> [Help 2]
[ERROR] Failed to execute goal org.apache.maven.plugins:maven-invoker-plugin:1.8:install (integration-test) on project maven-verifier-plugin: Failed to install project dependencies: MavenProject: org.apache.maven.plugins:maven-verifier-plugin:1.1-SNAPSHOT @ /x1/jenkins/jenkins-slave/workspace/maven-plugins-ITs-m3/maven-verifier-plugin/pom.xml: Failed to install project artifacts: MavenProject: org.apache.maven.plugins:maven-dependency-plugin:2.10-SNAPSHOT @ /x1/jenkins/jenkins-slave/workspace/maven-plugins-ITs-m3/maven-dependency-plugin/pom.xml: Failed to install artifact: org.apache.maven.plugins:maven-dependency-plugin:maven-plugin:2.10-SNAPSHOT: Artifact is not fully assembled: /x1/jenkins/jenkins-slave/workspace/maven-plugins-ITs-m3/maven-dependency-plugin/target/classes -> [Help 2]
[ERROR] Failed to execute goal org.apache.maven.plugins:maven-invoker-plugin:1.9:install (integration-test) on project maven-war-plugin: Failed to install project dependencies: MavenProject: org.apache.maven.plugins:maven-war-plugin:2.6-SNAPSHOT @ /x1/jenkins/jenkins-slave/workspace/maven-plugins-ITs-m3/maven-war-plugin/pom.xml: Failed to install project artifacts: MavenProject: org.apache.maven.plugins:maven-dependency-plugin:2.10-SNAPSHOT @ /x1/jenkins/jenkins-slave/workspace/maven-plugins-ITs-m3/maven-dependency-plugin/pom.xml: Failed to install artifact: org.apache.maven.plugins:maven-dependency-plugin:maven-plugin:2.10-SNAPSHOT: Artifact is not fully assembled: /x1/jenkins/jenkins-slave/workspace/maven-plugins-ITs-m3/maven-dependency-plugin/target/classes -> [Help 2]
[ERROR] Failed to execute goal org.apache.maven.plugins:maven-invoker-plugin:1.8:install (integration-test) on project maven-invoker-plugin: Failed to install project dependencies: MavenProject: org.apache.maven.plugins:maven-invoker-plugin:1.10-SNAPSHOT @ /x1/jenkins/jenkins-slave/workspace/maven-plugins-ITs-m3/maven-invoker-plugin/pom.xml: Failed to install project artifacts: MavenProject: org.apache.maven.plugins:maven-dependency-plugin:2.10-SNAPSHOT @ /x1/jenkins/jenkins-slave/workspace/maven-plugins-ITs-m3/maven-dependency-plugin/pom.xml: Failed to install artifact: org.apache.maven.plugins:maven-dependency-plugin:maven-plugin:2.10-SNAPSHOT: Artifact is not fully assembled: /x1/jenkins/jenkins-slave/workspace/maven-plugins-ITs-m3/maven-dependency-plugin/target/classes -> [Help 2]
[ERROR] Failed to execute goal org.apache.maven.plugins:maven-invoker-plugin:1.8:install (integration-test) on project maven-project-info-reports-plugin: Failed to install project dependencies: MavenProject: org.apache.maven.plugins:maven-project-info-reports-plugin:2.8-SNAPSHOT @ /x1/jenkins/jenkins-slave/workspace/maven-plugins-ITs-m3/maven-project-info-reports-plugin/pom.xml: Failed to install project artifacts: MavenProject: org.apache.maven.plugins:maven-dependency-plugin:2.10-SNAPSHOT @ /x1/jenkins/jenkins-slave/workspace/maven-plugins-ITs-m3/maven-dependency-plugin/pom.xml: Failed to install artifact: org.apache.maven.plugins:maven-dependency-plugin:maven-plugin:2.10-SNAPSHOT: Artifact is not fully assembled: /x1/jenkins/jenkins-slave/workspace/maven-plugins-ITs-m3/maven-dependency-plugin/target/classes -> [Help 2]
[ERROR] Failed to execute goal org.apache.maven.plugins:maven-invoker-plugin:1.8:install (integration-test) on project maven-remote-resources-plugin: Failed to install project dependencies: MavenProject: org.apache.maven.plugins:maven-remote-resources-plugin:1.6-SNAPSHOT @ /x1/jenkins/jenkins-slave/workspace/maven-plugins-ITs-m3/maven-remote-resources-plugin/pom.xml: Failed to install project artifacts: MavenProject: org.apache.maven.plugins:maven-dependency-plugin:2.10-SNAPSHOT @ /x1/jenkins/jenkins-slave/workspace/maven-plugins-ITs-m3/maven-dependency-plugin/pom.xml: Failed to install artifact: org.apache.maven.plugins:maven-dependency-plugin:maven-plugin:2.10-SNAPSHOT: Artifact is not fully assembled: /x1/jenkins/jenkins-slave/workspace/maven-plugins-ITs-m3/maven-dependency-plugin/target/classes -> [Help 2]
[ERROR] Failed to execute goal org.apache.maven.plugins:maven-invoker-plugin:1.8:install (integration-test) on project maven-shade-plugin: Failed to install project dependencies: MavenProject: org.apache.maven.plugins:maven-shade-plugin:2.4-SNAPSHOT @ /x1/jenkins/jenkins-slave/workspace/maven-plugins-ITs-m3/maven-shade-plugin/pom.xml: Failed to install project artifacts: MavenProject: org.apache.maven.plugins:maven-dependency-plugin:2.10-SNAPSHOT @ /x1/jenkins/jenkins-slave/workspace/maven-plugins-ITs-m3/maven-dependency-plugin/pom.xml: Failed to install artifact: org.apache.maven.plugins:maven-dependency-plugin:maven-plugin:2.10-SNAPSHOT: Artifact is not fully assembled: /x1/jenkins/jenkins-slave/workspace/maven-plugins-ITs-m3/maven-dependency-plugin/target/classes -> [Help 2]
[ERROR] Failed to execute goal org.apache.maven.plugins:maven-invoker-plugin:1.8:install (integration-test) on project maven-scm-publish-plugin: Failed to install project dependencies: MavenProject: org.apache.maven.plugins:maven-scm-publish-plugin:1.2-SNAPSHOT @ /x1/jenkins/jenkins-slave/workspace/maven-plugins-ITs-m3/maven-scm-publish-plugin/pom.xml: Failed to install project artifacts: MavenProject: org.apache.maven.plugins:maven-dependency-plugin:2.10-SNAPSHOT @ /x1/jenkins/jenkins-slave/workspace/maven-plugins-ITs-m3/maven-dependency-plugin/pom.xml: Failed to install artifact: org.apache.maven.plugins:maven-dependency-plugin:maven-plugin:2.10-SNAPSHOT: Artifact is not fully assembled: /x1/jenkins/jenkins-slave/workspace/maven-plugins-ITs-m3/maven-dependency-plugin/target/classes -> [Help 2]
[ERROR] Failed to execute goal org.apache.maven.plugins:maven-invoker-plugin:1.8:install (integration-test) on project maven-gpg-plugin: Failed to install project dependencies: MavenProject: org.apache.maven.plugins:maven-gpg-plugin:1.6-SNAPSHOT @ /x1/jenkins/jenkins-slave/workspace/maven-plugins-ITs-m3/maven-gpg-plugin/pom.xml: Failed to install project artifacts: MavenProject: org.apache.maven.plugins:maven-dependency-plugin:2.10-SNAPSHOT @ /x1/jenkins/jenkins-slave/workspace/maven-plugins-ITs-m3/maven-dependency-plugin/pom.xml: Failed to install artifact: org.apache.maven.plugins:maven-dependency-plugin:maven-plugin:2.10-SNAPSHOT: Artifact is not fully assembled: /x1/jenkins/jenkins-slave/workspace/maven-plugins-ITs-m3/maven-dependency-plugin/target/classes -> [Help 2]
[ERROR] 
[ERROR] To see the full stack trace of the errors, re-run Maven with the -e switch.
[ERROR] Re-run Maven using the -X switch to enable full debug logging.
[ERROR] 
[ERROR] For more information about the errors and possible solutions, please read the following articles:
[ERROR] [Help 1] http://cwiki.apache.org/confluence/display/MAVEN/MojoFailureException
[ERROR] [Help 2] http://cwiki.apache.org/confluence/display/MAVEN/MojoExecutionException
[ERROR] 
[ERROR] After correcting the problems, you can resume the build with the command
[ERROR]   mvn <goals> -rf :maven-dependency-plugin
Build step 'Invoke top-level Maven targets' marked build as failure
Recording test results

Mime
View raw message