maven-notifications mailing list archives

Site index · List index
Message view « Date » · « Thread »
Top « Date » · « Thread »
From Apache Jenkins Server <jenk...@builds.apache.org>
Subject Build failed in Jenkins: maven-plugins #2343
Date Thu, 13 Nov 2014 20:40:07 GMT
See <https://builds.apache.org/job/maven-plugins/2343/changes>

Changes:

[krosenvold] [MASSEMBLY-597] Update to p-archiver 2.8.4

------------------------------------------
Started by an SCM change
Building remotely on ubuntu-2 (docker Ubuntu ubuntu) in workspace <https://builds.apache.org/job/maven-plugins/ws/>
Updating http://svn.apache.org/repos/asf/maven/plugins/trunk at revision '2014-11-13T20:39:43.333
+0000'
U         maven-assembly-plugin/src/main/java/org/apache/maven/plugin/assembly/artifact/ResolutionManagementInfo.java
U         maven-assembly-plugin/src/main/java/org/apache/maven/plugin/assembly/artifact/DependencyResolver.java
U         maven-assembly-plugin/src/main/java/org/apache/maven/plugin/assembly/artifact/DefaultDependencyResolver.java
U         maven-assembly-plugin/src/main/java/org/apache/maven/plugin/assembly/utils/LineEndings.java
U         maven-assembly-plugin/src/main/java/org/apache/maven/plugin/assembly/utils/AssemblyFileUtils.java
U         maven-assembly-plugin/src/main/java/org/apache/maven/plugin/assembly/utils/LineEndingsUtils.java
U         maven-assembly-plugin/src/main/java/org/apache/maven/plugin/assembly/utils/WindowsLineFeedInputStream.java
U         maven-assembly-plugin/src/main/java/org/apache/maven/plugin/assembly/utils/FilterUtils.java
U         maven-assembly-plugin/src/main/java/org/apache/maven/plugin/assembly/utils/LinuxLineFeedInputStream.java
U         maven-assembly-plugin/src/main/java/org/apache/maven/plugin/assembly/utils/ProjectUtils.java
U         maven-assembly-plugin/src/main/java/org/apache/maven/plugin/assembly/utils/TypeConversionUtils.java
U         maven-assembly-plugin/src/main/java/org/apache/maven/plugin/assembly/utils/AssemblyFormatUtils.java
U         maven-assembly-plugin/src/main/java/org/apache/maven/plugin/assembly/archive/task/AddArtifactTask.java
U         maven-assembly-plugin/src/main/java/org/apache/maven/plugin/assembly/archive/task/AddDependencySetsTask.java
U         maven-assembly-plugin/src/main/java/org/apache/maven/plugin/assembly/archive/task/AddFileSetsTask.java
U         maven-assembly-plugin/src/main/java/org/apache/maven/plugin/assembly/archive/task/AddDirectoryTask.java
U         maven-assembly-plugin/src/main/java/org/apache/maven/plugin/assembly/archive/AssemblyArchiver.java
U         maven-assembly-plugin/src/main/java/org/apache/maven/plugin/assembly/archive/archiver/AssemblyProxyArchiver.java
U         maven-assembly-plugin/src/main/java/org/apache/maven/plugin/assembly/archive/archiver/PrefixedArchivedFileSet.java
U         maven-assembly-plugin/src/main/java/org/apache/maven/plugin/assembly/archive/archiver/PrefixedFileSet.java
U         maven-assembly-plugin/src/main/java/org/apache/maven/plugin/assembly/archive/ArchiveCreationException.java
U         maven-assembly-plugin/src/main/java/org/apache/maven/plugin/assembly/archive/ArchiveExpansionException.java
U         maven-assembly-plugin/src/main/java/org/apache/maven/plugin/assembly/archive/DefaultAssemblyArchiver.java
U         maven-assembly-plugin/src/main/java/org/apache/maven/plugin/assembly/archive/ManifestCreationFinalizer.java
U         maven-assembly-plugin/src/main/java/org/apache/maven/plugin/assembly/archive/phase/AssemblyArchiverPhase.java
U         maven-assembly-plugin/src/main/java/org/apache/maven/plugin/assembly/archive/phase/DependencySetAssemblyPhase.java
U         maven-assembly-plugin/src/main/java/org/apache/maven/plugin/assembly/archive/phase/AssemblyArchiverPhaseComparator.java
U         maven-assembly-plugin/src/main/java/org/apache/maven/plugin/assembly/archive/phase/FileSetAssemblyPhase.java
U         maven-assembly-plugin/src/main/java/org/apache/maven/plugin/assembly/archive/phase/PhaseOrder.java
U         maven-assembly-plugin/src/main/java/org/apache/maven/plugin/assembly/archive/phase/FileItemAssemblyPhase.java
U         maven-assembly-plugin/src/main/java/org/apache/maven/plugin/assembly/archive/phase/RepositoryAssemblyPhase.java
U         maven-assembly-plugin/src/main/java/org/apache/maven/plugin/assembly/archive/phase/ModuleSetAssemblyPhase.java
U         maven-assembly-plugin/src/main/java/org/apache/maven/plugin/assembly/archive/phase/wrappers/GroupVersionAlignmentWrapper.java
U         maven-assembly-plugin/src/main/java/org/apache/maven/plugin/assembly/archive/phase/wrappers/RepoInfoWrapper.java
U         maven-assembly-plugin/src/main/java/org/apache/maven/plugin/assembly/filter/AbstractLineAggregatingHandler.java
U         maven-assembly-plugin/src/main/java/org/apache/maven/plugin/assembly/filter/ComponentsXmlArchiverFileFilter.java
U         maven-assembly-plugin/src/main/java/org/apache/maven/plugin/assembly/filter/SimpleAggregatingDescriptorHandler.java
U         maven-assembly-plugin/src/main/java/org/apache/maven/plugin/assembly/AssemblerConfigurationSource.java
U         maven-assembly-plugin/src/main/java/org/apache/maven/plugin/assembly/interpolation/AssemblyExpressionEvaluator.java
U         maven-assembly-plugin/src/main/java/org/apache/maven/plugin/assembly/interpolation/AssemblyInterpolator.java
U         maven-assembly-plugin/src/main/java/org/apache/maven/plugin/assembly/io/DefaultAssemblyReader.java
U         maven-assembly-plugin/src/main/java/org/apache/maven/plugin/assembly/mojos/AbstractAssemblyMojo.java
U         maven-assembly-plugin/src/main/java/org/apache/maven/plugin/assembly/mojos/DirectoryInlineMojo.java
U         maven-assembly-plugin/src/main/java/org/apache/maven/plugin/assembly/mojos/DirectorySingleMojo.java
U         maven-assembly-plugin/src/main/java/org/apache/maven/plugin/assembly/mojos/AbstractDirectoryMojo.java
U         maven-assembly-plugin/src/main/java/org/apache/maven/plugin/assembly/mojos/AttachedAssemblyMojo.java
U         maven-assembly-plugin/src/main/java/org/apache/maven/plugin/assembly/mojos/AssemblyMojo.java
U         maven-assembly-plugin/src/main/java/org/apache/maven/plugin/assembly/mojos/UnpackMojo.java
U         maven-assembly-plugin/src/main/java/org/apache/maven/plugin/assembly/format/ReflectionProperties.java
U         maven-assembly-plugin/src/main/java/org/apache/maven/plugin/assembly/format/ReaderFormatter.java
U         maven-assembly-plugin/src/main/java/org/apache/maven/plugin/assembly/functions/MavenProjectConsumer.java
U         maven-assembly-plugin/src/main/java/org/apache/maven/plugin/assembly/functions/MavenProjects.java
U         maven-assembly-plugin/src/main/java/org/apache/maven/plugin/assembly/InvalidAssemblerConfigurationException.java
U         maven-assembly-plugin/src/it/projects/bugs/massembly-732/verify.bsh
U         maven-assembly-plugin/src/test/java/org/apache/maven/plugin/assembly/archive/task/testutils/MockAndControlForAddDependencySetsTask.java
U         maven-assembly-plugin/src/test/java/org/apache/maven/plugin/assembly/archive/phase/DependencySetAssemblyPhaseTest.java
U         maven-assembly-plugin/src/test/java/org/apache/maven/plugin/assembly/io/DefaultAssemblyReaderTest.java
U         maven-assembly-plugin/pom.xml
U         maven-help-plugin/src/main/java/org/apache/maven/plugins/help/ActiveProfilesMojo.java
U         maven-help-plugin/src/main/java/org/apache/maven/plugins/help/DescribeMojo.java
U         maven-help-plugin/src/main/java/org/apache/maven/plugins/help/HelpUtil.java
U         maven-help-plugin/src/main/java/org/apache/maven/plugins/help/ExpressionsMojo.java
U         maven-help-plugin/src/main/java/org/apache/maven/plugins/help/SystemMojo.java
U         maven-help-plugin/src/main/java/org/apache/maven/plugins/help/EvaluateMojo.java
U         maven-help-plugin/pom.xml
U         maven-plugins/pom.xml
U         maven-plugins/site-pom.xml
U         maven-plugins/src/site-docs/apt/index.apt.vm
At revision 1639514
Parsing POMs
Failed to transfer Could not find artifact org.apache.maven:maven-parent:pom:26 in central
(http://repo.maven.apache.org/maven2)
ERROR: Failed to parse POMs
java.io.IOException: remote file operation failed: <https://builds.apache.org/job/maven-plugins/ws/>
at hudson.remoting.Channel@2809bdb1:ubuntu-2
	at hudson.FilePath.act(FilePath.java:916)
	at hudson.FilePath.act(FilePath.java:893)
	at hudson.maven.MavenModuleSetBuild$MavenModuleSetBuildExecution.parsePoms(MavenModuleSetBuild.java:953)
	at hudson.maven.MavenModuleSetBuild$MavenModuleSetBuildExecution.doRun(MavenModuleSetBuild.java:681)
	at hudson.model.AbstractBuild$AbstractBuildExecution.run(AbstractBuild.java:529)
	at hudson.model.Run.execute(Run.java:1706)
	at hudson.maven.MavenModuleSetBuild.run(MavenModuleSetBuild.java:529)
	at hudson.model.ResourceController.execute(ResourceController.java:88)
	at hudson.model.Executor.run(Executor.java:232)
Caused by: hudson.remoting.ProxyException: hudson.maven.MavenModuleSetBuild$MavenExecutionException:
org.apache.maven.project.ProjectBuildingException: Some problems were encountered while processing
the POMs:
[FATAL] Non-resolvable parent POM: Could not find artifact org.apache.maven:maven-parent:pom:26
in central (http://repo.maven.apache.org/maven2) and 'parent.relativePath' points at wrong
local POM @ line 23, column 11

	at hudson.maven.MavenModuleSetBuild$PomParser.invoke(MavenModuleSetBuild.java:1357)
	at hudson.maven.MavenModuleSetBuild$PomParser.invoke(MavenModuleSetBuild.java:1091)
	at hudson.FilePath$FileCallableWrapper.call(FilePath.java:2474)
	at hudson.remoting.UserRequest.perform(UserRequest.java:118)
	at hudson.remoting.UserRequest.perform(UserRequest.java:48)
	at hudson.remoting.Request$2.run(Request.java:328)
	at hudson.remoting.InterceptingExecutorService$1.call(InterceptingExecutorService.java:72)
	at java.util.concurrent.FutureTask.run(FutureTask.java:262)
	at java.util.concurrent.ThreadPoolExecutor.runWorker(ThreadPoolExecutor.java:1145)
	at java.util.concurrent.ThreadPoolExecutor$Worker.run(ThreadPoolExecutor.java:615)
	at java.lang.Thread.run(Thread.java:745)
Caused by: hudson.remoting.ProxyException: org.apache.maven.project.ProjectBuildingException:
Some problems were encountered while processing the POMs:
[FATAL] Non-resolvable parent POM: Could not find artifact org.apache.maven:maven-parent:pom:26
in central (http://repo.maven.apache.org/maven2) and 'parent.relativePath' points at wrong
local POM @ line 23, column 11

	at org.apache.maven.project.DefaultProjectBuilder.build(DefaultProjectBuilder.java:364)
	at hudson.maven.MavenEmbedder.buildProjects(MavenEmbedder.java:361)
	at hudson.maven.MavenEmbedder.readProjects(MavenEmbedder.java:331)
	at hudson.maven.MavenModuleSetBuild$PomParser.invoke(MavenModuleSetBuild.java:1294)
	... 10 more
[WARNINGS] Skipping publisher since build result is FAILURE

Mime
View raw message