maven-notifications mailing list archives

Site index · List index
Message view « Date » · « Thread »
Top « Date » · « Thread »
From Apache Jenkins Server <jenk...@builds.apache.org>
Subject Build failed in Jenkins: maven-archetype-m2 #115
Date Sat, 11 Oct 2014 16:44:57 GMT
See <https://builds.apache.org/job/maven-archetype-m2/115/changes>

Changes:

[hboutemy] fixed errors reported by Checkstyle

------------------------------------------
[...truncated 4572 lines...]
21K downloaded  (asm-tree-4.0.jar)
Downloading: http://repo1.maven.org/maven2/commons-collections/commons-collections/3.2/commons-collections-3.2.jar
154K downloaded  (doxia-core-1.1.2.jar)
Downloading: http://repo1.maven.org/maven2/org/apache/maven/shared/maven-script-interpreter/1.1/maven-script-interpreter-1.1.jar
221K downloaded  (plexus-utils-3.0.1.jar)
20K downloaded  (maven-script-interpreter-1.1.jar)
Downloading: http://repo1.maven.org/maven2/org/ow2/asm/asm/4.0/asm-4.0.jar
Downloading: http://repo1.maven.org/maven2/org/apache/maven/doxia/doxia-site-renderer/1.1.4/doxia-site-renderer-1.1.4.jar
44K downloaded  (asm-4.0.jar)
Downloading: http://repo1.maven.org/maven2/org/ow2/asm/asm-commons/4.0/asm-commons-4.0.jar
49K downloaded  (doxia-site-renderer-1.1.4.jar)
36K downloaded  (asm-commons-4.0.jar)
Downloading: http://repo1.maven.org/maven2/org/apache/maven/doxia/doxia-decoration-model/1.1.4/doxia-decoration-model-1.1.4.jar
Downloading: http://repo1.maven.org/maven2/org/ow2/asm/asm-util/4.0/asm-util-4.0.jar
1184K downloaded  (xercesImpl-2.8.1.jar)
51K downloaded  (doxia-decoration-model-1.1.4.jar)
Downloading: http://repo1.maven.org/maven2/org/codehaus/plexus/plexus-interpolation/1.2/plexus-interpolation-1.2.jar
36K downloaded  (asm-util-4.0.jar)
557K downloaded  (commons-collections-3.2.jar)
Downloading: http://repo1.maven.org/maven2/org/apache/maven/doxia/doxia-module-xhtml/1.1.4/doxia-module-xhtml-1.1.4.jar
35K downloaded  (plexus-interpolation-1.2.jar)
Downloading: http://repo1.maven.org/maven2/org/ow2/asm/asm-analysis/4.0/asm-analysis-4.0.jar
14K downloaded  (doxia-module-xhtml-1.1.4.jar)
19K downloaded  (asm-analysis-4.0.jar)
Downloading: http://repo1.maven.org/maven2/org/apache/maven/doxia/doxia-module-fml/1.1.4/doxia-module-fml-1.1.4.jar
36K downloaded  (doxia-module-fml-1.1.4.jar)
3193K downloaded  (groovy-2.0.1.jar)
[INFO] [invoker:install {execution: integration-test}]
[INFO] Installing <https://builds.apache.org/job/maven-archetype-m2/ws/archetype-models/archetype-catalog/pom.xml>
to <https://builds.apache.org/job/maven-archetype-m2/ws/maven-archetype-plugin/target/local-repo/org/apache/maven/archetype/archetype-catalog/2.3-SNAPSHOT/archetype-catalog-2.3-SNAPSHOT.pom>
[INFO] Installing <https://builds.apache.org/job/maven-archetype-m2/ws/archetype-models/archetype-catalog/target/archetype-catalog-2.3-SNAPSHOT.jar>
to <https://builds.apache.org/job/maven-archetype-m2/ws/maven-archetype-plugin/target/local-repo/org/apache/maven/archetype/archetype-catalog/2.3-SNAPSHOT/archetype-catalog-2.3-SNAPSHOT.jar>
[INFO] Installing <https://builds.apache.org/job/maven-archetype-m2/ws/archetype-models/pom.xml>
to <https://builds.apache.org/job/maven-archetype-m2/ws/maven-archetype-plugin/target/local-repo/org/apache/maven/archetype/archetype-models/2.3-SNAPSHOT/archetype-models-2.3-SNAPSHOT.pom>
[INFO] Installing <https://builds.apache.org/job/maven-archetype-m2/ws/pom.xml> to <https://builds.apache.org/job/maven-archetype-m2/ws/maven-archetype-plugin/target/local-repo/org/apache/maven/archetype/maven-archetype/2.3-SNAPSHOT/maven-archetype-2.3-SNAPSHOT.pom>
[INFO] Installing <https://builds.apache.org/job/maven-archetype-m2/ws/archetype-models/archetype-descriptor/pom.xml>
to <https://builds.apache.org/job/maven-archetype-m2/ws/maven-archetype-plugin/target/local-repo/org/apache/maven/archetype/archetype-descriptor/2.3-SNAPSHOT/archetype-descriptor-2.3-SNAPSHOT.pom>
[INFO] Installing <https://builds.apache.org/job/maven-archetype-m2/ws/archetype-models/archetype-descriptor/target/archetype-descriptor-2.3-SNAPSHOT.jar>
to <https://builds.apache.org/job/maven-archetype-m2/ws/maven-archetype-plugin/target/local-repo/org/apache/maven/archetype/archetype-descriptor/2.3-SNAPSHOT/archetype-descriptor-2.3-SNAPSHOT.jar>
[INFO] Installing <https://builds.apache.org/job/maven-archetype-m2/ws/archetype-models/archetype-registry/pom.xml>
to <https://builds.apache.org/job/maven-archetype-m2/ws/maven-archetype-plugin/target/local-repo/org/apache/maven/archetype/archetype-registry/2.3-SNAPSHOT/archetype-registry-2.3-SNAPSHOT.pom>
[INFO] Installing <https://builds.apache.org/job/maven-archetype-m2/ws/archetype-models/archetype-registry/target/archetype-registry-2.3-SNAPSHOT.jar>
to <https://builds.apache.org/job/maven-archetype-m2/ws/maven-archetype-plugin/target/local-repo/org/apache/maven/archetype/archetype-registry/2.3-SNAPSHOT/archetype-registry-2.3-SNAPSHOT.jar>
[INFO] Installing <https://builds.apache.org/job/maven-archetype-m2/ws/archetype-common/pom.xml>
to <https://builds.apache.org/job/maven-archetype-m2/ws/maven-archetype-plugin/target/local-repo/org/apache/maven/archetype/archetype-common/2.3-SNAPSHOT/archetype-common-2.3-SNAPSHOT.pom>
[INFO] Installing <https://builds.apache.org/job/maven-archetype-m2/ws/archetype-common/target/archetype-common-2.3-SNAPSHOT.jar>
to <https://builds.apache.org/job/maven-archetype-m2/ws/maven-archetype-plugin/target/local-repo/org/apache/maven/archetype/archetype-common/2.3-SNAPSHOT/archetype-common-2.3-SNAPSHOT.jar>
[INFO] Installing <https://builds.apache.org/job/maven-archetype-m2/ws/maven-archetype-plugin/pom.xml>
to <https://builds.apache.org/job/maven-archetype-m2/ws/maven-archetype-plugin/target/local-repo/org/apache/maven/plugins/maven-archetype-plugin/2.3-SNAPSHOT/maven-archetype-plugin-2.3-SNAPSHOT.pom>
[INFO] Installing <https://builds.apache.org/job/maven-archetype-m2/ws/maven-archetype-plugin/target/maven-archetype-plugin-2.3-SNAPSHOT.jar>
to <https://builds.apache.org/job/maven-archetype-m2/ws/maven-archetype-plugin/target/local-repo/org/apache/maven/plugins/maven-archetype-plugin/2.3-SNAPSHOT/maven-archetype-plugin-2.3-SNAPSHOT.jar>
[INFO] [invoker:run {execution: integration-test}]
[INFO] Building: generate-basic
[INFO] run script setup.groovy
[INFO] run script verify.bsh
[INFO] ..SUCCESS (6.0 s)
[INFO] Building: create-from-project/pom.xml
[INFO] run script verify.bsh
[INFO] ..SUCCESS (4.6 s)
[INFO] Building: build-archetype/pom.xml
[INFO] run script verify.bsh
[INFO] ..SUCCESS (8.5 s)
[INFO] Building: property-setting-cli/pom.xml
[INFO] ..SUCCESS (3.4 s)
[INFO] -------------------------------------------------
[INFO] Build Summary:
[INFO]   Passed: 4, Failed: 0, Errors: 0, Skipped: 0
[INFO] -------------------------------------------------
[INFO] [apache-rat:check {execution: rat-check}]
[INFO] 51 implicit excludes (use -debug for more details).
[INFO] Exclude: .gitignore
[INFO] Exclude: DEPENDENCIES
[INFO] Exclude: README.txt
[INFO] Exclude: *.sh
[INFO] Exclude: .git/**
[INFO] Exclude: .idea/**
[INFO] Exclude: **/generated-sources/**
[INFO] Exclude: **/.gitattributes
[INFO] Exclude: archetype-samples/**
[INFO] Exclude: **/*.sha1
[INFO] Exclude: src/main/resources/org/apache/maven/archetype/creator/*
[INFO] Exclude: **/Format.java
[INFO] Exclude: **/NamespaceStack.java
[INFO] Exclude: **/XMLOutputter.java
[INFO] Exclude: src/test/**
[INFO] Exclude: src/it/**
[INFO] Exclude: .repository/**
[INFO] Exclude: .java-version
[INFO] 49 resources included (use -debug for more details)
[INFO] Rat check: Summary of files. Unapproved: 1 unknown: 1 generated: 0 approved: 47 licence.
[INFO] 
[INFO] 
[INFO] ------------------------------------------------------------------------
[INFO] Reactor Summary:
[INFO] ------------------------------------------------------------------------
[INFO] Maven Archetype ....................................... SUCCESS [38.550s]
[INFO] Maven Archetype Testing ............................... SUCCESS [0.152s]
[INFO] Maven Archetype Webapp Proxy .......................... SUCCESS [11.046s]
[INFO] Maven Archetype Webapp Repository ..................... SUCCESS [0.455s]
[INFO] Maven Archetype Models ................................ SUCCESS [0.127s]
[INFO] Maven Archetype Catalog Model ......................... SUCCESS [6.454s]
[INFO] Maven Archetype Descriptor Model ...................... SUCCESS [0.574s]
[INFO] Maven Archetype Registry Model ........................ SUCCESS [0.528s]
[INFO] Maven Archetype Common ................................ SUCCESS [39.909s]
[INFO] Maven Archetype Packaging ............................. SUCCESS [0.270s]
[INFO] Maven Archetype Plugin ................................ FAILED [43.330s]
[INFO] ------------------------------------------------------------------------
[INFO] Error for project: Maven Archetype Plugin (during install)
[INFO] ------------------------------------------------------------------------
[INFO] Too many files with unapproved license: 1 See RAT report in: <https://builds.apache.org/job/maven-archetype-m2/ws/maven-archetype-plugin/target/rat.txt>
[INFO] ------------------------------------------------------------------------
[INFO] Trace
org.apache.maven.BuildFailureException: Too many files with unapproved license: 1 See RAT
report in: <https://builds.apache.org/job/maven-archetype-m2/ws/maven-archetype-plugin/target/rat.txt>
	at org.apache.maven.lifecycle.DefaultLifecycleExecutor.executeGoals(DefaultLifecycleExecutor.java:715)
	at org.apache.maven.lifecycle.DefaultLifecycleExecutor.executeGoalWithLifecycle(DefaultLifecycleExecutor.java:556)
	at org.apache.maven.lifecycle.DefaultLifecycleExecutor.executeGoal(DefaultLifecycleExecutor.java:535)
	at org.apache.maven.lifecycle.DefaultLifecycleExecutor.executeGoalAndHandleFailures(DefaultLifecycleExecutor.java:387)
	at org.apache.maven.lifecycle.DefaultLifecycleExecutor.executeTaskSegments(DefaultLifecycleExecutor.java:348)
	at org.apache.maven.lifecycle.DefaultLifecycleExecutor.execute(DefaultLifecycleExecutor.java:180)
	at org.apache.maven.lifecycle.LifecycleExecutorInterceptor.execute(LifecycleExecutorInterceptor.java:65)
	at org.apache.maven.DefaultMaven.doExecute(DefaultMaven.java:328)
	at org.apache.maven.DefaultMaven.execute(DefaultMaven.java:138)
	at org.apache.maven.cli.MavenCli.main(MavenCli.java:362)
	at sun.reflect.NativeMethodAccessorImpl.invoke0(Native Method)
	at sun.reflect.NativeMethodAccessorImpl.invoke(NativeMethodAccessorImpl.java:39)
	at sun.reflect.DelegatingMethodAccessorImpl.invoke(DelegatingMethodAccessorImpl.java:25)
	at java.lang.reflect.Method.invoke(Method.java:597)
	at org.codehaus.classworlds.Launcher.launchEnhanced(Launcher.java:315)
	at org.codehaus.classworlds.Launcher.launch(Launcher.java:255)
	at hudson.maven.agent.Main.launch(Main.java:205)
	at hudson.maven.MavenBuilder.call(MavenBuilder.java:154)
	at hudson.maven.Maven2Builder.call(Maven2Builder.java:79)
	at hudson.maven.Maven2Builder.call(Maven2Builder.java:55)
	at hudson.remoting.UserRequest.perform(UserRequest.java:118)
	at hudson.remoting.UserRequest.perform(UserRequest.java:48)
	at hudson.remoting.Request$2.run(Request.java:328)
	at hudson.remoting.InterceptingExecutorService$1.call(InterceptingExecutorService.java:72)
	at java.util.concurrent.FutureTask$Sync.innerRun(FutureTask.java:303)
	at java.util.concurrent.FutureTask.run(FutureTask.java:138)
	at java.util.concurrent.ThreadPoolExecutor$Worker.runTask(ThreadPoolExecutor.java:895)
	at java.util.concurrent.ThreadPoolExecutor$Worker.run(ThreadPoolExecutor.java:918)
	at java.lang.Thread.run(Thread.java:662)
Caused by: org.apache.rat.mp.RatCheckException: Too many files with unapproved license: 1
See RAT report in: <https://builds.apache.org/job/maven-archetype-m2/ws/maven-archetype-plugin/target/rat.txt>
	at org.apache.rat.mp.RatCheckMojo.check(RatCheckMojo.java:183)
	at org.apache.rat.mp.RatCheckMojo.execute(RatCheckMojo.java:171)
	at org.apache.maven.plugin.DefaultPluginManager.executeMojo(DefaultPluginManager.java:490)
	at hudson.maven.agent.PluginManagerInterceptor.executeMojo(PluginManagerInterceptor.java:182)
	at org.apache.maven.lifecycle.DefaultLifecycleExecutor.executeGoals(DefaultLifecycleExecutor.java:694)
	... 28 more
[INFO] ------------------------------------------------------------------------
[INFO] BUILD ERRORS
[INFO] ------------------------------------------------------------------------
[INFO] Total time: 2 minutes 35 seconds
[INFO] Finished at: Sat Oct 11 16:44:48 UTC 2014
[INFO] Final Memory: 86M/455M
[INFO] ------------------------------------------------------------------------
[JENKINS] Archiving <https://builds.apache.org/job/maven-archetype-m2/ws/archetype-models/archetype-catalog/pom.xml>
to org.apache.maven.archetype/archetype-catalog/2.3-SNAPSHOT/archetype-catalog-2.3-SNAPSHOT.pom
[JENKINS] Archiving <https://builds.apache.org/job/maven-archetype-m2/ws/archetype-models/archetype-catalog/target/archetype-catalog-2.3-SNAPSHOT.jar>
to org.apache.maven.archetype/archetype-catalog/2.3-SNAPSHOT/archetype-catalog-2.3-SNAPSHOT.jar
Sending artifact delta relative to maven-archetype-m2 » Maven Archetype Catalog Model #114
Archived 2 artifacts
Archive block size is 32768
Received 0 blocks and 24211 bytes
Compression is 0.0%
Took 60 ms
[JENKINS] Archiving <https://builds.apache.org/job/maven-archetype-m2/ws/archetype-testing/archetype-repository/pom.xml>
to org.apache.maven.archetype/archetype-repository/2.3-SNAPSHOT/archetype-repository-2.3-SNAPSHOT.pom
[JENKINS] Archiving <https://builds.apache.org/job/maven-archetype-m2/ws/archetype-testing/archetype-repository/target/archetype-repository-2.3-SNAPSHOT.war>
to org.apache.maven.archetype/archetype-repository/2.3-SNAPSHOT/archetype-repository-2.3-SNAPSHOT.war
Sending artifact delta relative to maven-archetype-m2 » Maven Archetype Webapp Repository
#114
Archived 2 artifacts
Archive block size is 32768
Received 4 blocks and 42347 bytes
Compression is 75.6%
Took 0.1 sec
[JENKINS] Archiving <https://builds.apache.org/job/maven-archetype-m2/ws/.repository/org/apache/maven/archetype/archetype-testing/2.3-SNAPSHOT/archetype-testing-2.3-SNAPSHOT.pom>
to org.apache.maven.archetype/archetype-testing/2.3-SNAPSHOT/archetype-testing-2.3-SNAPSHOT.pom
[JENKINS] Archiving <https://builds.apache.org/job/maven-archetype-m2/ws/archetype-testing/target/archetype-testing-2.3-SNAPSHOT-site.xml>
to org.apache.maven.archetype/archetype-testing/2.3-SNAPSHOT/archetype-testing-2.3-SNAPSHOT-site.xml
<https://builds.apache.org/job/maven-archetype-m2/ws/.repository/org/apache/maven/archetype/archetype-testing/2.3-SNAPSHOT/archetype-testing-2.3-SNAPSHOT.pom>
is not inside <https://builds.apache.org/job/maven-archetype-m2/ws/archetype-testing/;>
will archive in a separate pass
Sending artifact delta relative to maven-archetype-m2 » Maven Archetype Testing #114
Archived 1 artifacts
Archive block size is 32768
Received 0 blocks and 1212 bytes
Compression is 0.0%
Took 44 ms
Sending artifact delta relative to maven-archetype-m2 » Maven Archetype Testing #114
Archived 1 artifacts
Archive block size is 32768
Received 0 blocks and 1604 bytes
Compression is 0.0%
Took 36 ms
[JENKINS] Archiving <https://builds.apache.org/job/maven-archetype-m2/ws/.repository/org/apache/maven/archetype/maven-archetype/2.3-SNAPSHOT/maven-archetype-2.3-SNAPSHOT.pom>
to org.apache.maven.archetype/maven-archetype/2.3-SNAPSHOT/maven-archetype-2.3-SNAPSHOT.pom
[JENKINS] Archiving <https://builds.apache.org/job/maven-archetype-m2/ws/target/maven-archetype-2.3-SNAPSHOT-site.xml>
to org.apache.maven.archetype/maven-archetype/2.3-SNAPSHOT/maven-archetype-2.3-SNAPSHOT-site.xml
Sending artifact delta relative to maven-archetype-m2 » Maven Archetype #114
Archived 2 artifacts
Archive block size is 32768
Received 0 blocks and 13545 bytes
Compression is 0.0%
Took 52 ms
[JENKINS] Archiving <https://builds.apache.org/job/maven-archetype-m2/ws/archetype-models/archetype-descriptor/pom.xml>
to org.apache.maven.archetype/archetype-descriptor/2.3-SNAPSHOT/archetype-descriptor-2.3-SNAPSHOT.pom
[JENKINS] Archiving <https://builds.apache.org/job/maven-archetype-m2/ws/archetype-models/archetype-descriptor/target/archetype-descriptor-2.3-SNAPSHOT.jar>
to org.apache.maven.archetype/archetype-descriptor/2.3-SNAPSHOT/archetype-descriptor-2.3-SNAPSHOT.jar
Sending artifact delta relative to maven-archetype-m2 » Maven Archetype Descriptor Model
#114
Archived 2 artifacts
Archive block size is 32768
Received 0 blocks and 28675 bytes
Compression is 0.0%
Took 40 ms
[JENKINS] Archiving <https://builds.apache.org/job/maven-archetype-m2/ws/archetype-testing/archetype-proxy/pom.xml>
to org.apache.maven.archetype/archetype-proxy/2.3-SNAPSHOT/archetype-proxy-2.3-SNAPSHOT.pom
[JENKINS] Archiving <https://builds.apache.org/job/maven-archetype-m2/ws/archetype-testing/archetype-proxy/target/archetype-proxy-2.3-SNAPSHOT.war>
to org.apache.maven.archetype/archetype-proxy/2.3-SNAPSHOT/archetype-proxy-2.3-SNAPSHOT.war
Sending artifact delta relative to maven-archetype-m2 » Maven Archetype Webapp Proxy #114
Archived 2 artifacts
Archive block size is 32768
Received 4 blocks and 38547 bytes
Compression is 77.3%
Took 1.5 sec
[JENKINS] Archiving <https://builds.apache.org/job/maven-archetype-m2/ws/archetype-models/archetype-registry/pom.xml>
to org.apache.maven.archetype/archetype-registry/2.3-SNAPSHOT/archetype-registry-2.3-SNAPSHOT.pom
[JENKINS] Archiving <https://builds.apache.org/job/maven-archetype-m2/ws/archetype-models/archetype-registry/target/archetype-registry-2.3-SNAPSHOT.jar>
to org.apache.maven.archetype/archetype-registry/2.3-SNAPSHOT/archetype-registry-2.3-SNAPSHOT.jar
Sending artifact delta relative to maven-archetype-m2 » Maven Archetype Registry Model #114
Archived 2 artifacts
Archive block size is 32768
Received 0 blocks and 22278 bytes
Compression is 0.0%
Took 67 ms
[JENKINS] Archiving <https://builds.apache.org/job/maven-archetype-m2/ws/.repository/org/apache/maven/archetype/archetype-models/2.3-SNAPSHOT/archetype-models-2.3-SNAPSHOT.pom>
to org.apache.maven.archetype/archetype-models/2.3-SNAPSHOT/archetype-models-2.3-SNAPSHOT.pom
[JENKINS] Archiving <https://builds.apache.org/job/maven-archetype-m2/ws/archetype-models/target/archetype-models-2.3-SNAPSHOT-site.xml>
to org.apache.maven.archetype/archetype-models/2.3-SNAPSHOT/archetype-models-2.3-SNAPSHOT-site.xml
<https://builds.apache.org/job/maven-archetype-m2/ws/.repository/org/apache/maven/archetype/archetype-models/2.3-SNAPSHOT/archetype-models-2.3-SNAPSHOT.pom>
is not inside <https://builds.apache.org/job/maven-archetype-m2/ws/archetype-models/;>
will archive in a separate pass
Sending artifact delta relative to maven-archetype-m2 » Maven Archetype Models #114
Archived 1 artifacts
Archive block size is 32768
Received 0 blocks and 1619 bytes
Compression is 0.0%
Took 55 ms
Sending artifact delta relative to maven-archetype-m2 » Maven Archetype Models #114
Archived 1 artifacts
Archive block size is 32768
Received 0 blocks and 2848 bytes
Compression is 0.0%
Took 55 ms
[JENKINS] Archiving <https://builds.apache.org/job/maven-archetype-m2/ws/archetype-packaging/pom.xml>
to org.apache.maven.archetype/archetype-packaging/2.3-SNAPSHOT/archetype-packaging-2.3-SNAPSHOT.pom
[JENKINS] Archiving <https://builds.apache.org/job/maven-archetype-m2/ws/archetype-packaging/target/archetype-packaging-2.3-SNAPSHOT.jar>
to org.apache.maven.archetype/archetype-packaging/2.3-SNAPSHOT/archetype-packaging-2.3-SNAPSHOT.jar
Sending artifact delta relative to maven-archetype-m2 » Maven Archetype Packaging #114
Archived 2 artifacts
Archive block size is 32768
Received 0 blocks and 9271 bytes
Compression is 0.0%
Took 49 ms
[JENKINS] Archiving <https://builds.apache.org/job/maven-archetype-m2/ws/maven-archetype-plugin/pom.xml>
to org.apache.maven.plugins/maven-archetype-plugin/2.3-SNAPSHOT/maven-archetype-plugin-2.3-SNAPSHOT.pom
[JENKINS] Archiving <https://builds.apache.org/job/maven-archetype-m2/ws/maven-archetype-plugin/target/maven-archetype-plugin-2.3-SNAPSHOT.jar>
to org.apache.maven.plugins/maven-archetype-plugin/2.3-SNAPSHOT/maven-archetype-plugin-2.3-SNAPSHOT.jar
Sending artifact delta relative to maven-archetype-m2 » Maven Archetype Plugin #114
Archived 2 artifacts
Archive block size is 32768
Received 0 blocks and 98645 bytes
Compression is 0.0%
Took 0.1 sec
[JENKINS] Archiving <https://builds.apache.org/job/maven-archetype-m2/ws/archetype-common/pom.xml>
to org.apache.maven.archetype/archetype-common/2.3-SNAPSHOT/archetype-common-2.3-SNAPSHOT.pom
[JENKINS] Archiving <https://builds.apache.org/job/maven-archetype-m2/ws/archetype-common/target/archetype-common-2.3-SNAPSHOT.jar>
to org.apache.maven.archetype/archetype-common/2.3-SNAPSHOT/archetype-common-2.3-SNAPSHOT.jar
Sending artifact delta relative to maven-archetype-m2 » Maven Archetype Common #114
Archived 2 artifacts
Archive block size is 32768
Received 0 blocks and 192085 bytes
Compression is 0.0%
Took 0.16 sec
Sending e-mails to: notifications@maven.apache.org hboutemy@apache.org
channel stopped

Mime
View raw message