maven-notifications mailing list archives

Site index · List index
Message view « Date » · « Thread »
Top « Date » · « Thread »
From Apache Jenkins Server <jenk...@builds.apache.org>
Subject Build failed in Jenkins: maven-plugins-windows #776
Date Wed, 22 Oct 2014 05:33:25 GMT
See <https://builds.apache.org/job/maven-plugins-windows/776/changes>

Changes:

[krosenvold] I am a klutz

[krosenvold] Added missing files, because I have forgotten how to use SVN

Removed some unused code

------------------------------------------
Started by an SCM change
Building remotely on windows1 (Windows) in workspace <https://builds.apache.org/job/maven-plugins-windows/ws/>
Updating http://svn.apache.org/repos/asf/maven/plugins/trunk at revision '2014-10-22T06:24:46.522
+0100'
D         maven-assembly-plugin\src\test\java\org\apache\maven\plugin\assembly\format\FileSetFormatterTest.java
A         maven-assembly-plugin\src\test\java\org\apache\maven\plugin\assembly\utils\WindowsLineFeedInputStreamTest.java
A         maven-assembly-plugin\src\test\java\org\apache\maven\plugin\assembly\utils\LinuxLineFeedInputStreamTest.java
A         maven-assembly-plugin\src\main\java\org\apache\maven\plugin\assembly\utils\LinuxLineFeedInputStream.java
A         maven-assembly-plugin\src\main\java\org\apache\maven\plugin\assembly\utils\WindowsLineFeedInputStream.java
U         maven-assembly-plugin\src\main\java\org\apache\maven\plugin\assembly\archive\task\AddFileSetsTask.java
D         maven-assembly-plugin\src\main\java\org\apache\maven\plugin\assembly\format\FileSetFormatter.java
U         maven-assembly-plugin\src\main\java\org\apache\maven\plugin\assembly\format\FileFormatter.java
At revision 1633529
Parsing POMs
Failed to transfer Could not find artifact org.apache.maven:maven-parent:pom:25 in central
(http://repo.maven.apache.org/maven2)
ERROR: Failed to parse POMs
java.io.IOException: remote file operation failed: <https://builds.apache.org/job/maven-plugins-windows/ws/>
at hudson.remoting.Channel@6f62bea8:windows1
	at hudson.FilePath.act(FilePath.java:910)
	at hudson.FilePath.act(FilePath.java:887)
	at hudson.maven.MavenModuleSetBuild$MavenModuleSetBuildExecution.parsePoms(MavenModuleSetBuild.java:953)
	at hudson.maven.MavenModuleSetBuild$MavenModuleSetBuildExecution.doRun(MavenModuleSetBuild.java:681)
	at hudson.model.AbstractBuild$AbstractBuildExecution.run(AbstractBuild.java:585)
	at hudson.model.Run.execute(Run.java:1676)
	at hudson.maven.MavenModuleSetBuild.run(MavenModuleSetBuild.java:529)
	at hudson.model.ResourceController.execute(ResourceController.java:88)
	at hudson.model.Executor.run(Executor.java:231)
Caused by: hudson.remoting.ProxyException: hudson.maven.MavenModuleSetBuild$MavenExecutionException:
org.apache.maven.project.ProjectBuildingException: Some problems were encountered while processing
the POMs:
[FATAL] Non-resolvable parent POM: Could not find artifact org.apache.maven:maven-parent:pom:25
in central (http://repo.maven.apache.org/maven2) and 'parent.relativePath' points at wrong
local POM @ line 23, column 11

	at hudson.maven.MavenModuleSetBuild$PomParser.invoke(MavenModuleSetBuild.java:1357)
	at hudson.maven.MavenModuleSetBuild$PomParser.invoke(MavenModuleSetBuild.java:1091)
	at hudson.FilePath$FileCallableWrapper.call(FilePath.java:2462)
	at hudson.remoting.UserRequest.perform(UserRequest.java:118)
	at hudson.remoting.UserRequest.perform(UserRequest.java:48)
	at hudson.remoting.Request$2.run(Request.java:328)
	at hudson.remoting.InterceptingExecutorService$1.call(InterceptingExecutorService.java:72)
	at java.util.concurrent.FutureTask$Sync.innerRun(Unknown Source)
	at java.util.concurrent.FutureTask.run(Unknown Source)
	at java.util.concurrent.ThreadPoolExecutor.runWorker(Unknown Source)
	at java.util.concurrent.ThreadPoolExecutor$Worker.run(Unknown Source)
	at hudson.remoting.Engine$1$1.run(Engine.java:63)
	at java.lang.Thread.run(Unknown Source)
Caused by: hudson.remoting.ProxyException: org.apache.maven.project.ProjectBuildingException:
Some problems were encountered while processing the POMs:
[FATAL] Non-resolvable parent POM: Could not find artifact org.apache.maven:maven-parent:pom:25
in central (http://repo.maven.apache.org/maven2) and 'parent.relativePath' points at wrong
local POM @ line 23, column 11

	at org.apache.maven.project.DefaultProjectBuilder.build(DefaultProjectBuilder.java:364)
	at hudson.maven.MavenEmbedder.buildProjects(MavenEmbedder.java:361)
	at hudson.maven.MavenEmbedder.readProjects(MavenEmbedder.java:331)
	at hudson.maven.MavenModuleSetBuild$PomParser.invoke(MavenModuleSetBuild.java:1294)
	... 12 more
[WARNINGS] Skipping publisher since build result is FAILURE

Mime
View raw message